qpid-notifications mailing list archives

Site index · List index
Message view « Date » · « Thread »
Top « Date » · « Thread »
From Apache Jenkins Server <jenk...@builds.apache.org>
Subject Build failed in Jenkins: Qpid-cpp-JMS-AMQP-0-x-Test #4035
Date Wed, 12 Jul 2017 11:31:30 GMT
See <https://builds.apache.org/job/Qpid-cpp-JMS-AMQP-0-x-Test/4035/display/redirect?page=changes>

Changes:

[keith.wall] QPID-7858 [Java Broker] Bump com.fasterxml.jackson dependency from 2.5

------------------------------------------
[...truncated 516.96 KB...]
Tests run: 5, Failures: 0, Errors: 0, Skipped: 0, Time elapsed: 0.554 sec - in org.apache.qpid.test.unit.topic.TemporaryTopicTest
Running org.apache.qpid.test.unit.topic.DurableSubscriptionTest
Tests run: 19, Failures: 0, Errors: 0, Skipped: 0, Time elapsed: 32.316 sec - in org.apache.qpid.test.unit.topic.DurableSubscriptionTest
Running org.apache.qpid.test.unit.topic.TopicSubscriberTest
Tests run: 3, Failures: 0, Errors: 0, Skipped: 0, Time elapsed: 0.384 sec - in org.apache.qpid.test.unit.topic.TopicSubscriberTest
Running org.apache.qpid.test.unit.topic.TopicSessionTest
Tests run: 9, Failures: 0, Errors: 0, Skipped: 0, Time elapsed: 10.851 sec - in org.apache.qpid.test.unit.topic.TopicSessionTest
Running org.apache.qpid.test.unit.topic.TopicPublisherTest
Tests run: 1, Failures: 0, Errors: 0, Skipped: 0, Time elapsed: 0.117 sec - in org.apache.qpid.test.unit.topic.TopicPublisherTest
Running org.apache.qpid.test.unit.message.ForeignMessageTest
Tests run: 1, Failures: 0, Errors: 0, Skipped: 0, Time elapsed: 0.173 sec - in org.apache.qpid.test.unit.message.ForeignMessageTest
Running org.apache.qpid.test.unit.message.JMSPropertiesTest
Tests run: 2, Failures: 0, Errors: 0, Skipped: 0, Time elapsed: 0.259 sec - in org.apache.qpid.test.unit.message.JMSPropertiesTest
Running org.apache.qpid.test.unit.message.StreamMessageTest
Tests run: 2, Failures: 0, Errors: 0, Skipped: 0, Time elapsed: 0.306 sec - in org.apache.qpid.test.unit.message.StreamMessageTest
Running org.apache.qpid.test.unit.message.UTF8Test
Tests run: 2, Failures: 0, Errors: 0, Skipped: 0, Time elapsed: 0.243 sec - in org.apache.qpid.test.unit.message.UTF8Test
Running org.apache.qpid.test.unit.message.JMSHeaderTest
Tests run: 1, Failures: 0, Errors: 0, Skipped: 0, Time elapsed: 0.094 sec - in org.apache.qpid.test.unit.message.JMSHeaderTest
Running org.apache.qpid.test.unit.ack.Acknowledge2ConsumersTest
Tests run: 3, Failures: 0, Errors: 0, Skipped: 0, Time elapsed: 10.81 sec - in org.apache.qpid.test.unit.ack.Acknowledge2ConsumersTest
Running org.apache.qpid.test.unit.ack.AcknowledgeOnMessageTest
Tests run: 6, Failures: 0, Errors: 0, Skipped: 0, Time elapsed: 1.039 sec - in org.apache.qpid.test.unit.ack.AcknowledgeOnMessageTest
Running org.apache.qpid.test.unit.ack.RecoverTest
Tests run: 7, Failures: 0, Errors: 0, Skipped: 0, Time elapsed: 2.927 sec - in org.apache.qpid.test.unit.ack.RecoverTest
Running org.apache.qpid.test.unit.ack.AcknowledgeTest
Tests run: 6, Failures: 0, Errors: 0, Skipped: 0, Time elapsed: 7.226 sec - in org.apache.qpid.test.unit.ack.AcknowledgeTest
Running org.apache.qpid.test.unit.ack.ClientAcknowledgeTest
Tests run: 1, Failures: 0, Errors: 0, Skipped: 0, Time elapsed: 0.005 sec - in org.apache.qpid.test.unit.ack.ClientAcknowledgeTest
Running org.apache.qpid.test.unit.transacted.TransactionTimeoutTest
Tests run: 15, Failures: 0, Errors: 0, Skipped: 0, Time elapsed: 0.029 sec - in org.apache.qpid.test.unit.transacted.TransactionTimeoutTest
Running org.apache.qpid.test.unit.transacted.CommitRollbackTest
Tests run: 13, Failures: 0, Errors: 0, Skipped: 0, Time elapsed: 11.903 sec - in org.apache.qpid.test.unit.transacted.CommitRollbackTest
Running org.apache.qpid.test.unit.transacted.TransactionTimeoutDisabledTest
Tests run: 2, Failures: 0, Errors: 0, Skipped: 0, Time elapsed: 0.003 sec - in org.apache.qpid.test.unit.transacted.TransactionTimeoutDisabledTest
Running org.apache.qpid.test.unit.transacted.TransactedTest
Tests run: 7, Failures: 0, Errors: 0, Skipped: 0, Time elapsed: 9.056 sec - in org.apache.qpid.test.unit.transacted.TransactedTest
Running org.apache.qpid.test.unit.close.JavaServerCloseRaceConditionTest
Tests run: 1, Failures: 0, Errors: 0, Skipped: 0, Time elapsed: 0.001 sec - in org.apache.qpid.test.unit.close.JavaServerCloseRaceConditionTest
Running org.apache.qpid.test.unit.close.MessageConsumerCloseTest
Tests run: 4, Failures: 0, Errors: 0, Skipped: 0, Time elapsed: 0.695 sec - in org.apache.qpid.test.unit.close.MessageConsumerCloseTest
Running org.apache.qpid.test.unit.close.TopicPublisherCloseTest
Tests run: 1, Failures: 0, Errors: 0, Skipped: 0, Time elapsed: 0.1 sec - in org.apache.qpid.test.unit.close.TopicPublisherCloseTest
Running org.apache.qpid.test.unit.ct.DurableSubscriberTest
Tests run: 4, Failures: 0, Errors: 0, Skipped: 0, Time elapsed: 0.008 sec - in org.apache.qpid.test.unit.ct.DurableSubscriberTest
Running org.apache.qpid.test.unit.client.temporaryqueue.TemporaryQueueTest
Tests run: 6, Failures: 0, Errors: 0, Skipped: 0, Time elapsed: 0.598 sec - in org.apache.qpid.test.unit.client.temporaryqueue.TemporaryQueueTest
Running org.apache.qpid.test.unit.client.TopicSessionFactoryTest
Tests run: 4, Failures: 0, Errors: 0, Skipped: 0, Time elapsed: 0.349 sec - in org.apache.qpid.test.unit.client.TopicSessionFactoryTest
Running org.apache.qpid.test.unit.client.message.ObjectMessageTest
Tests run: 9, Failures: 0, Errors: 0, Skipped: 0, Time elapsed: 1.09 sec - in org.apache.qpid.test.unit.client.message.ObjectMessageTest
Running org.apache.qpid.test.unit.client.MaxDeliveryCountTest
Tests run: 7, Failures: 0, Errors: 0, Skipped: 0, Time elapsed: 0.017 sec - in org.apache.qpid.test.unit.client.MaxDeliveryCountTest
Running org.apache.qpid.test.unit.client.AMQSessionTest
Tests run: 3, Failures: 0, Errors: 0, Skipped: 0, Time elapsed: 0.216 sec - in org.apache.qpid.test.unit.client.AMQSessionTest
Running org.apache.qpid.test.unit.client.DynamicQueueExchangeCreateTest
Tests run: 9, Failures: 0, Errors: 0, Skipped: 0, Time elapsed: 0.02 sec - in org.apache.qpid.test.unit.client.DynamicQueueExchangeCreateTest
Running org.apache.qpid.test.unit.client.QueueSessionFactoryTest
Tests run: 5, Failures: 0, Errors: 0, Skipped: 0, Time elapsed: 0.42 sec - in org.apache.qpid.test.unit.client.QueueSessionFactoryTest
Running org.apache.qpid.test.unit.client.channelclose.CloseWithBlockingReceiveTest
Tests run: 1, Failures: 0, Errors: 0, Skipped: 0, Time elapsed: 1.115 sec - in org.apache.qpid.test.unit.client.channelclose.CloseWithBlockingReceiveTest
Running org.apache.qpid.test.unit.client.connection.ConnectionFactoryTest
Tests run: 2, Failures: 0, Errors: 0, Skipped: 0, Time elapsed: 0.18 sec - in org.apache.qpid.test.unit.client.connection.ConnectionFactoryTest
Running org.apache.qpid.test.unit.client.connection.ConnectionTest
Tests run: 13, Failures: 0, Errors: 0, Skipped: 0, Time elapsed: 0.867 sec - in org.apache.qpid.test.unit.client.connection.ConnectionTest
Running org.apache.qpid.test.unit.client.connection.BrokerClosesClientConnectionTest
Tests run: 4, Failures: 0, Errors: 0, Skipped: 0, Time elapsed: 22.431 sec - in org.apache.qpid.test.unit.client.connection.BrokerClosesClientConnectionTest
Running org.apache.qpid.test.unit.client.connection.ConnectionStartTest
Tests run: 2, Failures: 0, Errors: 0, Skipped: 0, Time elapsed: 1.291 sec - in org.apache.qpid.test.unit.client.connection.ConnectionStartTest
Running org.apache.qpid.test.unit.client.connection.ExceptionListenerTest
Tests run: 4, Failures: 0, Errors: 0, Skipped: 0, Time elapsed: 0.257 sec - in org.apache.qpid.test.unit.client.connection.ExceptionListenerTest
Running org.apache.qpid.test.unit.basic.BytesMessageTest
Tests run: 2, Failures: 0, Errors: 0, Skipped: 0, Time elapsed: 0.572 sec - in org.apache.qpid.test.unit.basic.BytesMessageTest
Running org.apache.qpid.test.unit.basic.TextMessageTest
Tests run: 1, Failures: 0, Errors: 0, Skipped: 0, Time elapsed: 0.343 sec - in org.apache.qpid.test.unit.basic.TextMessageTest
Running org.apache.qpid.test.unit.basic.close.CloseTest
Tests run: 1, Failures: 0, Errors: 0, Skipped: 0, Time elapsed: 0.108 sec - in org.apache.qpid.test.unit.basic.close.CloseTest
Running org.apache.qpid.test.unit.basic.PubSubTwoConnectionTest
Tests run: 1, Failures: 0, Errors: 0, Skipped: 0, Time elapsed: 0.122 sec - in org.apache.qpid.test.unit.basic.PubSubTwoConnectionTest
Running org.apache.qpid.test.unit.basic.ObjectMessageTest
Tests run: 1, Failures: 0, Errors: 0, Skipped: 0, Time elapsed: 0.388 sec - in org.apache.qpid.test.unit.basic.ObjectMessageTest
Running org.apache.qpid.test.unit.basic.SessionStartTest
Tests run: 1, Failures: 0, Errors: 0, Skipped: 0, Time elapsed: 0.126 sec - in org.apache.qpid.test.unit.basic.SessionStartTest
Running org.apache.qpid.test.unit.basic.PropertyValueTest
Tests run: 8, Failures: 0, Errors: 0, Skipped: 0, Time elapsed: 3.143 sec - in org.apache.qpid.test.unit.basic.PropertyValueTest
Running org.apache.qpid.test.unit.basic.LargeMessageTest
Tests run: 10, Failures: 0, Errors: 0, Skipped: 0, Time elapsed: 1.386 sec - in org.apache.qpid.test.unit.basic.LargeMessageTest
Running org.apache.qpid.test.unit.basic.InvalidDestinationTest
Tests run: 3, Failures: 0, Errors: 0, Skipped: 0, Time elapsed: 0.267 sec - in org.apache.qpid.test.unit.basic.InvalidDestinationTest
Running org.apache.qpid.test.unit.basic.MapMessageTest
Tests run: 1, Failures: 0, Errors: 0, Skipped: 0, Time elapsed: 0.442 sec - in org.apache.qpid.test.unit.basic.MapMessageTest
Running org.apache.qpid.test.unit.basic.MultipleConnectionTest
Tests run: 1, Failures: 0, Errors: 0, Skipped: 0, Time elapsed: 0.785 sec - in org.apache.qpid.test.unit.basic.MultipleConnectionTest
Running org.apache.qpid.test.unit.basic.FieldTableMessageTest
Tests run: 1, Failures: 0, Errors: 0, Skipped: 0, Time elapsed: 0.175 sec - in org.apache.qpid.test.unit.basic.FieldTableMessageTest
Running org.apache.qpid.client.prefetch.PrefetchBehaviourTest
Tests run: 4, Failures: 0, Errors: 0, Skipped: 0, Time elapsed: 5.529 sec - in org.apache.qpid.client.prefetch.PrefetchBehaviourTest
Running org.apache.qpid.client.session.QueueDeleteTest
Tests run: 2, Failures: 0, Errors: 0, Skipped: 0, Time elapsed: 0.211 sec - in org.apache.qpid.client.session.QueueDeleteTest
Running org.apache.qpid.client.session.QueueDeclareTest
Tests run: 3, Failures: 0, Errors: 0, Skipped: 0, Time elapsed: 0.361 sec - in org.apache.qpid.client.session.QueueDeclareTest
Running org.apache.qpid.client.session.ExchangeDeleteTest
Tests run: 2, Failures: 0, Errors: 0, Skipped: 0, Time elapsed: 0.192 sec - in org.apache.qpid.client.session.ExchangeDeleteTest
Running org.apache.qpid.client.AsynchMessageListenerTest
Tests run: 9, Failures: 0, Errors: 0, Skipped: 0, Time elapsed: 1.86 sec - in org.apache.qpid.client.AsynchMessageListenerTest
Running org.apache.qpid.client.message.AMQPEncodedMapMessageTest
Tests run: 6, Failures: 0, Errors: 0, Skipped: 0, Time elapsed: 0.646 sec - in org.apache.qpid.client.message.AMQPEncodedMapMessageTest
Running org.apache.qpid.client.message.ObjectMessageClassWhitelistingTest
Tests run: 9, Failures: 0, Errors: 0, Skipped: 0, Time elapsed: 0.999 sec - in org.apache.qpid.client.message.ObjectMessageClassWhitelistingTest
Running org.apache.qpid.client.ssl.SSLTest
Tests run: 17, Failures: 0, Errors: 0, Skipped: 0, Time elapsed: 0.057 sec - in org.apache.qpid.client.ssl.SSLTest
Running org.apache.qpid.client.failover.MultipleBrokersFailoverTest
Tests run: 2, Failures: 0, Errors: 0, Skipped: 0, Time elapsed: 0 sec - in org.apache.qpid.client.failover.MultipleBrokersFailoverTest
Running org.apache.qpid.client.failover.FailoverBehaviourTest
Tests run: 37, Failures: 0, Errors: 0, Skipped: 0, Time elapsed: 53.296 sec - in org.apache.qpid.client.failover.FailoverBehaviourTest
Running org.apache.qpid.client.failover.AddressBasedFailoverBehaviourTest
Tests run: 37, Failures: 0, Errors: 0, Skipped: 0, Time elapsed: 51.591 sec - in org.apache.qpid.client.failover.AddressBasedFailoverBehaviourTest
Running org.apache.qpid.client.AMQQueueDeferredOrderingTest
Tests run: 1, Failures: 0, Errors: 0, Skipped: 0, Time elapsed: 3.956 sec - in org.apache.qpid.client.AMQQueueDeferredOrderingTest
Running org.apache.qpid.client.SynchReceiveTest
Tests run: 4, Failures: 0, Errors: 0, Skipped: 0, Time elapsed: 1.332 sec - in org.apache.qpid.client.SynchReceiveTest
Running org.apache.qpid.client.redelivered.RedeliveredMessageTest
Tests run: 1, Failures: 0, Errors: 0, Skipped: 0, Time elapsed: 0.162 sec - in org.apache.qpid.client.redelivered.RedeliveredMessageTest
Running org.apache.qpid.client.SyncPublishTest
Tests run: 1, Failures: 0, Errors: 0, Skipped: 0, Time elapsed: 0.001 sec - in org.apache.qpid.client.SyncPublishTest
Running org.apache.qpid.client.SessionCreateTest
Tests run: 1, Failures: 0, Errors: 0, Skipped: 0, Time elapsed: 157.789 sec - in org.apache.qpid.client.SessionCreateTest
Running org.apache.qpid.client.HeartbeatTest
Tests run: 8, Failures: 0, Errors: 0, Skipped: 0, Time elapsed: 14.52 sec - in org.apache.qpid.client.HeartbeatTest
Running org.apache.qpid.client.connection.ExistingSocketTest
Tests run: 2, Failures: 0, Errors: 0, Skipped: 0, Time elapsed: 0.265 sec - in org.apache.qpid.client.connection.ExistingSocketTest
Running org.apache.qpid.client.TemporaryQueuePrefixTest
Tests run: 4, Failures: 0, Errors: 0, Skipped: 0, Time elapsed: 0.007 sec - in org.apache.qpid.client.TemporaryQueuePrefixTest
Running org.apache.qpid.systest.prefetch.ZeroPrefetchTest
Tests run: 1, Failures: 0, Errors: 0, Skipped: 0, Time elapsed: 0.159 sec - in org.apache.qpid.systest.prefetch.ZeroPrefetchTest
Running org.apache.qpid.systest.rest.PreemtiveAuthRestTest
Tests run: 8, Failures: 0, Errors: 0, Skipped: 0, Time elapsed: 0.029 sec - in org.apache.qpid.systest.rest.PreemtiveAuthRestTest
Running org.apache.qpid.systest.rest.ExchangeRestTest
Tests run: 4, Failures: 0, Errors: 0, Skipped: 0, Time elapsed: 0.005 sec - in org.apache.qpid.systest.rest.ExchangeRestTest
Running org.apache.qpid.systest.rest.SaslRestTest
Tests run: 14, Failures: 0, Errors: 0, Skipped: 0, Time elapsed: 0.025 sec - in org.apache.qpid.systest.rest.SaslRestTest
Running org.apache.qpid.systest.rest.QueryRestTest
Tests run: 4, Failures: 0, Errors: 0, Skipped: 0, Time elapsed: 0.006 sec - in org.apache.qpid.systest.rest.QueryRestTest
Running org.apache.qpid.systest.rest.BrokerRestHttpsClientCertAuthTest
Tests run: 1, Failures: 0, Errors: 0, Skipped: 0, Time elapsed: 0 sec - in org.apache.qpid.systest.rest.BrokerRestHttpsClientCertAuthTest
Running org.apache.qpid.systest.rest.GroupProviderRestTest
Tests run: 10, Failures: 0, Errors: 0, Skipped: 0, Time elapsed: 0.02 sec - in org.apache.qpid.systest.rest.GroupProviderRestTest
Running org.apache.qpid.systest.rest.UserRestTest
Tests run: 7, Failures: 0, Errors: 0, Skipped: 0, Time elapsed: 0.012 sec - in org.apache.qpid.systest.rest.UserRestTest
Running org.apache.qpid.systest.rest.AnonymousAccessRestTest
Tests run: 4, Failures: 0, Errors: 0, Skipped: 0, Time elapsed: 0.007 sec - in org.apache.qpid.systest.rest.AnonymousAccessRestTest
Running org.apache.qpid.systest.rest.GroupRestTest
Tests run: 5, Failures: 0, Errors: 0, Skipped: 0, Time elapsed: 0.008 sec - in org.apache.qpid.systest.rest.GroupRestTest
Running org.apache.qpid.systest.rest.TrustStoreRestTest
Tests run: 5, Failures: 0, Errors: 0, Skipped: 0, Time elapsed: 0.009 sec - in org.apache.qpid.systest.rest.TrustStoreRestTest
Running org.apache.qpid.systest.rest.PortRestTest
Tests run: 12, Failures: 0, Errors: 0, Skipped: 0, Time elapsed: 0.041 sec - in org.apache.qpid.systest.rest.PortRestTest
Running org.apache.qpid.systest.rest.ExportImportMessagesRestTest
Tests run: 1, Failures: 0, Errors: 0, Skipped: 0, Time elapsed: 0.008 sec - in org.apache.qpid.systest.rest.ExportImportMessagesRestTest
Running org.apache.qpid.systest.rest.MessagesRestTest
Tests run: 14, Failures: 0, Errors: 0, Skipped: 0, Time elapsed: 0.003 sec - in org.apache.qpid.systest.rest.MessagesRestTest
Running org.apache.qpid.systest.rest.CompressedResponsesRestTest
Tests run: 4, Failures: 0, Errors: 0, Skipped: 0, Time elapsed: 0.005 sec - in org.apache.qpid.systest.rest.CompressedResponsesRestTest
Running org.apache.qpid.systest.rest.VirtualHostNodeRestTest
Tests run: 9, Failures: 0, Errors: 0, Skipped: 0, Time elapsed: 0.003 sec - in org.apache.qpid.systest.rest.VirtualHostNodeRestTest
Running org.apache.qpid.systest.rest.HttpManagementRestTest
Tests run: 3, Failures: 0, Errors: 0, Skipped: 0, Time elapsed: 0.001 sec - in org.apache.qpid.systest.rest.HttpManagementRestTest
Running org.apache.qpid.systest.rest.BrokerRestHttpAndHttpsTest
Tests run: 4, Failures: 0, Errors: 0, Skipped: 0, Time elapsed: 0.001 sec - in org.apache.qpid.systest.rest.BrokerRestHttpAndHttpsTest
Running org.apache.qpid.systest.rest.QueueRestTest
Tests run: 3, Failures: 0, Errors: 0, Skipped: 0, Time elapsed: 0.001 sec - in org.apache.qpid.systest.rest.QueueRestTest
Running org.apache.qpid.systest.rest.ConnectionRestTest
Tests run: 9, Failures: 0, Errors: 0, Skipped: 0, Time elapsed: 0.031 sec - in org.apache.qpid.systest.rest.ConnectionRestTest
Running org.apache.qpid.systest.rest.VirtualHostRestTest
Tests run: 28, Failures: 0, Errors: 0, Skipped: 0, Time elapsed: 0.077 sec - in org.apache.qpid.systest.rest.VirtualHostRestTest
Running org.apache.qpid.systest.rest.BrokerRestHttpsTest
Tests run: 1, Failures: 0, Errors: 0, Skipped: 0, Time elapsed: 0 sec - in org.apache.qpid.systest.rest.BrokerRestHttpsTest
Running org.apache.qpid.systest.rest.acl.VirtualHostAccessControlProviderRestTest
Tests run: 6, Failures: 0, Errors: 0, Skipped: 0, Time elapsed: 0.021 sec - in org.apache.qpid.systest.rest.acl.VirtualHostAccessControlProviderRestTest
Running org.apache.qpid.systest.rest.acl.GroupRestACLTest
Tests run: 4, Failures: 0, Errors: 0, Skipped: 0, Time elapsed: 0.008 sec - in org.apache.qpid.systest.rest.acl.GroupRestACLTest
Running org.apache.qpid.systest.rest.acl.VirtualHostNodeACLTest
Tests run: 3, Failures: 0, Errors: 0, Skipped: 0, Time elapsed: 0.012 sec - in org.apache.qpid.systest.rest.acl.VirtualHostNodeACLTest
Running org.apache.qpid.systest.rest.acl.VirtualHostACLTest
Tests run: 5, Failures: 0, Errors: 0, Skipped: 0, Time elapsed: 0.009 sec - in org.apache.qpid.systest.rest.acl.VirtualHostACLTest
Running org.apache.qpid.systest.rest.acl.BrokerACLTest
Tests run: 45, Failures: 0, Errors: 0, Skipped: 0, Time elapsed: 0.112 sec - in org.apache.qpid.systest.rest.acl.BrokerACLTest
Running org.apache.qpid.systest.rest.acl.ExchangeRestACLTest
Tests run: 9, Failures: 0, Errors: 0, Skipped: 0, Time elapsed: 0.002 sec - in org.apache.qpid.systest.rest.acl.ExchangeRestACLTest
Running org.apache.qpid.systest.rest.acl.UserRestACLTest
Tests run: 3, Failures: 0, Errors: 0, Skipped: 0, Time elapsed: 0 sec - in org.apache.qpid.systest.rest.acl.UserRestACLTest
Running org.apache.qpid.systest.rest.acl.QueueRestACLTest
Tests run: 6, Failures: 0, Errors: 0, Skipped: 0, Time elapsed: 0.001 sec - in org.apache.qpid.systest.rest.acl.QueueRestACLTest
Running org.apache.qpid.systest.rest.VirtualHostLoggerRestTest
Tests run: 2, Failures: 0, Errors: 0, Skipped: 0, Time elapsed: 0.008 sec - in org.apache.qpid.systest.rest.VirtualHostLoggerRestTest
Running org.apache.qpid.systest.rest.StructureRestTest
Tests run: 1, Failures: 0, Errors: 0, Skipped: 0, Time elapsed: 0 sec - in org.apache.qpid.systest.rest.StructureRestTest
Running org.apache.qpid.systest.rest.BrokerRestTest
Tests run: 8, Failures: 0, Errors: 0, Skipped: 0, Time elapsed: 0.008 sec - in org.apache.qpid.systest.rest.BrokerRestTest
Running org.apache.qpid.systest.rest.KeyStoreRestTest
Tests run: 5, Failures: 0, Errors: 0, Skipped: 0, Time elapsed: 0 sec - in org.apache.qpid.systest.rest.KeyStoreRestTest
Running org.apache.qpid.systest.rest.AuthenticationProviderRestTest
Tests run: 9, Failures: 0, Errors: 0, Skipped: 0, Time elapsed: 0.005 sec - in org.apache.qpid.systest.rest.AuthenticationProviderRestTest
Running org.apache.qpid.systest.rest.AccessControlProviderRestTest
Tests run: 4, Failures: 0, Errors: 0, Skipped: 0, Time elapsed: 0 sec - in org.apache.qpid.systest.rest.AccessControlProviderRestTest
Running org.apache.qpid.systest.rest.UserPreferencesRestTest
Tests run: 9, Failures: 0, Errors: 0, Skipped: 0, Time elapsed: 0.005 sec - in org.apache.qpid.systest.rest.UserPreferencesRestTest
Running org.apache.qpid.systest.rest.PublishMessageRestTest
Tests run: 6, Failures: 0, Errors: 0, Skipped: 0, Time elapsed: 0 sec - in org.apache.qpid.systest.rest.PublishMessageRestTest
Running org.apache.qpid.systest.AnonymousProducerTest
Tests run: 4, Failures: 0, Errors: 0, Skipped: 0, Time elapsed: 0.158 sec - in org.apache.qpid.systest.AnonymousProducerTest
Running org.apache.qpid.systest.messageencryption.MessageEncryptionTest
Tests run: 8, Failures: 0, Errors: 0, Skipped: 0, Time elapsed: 0.113 sec - in org.apache.qpid.systest.messageencryption.MessageEncryptionTest
Running org.apache.qpid.systest.MessageCompressionTest
Tests run: 10, Failures: 0, Errors: 0, Skipped: 0, Time elapsed: 0.011 sec - in org.apache.qpid.systest.MessageCompressionTest
Running org.apache.qpid.systest.management.amqp.AmqpManagementTest
Tests run: 18, Failures: 0, Errors: 0, Skipped: 0, Time elapsed: 0.023 sec - in org.apache.qpid.systest.management.amqp.AmqpManagementTest

Results :

Failed tests: 
  QueuePolicyTest>QpidTestCase.run:165->QpidBrokerTestCase.runBare:91->QpidTestCase.runTest:181->testRejectPolicyMessageDepth:70
Unexpected exception: Session exception occurred while trying to commit: ch=0 id=1 ExecutionException(errorCode=INTERNAL_ERROR,
commandId=22, classCode=5, commandCode=2, fieldIndex=0, description=internal-error: Transaction
prepare failed., errorInfo={})
Tests in error: 
  QueuePolicyTest>QpidTestCase.run:165->QpidBrokerTestCase.runBare:91->QpidTestCase.runTest:181->testRingPolicy:98
ยป JMS

Tests run: 1034, Failures: 1, Errors: 1, Skipped: 0

[INFO] ------------------------------------------------------------------------
[INFO] BUILD FAILURE
[INFO] ------------------------------------------------------------------------
[INFO] Total time: 09:13 min
[INFO] Finished at: 2017-07-12T11:25:11Z
[INFO] Final Memory: 42M/565M
[INFO] ------------------------------------------------------------------------
[ERROR] Failed to execute goal org.apache.maven.plugins:maven-surefire-plugin:2.19.1:test
(integration-test) on project qpid-systests: There are test failures.
[ERROR] 
[ERROR] Please refer to <https://builds.apache.org/job/Qpid-cpp-JMS-AMQP-0-x-Test/4035/artifact/qpid-broker-j/systests/target/surefire-reports/cpp>
for the individual test results.
[ERROR] -> [Help 1]
[ERROR] 
[ERROR] To see the full stack trace of the errors, re-run Maven with the -e switch.
[ERROR] Re-run Maven using the -X switch to enable full debug logging.
[ERROR] 
[ERROR] For more information about the errors and possible solutions, please read the following
articles:
[ERROR] [Help 1] http://cwiki.apache.org/confluence/display/MAVEN/MojoFailureException
Build step 'Invoke top-level Maven targets' marked build as failure
[locks-and-latches] Releasing all the locks
[locks-and-latches] All the locks released
Archiving artifacts
Recording test results

Mime
View raw message