qpid-notifications mailing list archives

Site index · List index
Message view « Date » · « Thread »
Top « Date » · « Thread »
From Apache Jenkins Server <jenk...@builds.apache.org>
Subject Build failed in Jenkins: Qpid-cpp-JMS-AMQP-0-x-Test #4015
Date Thu, 22 Jun 2017 15:14:56 GMT
See <https://builds.apache.org/job/Qpid-cpp-JMS-AMQP-0-x-Test/4015/display/redirect>

------------------------------------------
[...truncated 517.41 KB...]
Tests run: 2, Failures: 0, Errors: 0, Skipped: 0, Time elapsed: 0.34 sec - in org.apache.qpid.test.unit.basic.BytesMessageTest
Running org.apache.qpid.test.unit.basic.MultipleConnectionTest
Tests run: 1, Failures: 0, Errors: 0, Skipped: 0, Time elapsed: 0.342 sec - in org.apache.qpid.test.unit.basic.MultipleConnectionTest
Running org.apache.qpid.test.unit.basic.TextMessageTest
Tests run: 1, Failures: 0, Errors: 0, Skipped: 0, Time elapsed: 0.191 sec - in org.apache.qpid.test.unit.basic.TextMessageTest
Running org.apache.qpid.test.unit.basic.close.CloseTest
Tests run: 1, Failures: 0, Errors: 0, Skipped: 0, Time elapsed: 0.076 sec - in org.apache.qpid.test.unit.basic.close.CloseTest
Running org.apache.qpid.test.unit.basic.FieldTableMessageTest
Tests run: 1, Failures: 0, Errors: 0, Skipped: 0, Time elapsed: 0.096 sec - in org.apache.qpid.test.unit.basic.FieldTableMessageTest
Running org.apache.qpid.test.unit.basic.PubSubTwoConnectionTest
Tests run: 1, Failures: 0, Errors: 0, Skipped: 0, Time elapsed: 0.071 sec - in org.apache.qpid.test.unit.basic.PubSubTwoConnectionTest
Running org.apache.qpid.test.unit.basic.InvalidDestinationTest
Tests run: 3, Failures: 0, Errors: 0, Skipped: 0, Time elapsed: 0.186 sec - in org.apache.qpid.test.unit.basic.InvalidDestinationTest
Running org.apache.qpid.test.unit.basic.MapMessageTest
Tests run: 1, Failures: 0, Errors: 0, Skipped: 0, Time elapsed: 0.212 sec - in org.apache.qpid.test.unit.basic.MapMessageTest
Running org.apache.qpid.test.unit.basic.SessionStartTest
Tests run: 1, Failures: 0, Errors: 0, Skipped: 0, Time elapsed: 0.075 sec - in org.apache.qpid.test.unit.basic.SessionStartTest
Running org.apache.qpid.test.unit.basic.ObjectMessageTest
Tests run: 1, Failures: 0, Errors: 0, Skipped: 0, Time elapsed: 0.196 sec - in org.apache.qpid.test.unit.basic.ObjectMessageTest
Running org.apache.qpid.test.unit.ct.DurableSubscriberTest
Tests run: 4, Failures: 0, Errors: 0, Skipped: 0, Time elapsed: 0.003 sec - in org.apache.qpid.test.unit.ct.DurableSubscriberTest
Running org.apache.qpid.test.utils.BrokerCommandHelperTest
Tests run: 1, Failures: 0, Errors: 0, Skipped: 0, Time elapsed: 0.001 sec - in org.apache.qpid.test.utils.BrokerCommandHelperTest
Running org.apache.qpid.test.utils.SpawnedBrokerHolderTest
Tests run: 1, Failures: 0, Errors: 0, Skipped: 0, Time elapsed: 0.101 sec - in org.apache.qpid.test.utils.SpawnedBrokerHolderTest
Running org.apache.qpid.transport.MaxFrameSizeTest
Tests run: 2, Failures: 0, Errors: 0, Skipped: 0, Time elapsed: 0.004 sec - in org.apache.qpid.transport.MaxFrameSizeTest
Running org.apache.qpid.transport.ProtocolNegotiationTest
Tests run: 5, Failures: 0, Errors: 0, Skipped: 0, Time elapsed: 0.173 sec - in org.apache.qpid.transport.ProtocolNegotiationTest
Running org.apache.qpid.transport.ConnectionEstablishmentTest
Tests run: 1, Failures: 0, Errors: 0, Skipped: 0, Time elapsed: 0.002 sec - in org.apache.qpid.transport.ConnectionEstablishmentTest
Running org.apache.qpid.util.LogMonitorTest
Tests run: 8, Failures: 0, Errors: 0, Skipped: 0, Time elapsed: 2.025 sec - in org.apache.qpid.util.LogMonitorTest
Running org.apache.qpid.server.exchange.ReturnUnroutableMandatoryMessageTest
Tests run: 3, Failures: 0, Errors: 0, Skipped: 0, Time elapsed: 0.003 sec - in org.apache.qpid.server.exchange.ReturnUnroutableMandatoryMessageTest
Running org.apache.qpid.server.failover.FailoverMethodTest
Tests run: 3, Failures: 0, Errors: 0, Skipped: 0, Time elapsed: 0.003 sec - in org.apache.qpid.server.failover.FailoverMethodTest
Running org.apache.qpid.server.message.MessageProtocolConversionTest
Tests run: 2, Failures: 0, Errors: 0, Skipped: 0, Time elapsed: 0.002 sec - in org.apache.qpid.server.message.MessageProtocolConversionTest
Running org.apache.qpid.server.logging.ChannelLoggingTest
Tests run: 6, Failures: 0, Errors: 0, Skipped: 0, Time elapsed: 0.007 sec - in org.apache.qpid.server.logging.ChannelLoggingTest
Running org.apache.qpid.server.logging.VirtualHostLoggingTest
Tests run: 2, Failures: 0, Errors: 0, Skipped: 0, Time elapsed: 0.002 sec - in org.apache.qpid.server.logging.VirtualHostLoggingTest
Running org.apache.qpid.server.logging.TransientQueueLoggingTest
Tests run: 5, Failures: 0, Errors: 0, Skipped: 0, Time elapsed: 0.005 sec - in org.apache.qpid.server.logging.TransientQueueLoggingTest
Running org.apache.qpid.server.logging.DurableQueueLoggingTest
Tests run: 5, Failures: 0, Errors: 0, Skipped: 0, Time elapsed: 0.002 sec - in org.apache.qpid.server.logging.DurableQueueLoggingTest
Running org.apache.qpid.server.logging.QueueLoggingTest
Tests run: 2, Failures: 0, Errors: 0, Skipped: 0, Time elapsed: 0.002 sec - in org.apache.qpid.server.logging.QueueLoggingTest
Running org.apache.qpid.server.logging.AccessControlLoggingTest
Tests run: 4, Failures: 0, Errors: 0, Skipped: 0, Time elapsed: 0.005 sec - in org.apache.qpid.server.logging.AccessControlLoggingTest
Running org.apache.qpid.server.logging.AlertingTest
Tests run: 3, Failures: 0, Errors: 0, Skipped: 0, Time elapsed: 0 sec - in org.apache.qpid.server.logging.AlertingTest
Running org.apache.qpid.server.logging.BrokerLoggingTest
Tests run: 8, Failures: 0, Errors: 0, Skipped: 0, Time elapsed: 0.001 sec - in org.apache.qpid.server.logging.BrokerLoggingTest
Running org.apache.qpid.server.logging.ExchangeLoggingTest
Tests run: 4, Failures: 0, Errors: 0, Skipped: 0, Time elapsed: 0.016 sec - in org.apache.qpid.server.logging.ExchangeLoggingTest
Running org.apache.qpid.server.logging.ConnectionLoggingTest
Tests run: 2, Failures: 0, Errors: 0, Skipped: 0, Time elapsed: 0.003 sec - in org.apache.qpid.server.logging.ConnectionLoggingTest
Running org.apache.qpid.server.logging.ConsumerLoggingTest
Tests run: 6, Failures: 0, Errors: 0, Skipped: 0, Time elapsed: 0.007 sec - in org.apache.qpid.server.logging.ConsumerLoggingTest
Running org.apache.qpid.server.queue.QueueBindTest
Tests run: 2, Failures: 0, Errors: 0, Skipped: 0, Time elapsed: 0.1 sec - in org.apache.qpid.server.queue.QueueBindTest
Running org.apache.qpid.server.queue.DefaultFiltersTest
Tests run: 2, Failures: 0, Errors: 0, Skipped: 0, Time elapsed: 0.001 sec - in org.apache.qpid.server.queue.DefaultFiltersTest
Running org.apache.qpid.server.queue.EnsureNondestructiveConsumersTest
Tests run: 1, Failures: 0, Errors: 0, Skipped: 0, Time elapsed: 0 sec - in org.apache.qpid.server.queue.EnsureNondestructiveConsumersTest
Running org.apache.qpid.server.queue.QueueDepthWithSelectorTest
Tests run: 1, Failures: 0, Errors: 0, Skipped: 0, Time elapsed: 0.194 sec - in org.apache.qpid.server.queue.QueueDepthWithSelectorTest
Running org.apache.qpid.server.queue.LiveQueueOperationsTest
Tests run: 1, Failures: 0, Errors: 0, Skipped: 0, Time elapsed: 0.002 sec - in org.apache.qpid.server.queue.LiveQueueOperationsTest
Running org.apache.qpid.server.queue.LastValueQueueTest
Tests run: 7, Failures: 0, Errors: 0, Skipped: 0, Time elapsed: 12.926 sec - in org.apache.qpid.server.queue.LastValueQueueTest
Running org.apache.qpid.server.queue.ConsumerPriorityTest
Tests run: 5, Failures: 0, Errors: 0, Skipped: 0, Time elapsed: 0.002 sec - in org.apache.qpid.server.queue.ConsumerPriorityTest
Running org.apache.qpid.server.queue.MessageGroupQueueTest
Tests run: 9, Failures: 0, Errors: 0, Skipped: 0, Time elapsed: 6.657 sec - in org.apache.qpid.server.queue.MessageGroupQueueTest
Running org.apache.qpid.server.queue.ProducerFlowControlTest
Tests run: 7, Failures: 0, Errors: 0, Skipped: 0, Time elapsed: 0.004 sec - in org.apache.qpid.server.queue.ProducerFlowControlTest
Running org.apache.qpid.server.queue.NodeAutoCreationPolicyTest
Tests run: 9, Failures: 0, Errors: 0, Skipped: 0, Time elapsed: 0.005 sec - in org.apache.qpid.server.queue.NodeAutoCreationPolicyTest
Running org.apache.qpid.server.queue.QueueMessageDurabilityTest
Tests run: 4, Failures: 0, Errors: 0, Skipped: 0, Time elapsed: 0.002 sec - in org.apache.qpid.server.queue.QueueMessageDurabilityTest
Running org.apache.qpid.server.queue.SortedQueueTest
Tests run: 8, Failures: 0, Errors: 0, Skipped: 0, Time elapsed: 0.013 sec - in org.apache.qpid.server.queue.SortedQueueTest
Running org.apache.qpid.server.queue.PriorityQueueTest
Tests run: 3, Failures: 0, Errors: 0, Skipped: 0, Time elapsed: 1.296 sec - in org.apache.qpid.server.queue.PriorityQueueTest
Running org.apache.qpid.server.queue.MultipleTransactedBatchProducerTest
Tests run: 1, Failures: 0, Errors: 0, Skipped: 0, Time elapsed: 7.436 sec - in org.apache.qpid.server.queue.MultipleTransactedBatchProducerTest
Running org.apache.qpid.server.queue.FlowToDiskTest
Tests run: 1, Failures: 0, Errors: 0, Skipped: 0, Time elapsed: 0.002 sec - in org.apache.qpid.server.queue.FlowToDiskTest
Running org.apache.qpid.server.queue.ArrivalTimeFilterTest
Tests run: 2, Failures: 0, Errors: 0, Skipped: 0, Time elapsed: 0.002 sec - in org.apache.qpid.server.queue.ArrivalTimeFilterTest
Running org.apache.qpid.server.queue.TimeToLiveTest
Tests run: 5, Failures: 0, Errors: 0, Skipped: 0, Time elapsed: 2.235 sec - in org.apache.qpid.server.queue.TimeToLiveTest
Running org.apache.qpid.server.queue.ModelTest
Tests run: 4, Failures: 0, Errors: 0, Skipped: 0, Time elapsed: 0.002 sec - in org.apache.qpid.server.queue.ModelTest
Running org.apache.qpid.server.security.auth.manager.ScramSha256AuthenticationManagerTest
Tests run: 3, Failures: 0, Errors: 0, Skipped: 0, Time elapsed: 0.001 sec - in org.apache.qpid.server.security.auth.manager.ScramSha256AuthenticationManagerTest
Running org.apache.qpid.server.security.auth.manager.ExternalAuthenticationTest
Tests run: 8, Failures: 0, Errors: 0, Skipped: 0, Time elapsed: 0.005 sec - in org.apache.qpid.server.security.auth.manager.ExternalAuthenticationTest
Running org.apache.qpid.server.security.auth.manager.MD5AuthenticationManagerTest
Tests run: 3, Failures: 0, Errors: 0, Skipped: 0, Time elapsed: 0.002 sec - in org.apache.qpid.server.security.auth.manager.MD5AuthenticationManagerTest
Running org.apache.qpid.server.security.auth.manager.ScramSha1AuthenticationManagerTest
Tests run: 3, Failures: 0, Errors: 0, Skipped: 0, Time elapsed: 0.001 sec - in org.apache.qpid.server.security.auth.manager.ScramSha1AuthenticationManagerTest
Running org.apache.qpid.server.security.auth.manager.MultipleAuthenticationManagersTest
Tests run: 1, Failures: 0, Errors: 0, Skipped: 0, Time elapsed: 0.001 sec - in org.apache.qpid.server.security.auth.manager.MultipleAuthenticationManagersTest
Running org.apache.qpid.server.security.acl.ExternalACLTest
Tests run: 19, Failures: 0, Errors: 0, Skipped: 0, Time elapsed: 0.014 sec - in org.apache.qpid.server.security.acl.ExternalACLTest
Running org.apache.qpid.server.security.acl.ExhaustiveACLTest
Tests run: 4, Failures: 0, Errors: 0, Skipped: 0, Time elapsed: 0.001 sec - in org.apache.qpid.server.security.acl.ExhaustiveACLTest
Running org.apache.qpid.server.persistent.NoLocalAfterRecoveryTest
Tests run: 2, Failures: 0, Errors: 0, Skipped: 0, Time elapsed: 0 sec - in org.apache.qpid.server.persistent.NoLocalAfterRecoveryTest
Running org.apache.qpid.server.store.VirtualHostMessageStoreTest
Tests run: 9, Failures: 0, Errors: 0, Skipped: 0, Time elapsed: 0.017 sec - in org.apache.qpid.server.store.VirtualHostMessageStoreTest
Running org.apache.qpid.server.store.SplitStoreTest
Tests run: 2, Failures: 0, Errors: 0, Skipped: 0, Time elapsed: 0.001 sec - in org.apache.qpid.server.store.SplitStoreTest
Running org.apache.qpid.server.store.PersistentStoreTest
Tests run: 5, Failures: 0, Errors: 0, Skipped: 0, Time elapsed: 0.001 sec - in org.apache.qpid.server.store.PersistentStoreTest
Running org.apache.qpid.server.BrokerStartupTest
Tests run: 2, Failures: 0, Errors: 0, Skipped: 0, Time elapsed: 0.001 sec - in org.apache.qpid.server.BrokerStartupTest
Running org.apache.qpid.server.stats.StatisticsReportingTest
Tests run: 2, Failures: 0, Errors: 0, Skipped: 0, Time elapsed: 0 sec - in org.apache.qpid.server.stats.StatisticsReportingTest
Running org.apache.qpid.server.routing.AlternateBindingRoutingTest
Tests run: 1, Failures: 0, Errors: 1, Skipped: 0, Time elapsed: 0.065 sec <<< FAILURE!
- in org.apache.qpid.server.routing.AlternateBindingRoutingTest
testFanoutExchangeAsAlternateBinding(org.apache.qpid.server.routing.AlternateBindingRoutingTest)
 Time elapsed: 0.065 sec  <<< ERROR!
javax.jms.JMSException: Error creating producer
	at org.apache.qpid.server.routing.AlternateBindingRoutingTest.testFanoutExchangeAsAlternateBinding(AlternateBindingRoutingTest.java:50)
Caused by: org.apache.qpid.QpidException: The name '$management' supplied in the address doesn't
resolve to an exchange or a queue
	at org.apache.qpid.server.routing.AlternateBindingRoutingTest.testFanoutExchangeAsAlternateBinding(AlternateBindingRoutingTest.java:50)

Running org.apache.qpid.server.SupportedProtocolVersionsTest
Tests run: 0, Failures: 0, Errors: 0, Skipped: 0, Time elapsed: 0 sec - in org.apache.qpid.server.SupportedProtocolVersionsTest
Running org.apache.qpid.server.AbruptClientDisconnectTest
Tests run: 2, Failures: 0, Errors: 0, Skipped: 0, Time elapsed: 5.643 sec - in org.apache.qpid.server.AbruptClientDisconnectTest
Running org.apache.qpid.systest.rest.GroupRestTest
Tests run: 5, Failures: 0, Errors: 0, Skipped: 0, Time elapsed: 0.001 sec - in org.apache.qpid.systest.rest.GroupRestTest
Running org.apache.qpid.systest.rest.MessagesRestTest
Tests run: 14, Failures: 0, Errors: 0, Skipped: 0, Time elapsed: 0.012 sec - in org.apache.qpid.systest.rest.MessagesRestTest
Running org.apache.qpid.systest.rest.AnonymousAccessRestTest
Tests run: 4, Failures: 0, Errors: 0, Skipped: 0, Time elapsed: 0.007 sec - in org.apache.qpid.systest.rest.AnonymousAccessRestTest
Running org.apache.qpid.systest.rest.PreemtiveAuthRestTest
Tests run: 8, Failures: 0, Errors: 0, Skipped: 0, Time elapsed: 0.008 sec - in org.apache.qpid.systest.rest.PreemtiveAuthRestTest
Running org.apache.qpid.systest.rest.BrokerRestHttpAndHttpsTest
Tests run: 4, Failures: 0, Errors: 0, Skipped: 0, Time elapsed: 0.012 sec - in org.apache.qpid.systest.rest.BrokerRestHttpAndHttpsTest
Running org.apache.qpid.systest.rest.BrokerRestHttpsClientCertAuthTest
Tests run: 1, Failures: 0, Errors: 0, Skipped: 0, Time elapsed: 0 sec - in org.apache.qpid.systest.rest.BrokerRestHttpsClientCertAuthTest
Running org.apache.qpid.systest.rest.BrokerRestTest
Tests run: 8, Failures: 0, Errors: 0, Skipped: 0, Time elapsed: 0.012 sec - in org.apache.qpid.systest.rest.BrokerRestTest
Running org.apache.qpid.systest.rest.AuthenticationProviderRestTest
Tests run: 9, Failures: 0, Errors: 0, Skipped: 0, Time elapsed: 0.001 sec - in org.apache.qpid.systest.rest.AuthenticationProviderRestTest
Running org.apache.qpid.systest.rest.QueueRestTest
Tests run: 3, Failures: 0, Errors: 0, Skipped: 0, Time elapsed: 0 sec - in org.apache.qpid.systest.rest.QueueRestTest
Running org.apache.qpid.systest.rest.UserRestTest
Tests run: 7, Failures: 0, Errors: 0, Skipped: 0, Time elapsed: 0.004 sec - in org.apache.qpid.systest.rest.UserRestTest
Running org.apache.qpid.systest.rest.HttpManagementRestTest
Tests run: 3, Failures: 0, Errors: 0, Skipped: 0, Time elapsed: 0.005 sec - in org.apache.qpid.systest.rest.HttpManagementRestTest
Running org.apache.qpid.systest.rest.PortRestTest
Tests run: 12, Failures: 0, Errors: 0, Skipped: 0, Time elapsed: 0.014 sec - in org.apache.qpid.systest.rest.PortRestTest
Running org.apache.qpid.systest.rest.UserPreferencesRestTest
Tests run: 9, Failures: 0, Errors: 0, Skipped: 0, Time elapsed: 0.011 sec - in org.apache.qpid.systest.rest.UserPreferencesRestTest
Running org.apache.qpid.systest.rest.GroupProviderRestTest
Tests run: 10, Failures: 0, Errors: 0, Skipped: 0, Time elapsed: 0.059 sec - in org.apache.qpid.systest.rest.GroupProviderRestTest
Running org.apache.qpid.systest.rest.VirtualHostLoggerRestTest
Tests run: 2, Failures: 0, Errors: 0, Skipped: 0, Time elapsed: 0 sec - in org.apache.qpid.systest.rest.VirtualHostLoggerRestTest
Running org.apache.qpid.systest.rest.TrustStoreRestTest
Tests run: 5, Failures: 0, Errors: 0, Skipped: 0, Time elapsed: 0.005 sec - in org.apache.qpid.systest.rest.TrustStoreRestTest
Running org.apache.qpid.systest.rest.QueryRestTest
Tests run: 4, Failures: 0, Errors: 0, Skipped: 0, Time elapsed: 0.006 sec - in org.apache.qpid.systest.rest.QueryRestTest
Running org.apache.qpid.systest.rest.AccessControlProviderRestTest
Tests run: 4, Failures: 0, Errors: 0, Skipped: 0, Time elapsed: 0.009 sec - in org.apache.qpid.systest.rest.AccessControlProviderRestTest
Running org.apache.qpid.systest.rest.KeyStoreRestTest
Tests run: 5, Failures: 0, Errors: 0, Skipped: 0, Time elapsed: 0.006 sec - in org.apache.qpid.systest.rest.KeyStoreRestTest
Running org.apache.qpid.systest.rest.acl.VirtualHostACLTest
Tests run: 5, Failures: 0, Errors: 0, Skipped: 0, Time elapsed: 0.007 sec - in org.apache.qpid.systest.rest.acl.VirtualHostACLTest
Running org.apache.qpid.systest.rest.acl.VirtualHostNodeACLTest
Tests run: 3, Failures: 0, Errors: 0, Skipped: 0, Time elapsed: 0 sec - in org.apache.qpid.systest.rest.acl.VirtualHostNodeACLTest
Running org.apache.qpid.systest.rest.acl.GroupRestACLTest
Tests run: 4, Failures: 0, Errors: 0, Skipped: 0, Time elapsed: 0.001 sec - in org.apache.qpid.systest.rest.acl.GroupRestACLTest
Running org.apache.qpid.systest.rest.acl.VirtualHostAccessControlProviderRestTest
Tests run: 6, Failures: 0, Errors: 0, Skipped: 0, Time elapsed: 0.003 sec - in org.apache.qpid.systest.rest.acl.VirtualHostAccessControlProviderRestTest
Running org.apache.qpid.systest.rest.acl.UserRestACLTest
Tests run: 3, Failures: 0, Errors: 0, Skipped: 0, Time elapsed: 0.001 sec - in org.apache.qpid.systest.rest.acl.UserRestACLTest
Running org.apache.qpid.systest.rest.acl.BrokerACLTest
Tests run: 45, Failures: 0, Errors: 0, Skipped: 0, Time elapsed: 0.026 sec - in org.apache.qpid.systest.rest.acl.BrokerACLTest
Running org.apache.qpid.systest.rest.acl.ExchangeRestACLTest
Tests run: 9, Failures: 0, Errors: 0, Skipped: 0, Time elapsed: 0.004 sec - in org.apache.qpid.systest.rest.acl.ExchangeRestACLTest
Running org.apache.qpid.systest.rest.acl.QueueRestACLTest
Tests run: 6, Failures: 0, Errors: 0, Skipped: 0, Time elapsed: 0.003 sec - in org.apache.qpid.systest.rest.acl.QueueRestACLTest
Running org.apache.qpid.systest.rest.SaslRestTest
Tests run: 14, Failures: 0, Errors: 0, Skipped: 0, Time elapsed: 0.009 sec - in org.apache.qpid.systest.rest.SaslRestTest
Running org.apache.qpid.systest.rest.BrokerRestHttpsTest
Tests run: 1, Failures: 0, Errors: 0, Skipped: 0, Time elapsed: 0 sec - in org.apache.qpid.systest.rest.BrokerRestHttpsTest
Running org.apache.qpid.systest.rest.StructureRestTest
Tests run: 1, Failures: 0, Errors: 0, Skipped: 0, Time elapsed: 0 sec - in org.apache.qpid.systest.rest.StructureRestTest
Running org.apache.qpid.systest.rest.CompressedResponsesRestTest
Tests run: 4, Failures: 0, Errors: 0, Skipped: 0, Time elapsed: 0.022 sec - in org.apache.qpid.systest.rest.CompressedResponsesRestTest
Running org.apache.qpid.systest.rest.PublishMessageRestTest
Tests run: 6, Failures: 0, Errors: 0, Skipped: 0, Time elapsed: 0 sec - in org.apache.qpid.systest.rest.PublishMessageRestTest
Running org.apache.qpid.systest.rest.ExchangeRestTest
Tests run: 4, Failures: 0, Errors: 0, Skipped: 0, Time elapsed: 0 sec - in org.apache.qpid.systest.rest.ExchangeRestTest
Running org.apache.qpid.systest.rest.ExportImportMessagesRestTest
Tests run: 1, Failures: 0, Errors: 0, Skipped: 0, Time elapsed: 0 sec - in org.apache.qpid.systest.rest.ExportImportMessagesRestTest
Running org.apache.qpid.systest.rest.VirtualHostRestTest
Tests run: 28, Failures: 0, Errors: 0, Skipped: 0, Time elapsed: 0.001 sec - in org.apache.qpid.systest.rest.VirtualHostRestTest
Running org.apache.qpid.systest.rest.ConnectionRestTest
Tests run: 9, Failures: 0, Errors: 0, Skipped: 0, Time elapsed: 0.003 sec - in org.apache.qpid.systest.rest.ConnectionRestTest
Running org.apache.qpid.systest.rest.VirtualHostNodeRestTest
Tests run: 9, Failures: 0, Errors: 0, Skipped: 0, Time elapsed: 0.007 sec - in org.apache.qpid.systest.rest.VirtualHostNodeRestTest
Running org.apache.qpid.systest.prefetch.ZeroPrefetchTest
Tests run: 1, Failures: 0, Errors: 0, Skipped: 0, Time elapsed: 0.102 sec - in org.apache.qpid.systest.prefetch.ZeroPrefetchTest
Running org.apache.qpid.systest.AnonymousProducerTest
Tests run: 4, Failures: 0, Errors: 0, Skipped: 0, Time elapsed: 0.162 sec - in org.apache.qpid.systest.AnonymousProducerTest
Running org.apache.qpid.systest.messageencryption.MessageEncryptionTest
Tests run: 8, Failures: 0, Errors: 0, Skipped: 0, Time elapsed: 0.149 sec - in org.apache.qpid.systest.messageencryption.MessageEncryptionTest
Running org.apache.qpid.systest.MessageCompressionTest
Tests run: 10, Failures: 0, Errors: 0, Skipped: 0, Time elapsed: 0.009 sec - in org.apache.qpid.systest.MessageCompressionTest
Running org.apache.qpid.systest.management.amqp.AmqpManagementTest
Tests run: 15, Failures: 0, Errors: 0, Skipped: 0, Time elapsed: 0.08 sec - in org.apache.qpid.systest.management.amqp.AmqpManagementTest

Results :

Tests in error: 
  AlternateBindingRoutingTest>QpidTestCase.run:165->QpidBrokerTestCase.runBare:91->QpidTestCase.runTest:181->testFanoutExchangeAsAlternateBinding:50->QpidBrokerTestCase.createEntityUsingAmqpManagement:355
ยป JMS

Tests run: 1036, Failures: 0, Errors: 1, Skipped: 0

[INFO] ------------------------------------------------------------------------
[INFO] BUILD FAILURE
[INFO] ------------------------------------------------------------------------
[INFO] Total time: 06:46 min
[INFO] Finished at: 2017-06-22T15:06:15Z
[INFO] Final Memory: 41M/1499M
[INFO] ------------------------------------------------------------------------
[ERROR] Failed to execute goal org.apache.maven.plugins:maven-surefire-plugin:2.19.1:test
(integration-test) on project qpid-systests: There are test failures.
[ERROR] 
[ERROR] Please refer to <https://builds.apache.org/job/Qpid-cpp-JMS-AMQP-0-x-Test/4015/artifact/qpid-broker-j/systests/target/surefire-reports/cpp>
for the individual test results.
[ERROR] -> [Help 1]
[ERROR] 
[ERROR] To see the full stack trace of the errors, re-run Maven with the -e switch.
[ERROR] Re-run Maven using the -X switch to enable full debug logging.
[ERROR] 
[ERROR] For more information about the errors and possible solutions, please read the following
articles:
[ERROR] [Help 1] http://cwiki.apache.org/confluence/display/MAVEN/MojoFailureException
Build step 'Invoke top-level Maven targets' marked build as failure
[locks-and-latches] Releasing all the locks
[locks-and-latches] All the locks released
Archiving artifacts
Recording test results

Mime
View raw message