qpid-notifications mailing list archives

Site index · List index
Message view « Date » · « Thread »
Top « Date » · « Thread »
From Apache Jenkins Server <jenk...@builds.apache.org>
Subject Build failed in Jenkins: Qpid-cpp-JMS-AMQP-0-x-Test #3986
Date Tue, 06 Jun 2017 10:54:02 GMT
See <https://builds.apache.org/job/Qpid-cpp-JMS-AMQP-0-x-Test/3986/display/redirect?page=changes>

Changes:

[lquack] QPID-7625: [Java Broker] AMQP 1.0 Enforce LifetimePolicy DeleteOnClose

[lquack] QPID-7810: [Java Broker] Temporary workaround.

[lquack] NO-JIRA: [Java Broker] fix test for java-json profile

[lquack] NO-JIRA: Increase test timeout to avoid frequent false positive

------------------------------------------
[...truncated 515.02 KB...]
Running org.apache.qpid.test.unit.topic.DurableSubscriptionTest
Tests run: 19, Failures: 0, Errors: 0, Skipped: 0, Time elapsed: 32.159 sec - in org.apache.qpid.test.unit.topic.DurableSubscriptionTest
Running org.apache.qpid.test.unit.topic.TopicSubscriberTest
Tests run: 3, Failures: 0, Errors: 0, Skipped: 0, Time elapsed: 0.368 sec - in org.apache.qpid.test.unit.topic.TopicSubscriberTest
Running org.apache.qpid.test.unit.topic.TopicSessionTest
Tests run: 9, Failures: 0, Errors: 0, Skipped: 0, Time elapsed: 11.066 sec - in org.apache.qpid.test.unit.topic.TopicSessionTest
Running org.apache.qpid.test.unit.topic.TopicPublisherTest
Tests run: 1, Failures: 0, Errors: 0, Skipped: 0, Time elapsed: 0.128 sec - in org.apache.qpid.test.unit.topic.TopicPublisherTest
Running org.apache.qpid.test.unit.message.ForeignMessageTest
Tests run: 1, Failures: 0, Errors: 0, Skipped: 0, Time elapsed: 0.284 sec - in org.apache.qpid.test.unit.message.ForeignMessageTest
Running org.apache.qpid.test.unit.message.JMSPropertiesTest
Tests run: 2, Failures: 0, Errors: 0, Skipped: 0, Time elapsed: 0.481 sec - in org.apache.qpid.test.unit.message.JMSPropertiesTest
Running org.apache.qpid.test.unit.message.StreamMessageTest
Tests run: 2, Failures: 0, Errors: 0, Skipped: 0, Time elapsed: 0.243 sec - in org.apache.qpid.test.unit.message.StreamMessageTest
Running org.apache.qpid.test.unit.message.UTF8Test
Tests run: 2, Failures: 0, Errors: 0, Skipped: 0, Time elapsed: 0.182 sec - in org.apache.qpid.test.unit.message.UTF8Test
Running org.apache.qpid.test.unit.message.JMSHeaderTest
Tests run: 1, Failures: 0, Errors: 0, Skipped: 0, Time elapsed: 0.061 sec - in org.apache.qpid.test.unit.message.JMSHeaderTest
Running org.apache.qpid.test.unit.ack.Acknowledge2ConsumersTest
Tests run: 3, Failures: 0, Errors: 0, Skipped: 0, Time elapsed: 10.515 sec - in org.apache.qpid.test.unit.ack.Acknowledge2ConsumersTest
Running org.apache.qpid.test.unit.ack.AcknowledgeOnMessageTest
Tests run: 6, Failures: 0, Errors: 0, Skipped: 0, Time elapsed: 0.697 sec - in org.apache.qpid.test.unit.ack.AcknowledgeOnMessageTest
Running org.apache.qpid.test.unit.ack.RecoverTest
Tests run: 7, Failures: 0, Errors: 0, Skipped: 0, Time elapsed: 2.877 sec - in org.apache.qpid.test.unit.ack.RecoverTest
Running org.apache.qpid.test.unit.ack.AcknowledgeTest
Tests run: 6, Failures: 0, Errors: 0, Skipped: 0, Time elapsed: 7.132 sec - in org.apache.qpid.test.unit.ack.AcknowledgeTest
Running org.apache.qpid.test.unit.ack.ClientAcknowledgeTest
Tests run: 1, Failures: 0, Errors: 0, Skipped: 0, Time elapsed: 0 sec - in org.apache.qpid.test.unit.ack.ClientAcknowledgeTest
Running org.apache.qpid.test.unit.transacted.TransactionTimeoutTest
Tests run: 15, Failures: 0, Errors: 0, Skipped: 0, Time elapsed: 0.062 sec - in org.apache.qpid.test.unit.transacted.TransactionTimeoutTest
Running org.apache.qpid.test.unit.transacted.CommitRollbackTest
Tests run: 13, Failures: 0, Errors: 0, Skipped: 0, Time elapsed: 10.169 sec - in org.apache.qpid.test.unit.transacted.CommitRollbackTest
Running org.apache.qpid.test.unit.transacted.TransactionTimeoutDisabledTest
Tests run: 2, Failures: 0, Errors: 0, Skipped: 0, Time elapsed: 0.003 sec - in org.apache.qpid.test.unit.transacted.TransactionTimeoutDisabledTest
Running org.apache.qpid.test.unit.transacted.TransactedTest
Tests run: 7, Failures: 0, Errors: 0, Skipped: 0, Time elapsed: 9.318 sec - in org.apache.qpid.test.unit.transacted.TransactedTest
Running org.apache.qpid.test.unit.close.JavaServerCloseRaceConditionTest
Tests run: 1, Failures: 0, Errors: 0, Skipped: 0, Time elapsed: 0 sec - in org.apache.qpid.test.unit.close.JavaServerCloseRaceConditionTest
Running org.apache.qpid.test.unit.close.MessageConsumerCloseTest
Tests run: 4, Failures: 0, Errors: 0, Skipped: 0, Time elapsed: 0.563 sec - in org.apache.qpid.test.unit.close.MessageConsumerCloseTest
Running org.apache.qpid.test.unit.close.TopicPublisherCloseTest
Tests run: 1, Failures: 0, Errors: 0, Skipped: 0, Time elapsed: 0.093 sec - in org.apache.qpid.test.unit.close.TopicPublisherCloseTest
Running org.apache.qpid.test.unit.ct.DurableSubscriberTest
Tests run: 4, Failures: 0, Errors: 0, Skipped: 0, Time elapsed: 0.001 sec - in org.apache.qpid.test.unit.ct.DurableSubscriberTest
Running org.apache.qpid.test.unit.client.temporaryqueue.TemporaryQueueTest
Tests run: 6, Failures: 0, Errors: 0, Skipped: 0, Time elapsed: 0.478 sec - in org.apache.qpid.test.unit.client.temporaryqueue.TemporaryQueueTest
Running org.apache.qpid.test.unit.client.TopicSessionFactoryTest
Tests run: 4, Failures: 0, Errors: 0, Skipped: 0, Time elapsed: 0.228 sec - in org.apache.qpid.test.unit.client.TopicSessionFactoryTest
Running org.apache.qpid.test.unit.client.message.ObjectMessageTest
Tests run: 9, Failures: 0, Errors: 0, Skipped: 0, Time elapsed: 0.689 sec - in org.apache.qpid.test.unit.client.message.ObjectMessageTest
Running org.apache.qpid.test.unit.client.MaxDeliveryCountTest
Tests run: 8, Failures: 0, Errors: 0, Skipped: 0, Time elapsed: 0.006 sec - in org.apache.qpid.test.unit.client.MaxDeliveryCountTest
Running org.apache.qpid.test.unit.client.AMQSessionTest
Tests run: 3, Failures: 0, Errors: 0, Skipped: 0, Time elapsed: 0.123 sec - in org.apache.qpid.test.unit.client.AMQSessionTest
Running org.apache.qpid.test.unit.client.DynamicQueueExchangeCreateTest
Tests run: 9, Failures: 0, Errors: 0, Skipped: 0, Time elapsed: 0.004 sec - in org.apache.qpid.test.unit.client.DynamicQueueExchangeCreateTest
Running org.apache.qpid.test.unit.client.QueueSessionFactoryTest
Tests run: 5, Failures: 0, Errors: 0, Skipped: 0, Time elapsed: 0.255 sec - in org.apache.qpid.test.unit.client.QueueSessionFactoryTest
Running org.apache.qpid.test.unit.client.channelclose.CloseWithBlockingReceiveTest
Tests run: 1, Failures: 0, Errors: 0, Skipped: 0, Time elapsed: 1.076 sec - in org.apache.qpid.test.unit.client.channelclose.CloseWithBlockingReceiveTest
Running org.apache.qpid.test.unit.client.connection.ConnectionFactoryTest
Tests run: 2, Failures: 0, Errors: 0, Skipped: 0, Time elapsed: 0.114 sec - in org.apache.qpid.test.unit.client.connection.ConnectionFactoryTest
Running org.apache.qpid.test.unit.client.connection.ConnectionTest
Tests run: 13, Failures: 0, Errors: 0, Skipped: 0, Time elapsed: 0.672 sec - in org.apache.qpid.test.unit.client.connection.ConnectionTest
Running org.apache.qpid.test.unit.client.connection.BrokerClosesClientConnectionTest
Tests run: 3, Failures: 0, Errors: 1, Skipped: 0, Time elapsed: 22.334 sec <<< FAILURE!
- in org.apache.qpid.test.unit.client.connection.BrokerClosesClientConnectionTest
testNoDeliveryAfterBrokerClose(org.apache.qpid.test.unit.client.connection.BrokerClosesClientConnectionTest)
 Time elapsed: 2.168 sec  <<< ERROR!
javax.jms.JMSException: Error closing connection: javax.jms.JMSException: Error closing session:
org.apache.qpid.AMQException: Command was interrupted because of failover, before being sent
[error code 541: internal error]
Caused by: javax.jms.JMSException: Error closing session: org.apache.qpid.AMQException: Command
was interrupted because of failover, before being sent [error code 541: internal error]
Caused by: org.apache.qpid.AMQException: Command was interrupted because of failover, before
being sent

Running org.apache.qpid.test.unit.client.connection.ConnectionStartTest
Tests run: 2, Failures: 0, Errors: 0, Skipped: 0, Time elapsed: 1.216 sec - in org.apache.qpid.test.unit.client.connection.ConnectionStartTest
Running org.apache.qpid.test.unit.client.connection.ExceptionListenerTest
Tests run: 4, Failures: 0, Errors: 0, Skipped: 0, Time elapsed: 0.213 sec - in org.apache.qpid.test.unit.client.connection.ExceptionListenerTest
Running org.apache.qpid.test.unit.basic.BytesMessageTest
Tests run: 2, Failures: 0, Errors: 0, Skipped: 0, Time elapsed: 0.38 sec - in org.apache.qpid.test.unit.basic.BytesMessageTest
Running org.apache.qpid.test.unit.basic.TextMessageTest
Tests run: 1, Failures: 0, Errors: 0, Skipped: 0, Time elapsed: 0.346 sec - in org.apache.qpid.test.unit.basic.TextMessageTest
Running org.apache.qpid.test.unit.basic.close.CloseTest
Tests run: 1, Failures: 0, Errors: 0, Skipped: 0, Time elapsed: 0.09 sec - in org.apache.qpid.test.unit.basic.close.CloseTest
Running org.apache.qpid.test.unit.basic.PubSubTwoConnectionTest
Tests run: 1, Failures: 0, Errors: 0, Skipped: 0, Time elapsed: 0.083 sec - in org.apache.qpid.test.unit.basic.PubSubTwoConnectionTest
Running org.apache.qpid.test.unit.basic.ObjectMessageTest
Tests run: 1, Failures: 0, Errors: 0, Skipped: 0, Time elapsed: 0.221 sec - in org.apache.qpid.test.unit.basic.ObjectMessageTest
Running org.apache.qpid.test.unit.basic.SessionStartTest
Tests run: 1, Failures: 0, Errors: 0, Skipped: 0, Time elapsed: 0.098 sec - in org.apache.qpid.test.unit.basic.SessionStartTest
Running org.apache.qpid.test.unit.basic.PropertyValueTest
Tests run: 8, Failures: 0, Errors: 0, Skipped: 0, Time elapsed: 3.438 sec - in org.apache.qpid.test.unit.basic.PropertyValueTest
Running org.apache.qpid.test.unit.basic.LargeMessageTest
Tests run: 10, Failures: 0, Errors: 0, Skipped: 0, Time elapsed: 1.012 sec - in org.apache.qpid.test.unit.basic.LargeMessageTest
Running org.apache.qpid.test.unit.basic.InvalidDestinationTest
Tests run: 3, Failures: 0, Errors: 0, Skipped: 0, Time elapsed: 0.246 sec - in org.apache.qpid.test.unit.basic.InvalidDestinationTest
Running org.apache.qpid.test.unit.basic.MapMessageTest
Tests run: 1, Failures: 0, Errors: 0, Skipped: 0, Time elapsed: 0.331 sec - in org.apache.qpid.test.unit.basic.MapMessageTest
Running org.apache.qpid.test.unit.basic.MultipleConnectionTest
Tests run: 1, Failures: 0, Errors: 0, Skipped: 0, Time elapsed: 0.517 sec - in org.apache.qpid.test.unit.basic.MultipleConnectionTest
Running org.apache.qpid.test.unit.basic.FieldTableMessageTest
Tests run: 1, Failures: 0, Errors: 0, Skipped: 0, Time elapsed: 0.121 sec - in org.apache.qpid.test.unit.basic.FieldTableMessageTest
Running org.apache.qpid.client.prefetch.PrefetchBehaviourTest
Tests run: 4, Failures: 0, Errors: 0, Skipped: 0, Time elapsed: 5.358 sec - in org.apache.qpid.client.prefetch.PrefetchBehaviourTest
Running org.apache.qpid.client.session.QueueDeleteTest
Tests run: 2, Failures: 0, Errors: 0, Skipped: 0, Time elapsed: 0.169 sec - in org.apache.qpid.client.session.QueueDeleteTest
Running org.apache.qpid.client.session.QueueDeclareTest
Tests run: 3, Failures: 0, Errors: 0, Skipped: 0, Time elapsed: 0.312 sec - in org.apache.qpid.client.session.QueueDeclareTest
Running org.apache.qpid.client.session.ExchangeDeleteTest
Tests run: 2, Failures: 0, Errors: 0, Skipped: 0, Time elapsed: 0.176 sec - in org.apache.qpid.client.session.ExchangeDeleteTest
Running org.apache.qpid.client.AsynchMessageListenerTest
Tests run: 9, Failures: 0, Errors: 0, Skipped: 0, Time elapsed: 1.291 sec - in org.apache.qpid.client.AsynchMessageListenerTest
Running org.apache.qpid.client.message.AMQPEncodedMapMessageTest
Tests run: 6, Failures: 0, Errors: 0, Skipped: 0, Time elapsed: 0.425 sec - in org.apache.qpid.client.message.AMQPEncodedMapMessageTest
Running org.apache.qpid.client.message.ObjectMessageClassWhitelistingTest
Tests run: 9, Failures: 0, Errors: 0, Skipped: 0, Time elapsed: 0.704 sec - in org.apache.qpid.client.message.ObjectMessageClassWhitelistingTest
Running org.apache.qpid.client.ssl.SSLTest
Tests run: 17, Failures: 0, Errors: 0, Skipped: 0, Time elapsed: 0.03 sec - in org.apache.qpid.client.ssl.SSLTest
Running org.apache.qpid.client.failover.MultipleBrokersFailoverTest
Tests run: 2, Failures: 0, Errors: 0, Skipped: 0, Time elapsed: 0.003 sec - in org.apache.qpid.client.failover.MultipleBrokersFailoverTest
Running org.apache.qpid.client.failover.FailoverBehaviourTest
Tests run: 37, Failures: 0, Errors: 0, Skipped: 0, Time elapsed: 49.419 sec - in org.apache.qpid.client.failover.FailoverBehaviourTest
Running org.apache.qpid.client.failover.AddressBasedFailoverBehaviourTest
Tests run: 37, Failures: 0, Errors: 0, Skipped: 0, Time elapsed: 79.849 sec - in org.apache.qpid.client.failover.AddressBasedFailoverBehaviourTest
Running org.apache.qpid.client.AMQQueueDeferredOrderingTest
Tests run: 1, Failures: 0, Errors: 0, Skipped: 0, Time elapsed: 2.499 sec - in org.apache.qpid.client.AMQQueueDeferredOrderingTest
Running org.apache.qpid.client.SynchReceiveTest
Tests run: 4, Failures: 0, Errors: 0, Skipped: 0, Time elapsed: 1.291 sec - in org.apache.qpid.client.SynchReceiveTest
Running org.apache.qpid.client.redelivered.RedeliveredMessageTest
Tests run: 1, Failures: 0, Errors: 0, Skipped: 0, Time elapsed: 0.135 sec - in org.apache.qpid.client.redelivered.RedeliveredMessageTest
Running org.apache.qpid.client.SyncPublishTest
Tests run: 3, Failures: 0, Errors: 0, Skipped: 0, Time elapsed: 0.009 sec - in org.apache.qpid.client.SyncPublishTest
Running org.apache.qpid.client.SessionCreateTest
Tests run: 1, Failures: 0, Errors: 0, Skipped: 0, Time elapsed: 102.642 sec - in org.apache.qpid.client.SessionCreateTest
Running org.apache.qpid.client.HeartbeatTest
Tests run: 8, Failures: 0, Errors: 0, Skipped: 0, Time elapsed: 14.389 sec - in org.apache.qpid.client.HeartbeatTest
Running org.apache.qpid.client.connection.ExistingSocketTest
Tests run: 2, Failures: 0, Errors: 0, Skipped: 0, Time elapsed: 0.248 sec - in org.apache.qpid.client.connection.ExistingSocketTest
Running org.apache.qpid.client.TemporaryQueuePrefixTest
Tests run: 4, Failures: 0, Errors: 0, Skipped: 0, Time elapsed: 0.003 sec - in org.apache.qpid.client.TemporaryQueuePrefixTest
Running org.apache.qpid.systest.prefetch.ZeroPrefetchTest
Tests run: 1, Failures: 0, Errors: 0, Skipped: 0, Time elapsed: 0.149 sec - in org.apache.qpid.systest.prefetch.ZeroPrefetchTest
Running org.apache.qpid.systest.rest.PreemtiveAuthRestTest
Tests run: 8, Failures: 0, Errors: 0, Skipped: 0, Time elapsed: 0.013 sec - in org.apache.qpid.systest.rest.PreemtiveAuthRestTest
Running org.apache.qpid.systest.rest.ExchangeRestTest
Tests run: 4, Failures: 0, Errors: 0, Skipped: 0, Time elapsed: 0 sec - in org.apache.qpid.systest.rest.ExchangeRestTest
Running org.apache.qpid.systest.rest.SaslRestTest
Tests run: 14, Failures: 0, Errors: 0, Skipped: 0, Time elapsed: 0.022 sec - in org.apache.qpid.systest.rest.SaslRestTest
Running org.apache.qpid.systest.rest.QueryRestTest
Tests run: 4, Failures: 0, Errors: 0, Skipped: 0, Time elapsed: 0.002 sec - in org.apache.qpid.systest.rest.QueryRestTest
Running org.apache.qpid.systest.rest.BrokerRestHttpsClientCertAuthTest
Tests run: 1, Failures: 0, Errors: 0, Skipped: 0, Time elapsed: 0 sec - in org.apache.qpid.systest.rest.BrokerRestHttpsClientCertAuthTest
Running org.apache.qpid.systest.rest.GroupProviderRestTest
Tests run: 10, Failures: 0, Errors: 0, Skipped: 0, Time elapsed: 0.006 sec - in org.apache.qpid.systest.rest.GroupProviderRestTest
Running org.apache.qpid.systest.rest.UserRestTest
Tests run: 7, Failures: 0, Errors: 0, Skipped: 0, Time elapsed: 0.004 sec - in org.apache.qpid.systest.rest.UserRestTest
Running org.apache.qpid.systest.rest.AnonymousAccessRestTest
Tests run: 4, Failures: 0, Errors: 0, Skipped: 0, Time elapsed: 0.001 sec - in org.apache.qpid.systest.rest.AnonymousAccessRestTest
Running org.apache.qpid.systest.rest.GroupRestTest
Tests run: 5, Failures: 0, Errors: 0, Skipped: 0, Time elapsed: 0.005 sec - in org.apache.qpid.systest.rest.GroupRestTest
Running org.apache.qpid.systest.rest.TrustStoreRestTest
Tests run: 5, Failures: 0, Errors: 0, Skipped: 0, Time elapsed: 0 sec - in org.apache.qpid.systest.rest.TrustStoreRestTest
Running org.apache.qpid.systest.rest.PortRestTest
Tests run: 12, Failures: 0, Errors: 0, Skipped: 0, Time elapsed: 0.013 sec - in org.apache.qpid.systest.rest.PortRestTest
Running org.apache.qpid.systest.rest.ExportImportMessagesRestTest
Tests run: 1, Failures: 0, Errors: 0, Skipped: 0, Time elapsed: 0 sec - in org.apache.qpid.systest.rest.ExportImportMessagesRestTest
Running org.apache.qpid.systest.rest.MessagesRestTest
Tests run: 14, Failures: 0, Errors: 0, Skipped: 0, Time elapsed: 0.016 sec - in org.apache.qpid.systest.rest.MessagesRestTest
Running org.apache.qpid.systest.rest.CompressedResponsesRestTest
Tests run: 4, Failures: 0, Errors: 0, Skipped: 0, Time elapsed: 0.007 sec - in org.apache.qpid.systest.rest.CompressedResponsesRestTest
Running org.apache.qpid.systest.rest.VirtualHostNodeRestTest
Tests run: 9, Failures: 0, Errors: 0, Skipped: 0, Time elapsed: 0.002 sec - in org.apache.qpid.systest.rest.VirtualHostNodeRestTest
Running org.apache.qpid.systest.rest.HttpManagementRestTest
Tests run: 3, Failures: 0, Errors: 0, Skipped: 0, Time elapsed: 0.008 sec - in org.apache.qpid.systest.rest.HttpManagementRestTest
Running org.apache.qpid.systest.rest.BrokerRestHttpAndHttpsTest
Tests run: 4, Failures: 0, Errors: 0, Skipped: 0, Time elapsed: 0.001 sec - in org.apache.qpid.systest.rest.BrokerRestHttpAndHttpsTest
Running org.apache.qpid.systest.rest.QueueRestTest
Tests run: 3, Failures: 0, Errors: 0, Skipped: 0, Time elapsed: 0.003 sec - in org.apache.qpid.systest.rest.QueueRestTest
Running org.apache.qpid.systest.rest.ConnectionRestTest
Tests run: 9, Failures: 0, Errors: 0, Skipped: 0, Time elapsed: 0.005 sec - in org.apache.qpid.systest.rest.ConnectionRestTest
Running org.apache.qpid.systest.rest.VirtualHostRestTest
Tests run: 29, Failures: 0, Errors: 0, Skipped: 0, Time elapsed: 0.034 sec - in org.apache.qpid.systest.rest.VirtualHostRestTest
Running org.apache.qpid.systest.rest.BrokerRestHttpsTest
Tests run: 1, Failures: 0, Errors: 0, Skipped: 0, Time elapsed: 0 sec - in org.apache.qpid.systest.rest.BrokerRestHttpsTest
Running org.apache.qpid.systest.rest.acl.VirtualHostAccessControlProviderRestTest
Tests run: 6, Failures: 0, Errors: 0, Skipped: 0, Time elapsed: 0.002 sec - in org.apache.qpid.systest.rest.acl.VirtualHostAccessControlProviderRestTest
Running org.apache.qpid.systest.rest.acl.GroupRestACLTest
Tests run: 4, Failures: 0, Errors: 0, Skipped: 0, Time elapsed: 0.001 sec - in org.apache.qpid.systest.rest.acl.GroupRestACLTest
Running org.apache.qpid.systest.rest.acl.VirtualHostNodeACLTest
Tests run: 3, Failures: 0, Errors: 0, Skipped: 0, Time elapsed: 0 sec - in org.apache.qpid.systest.rest.acl.VirtualHostNodeACLTest
Running org.apache.qpid.systest.rest.acl.VirtualHostACLTest
Tests run: 5, Failures: 0, Errors: 0, Skipped: 0, Time elapsed: 0.011 sec - in org.apache.qpid.systest.rest.acl.VirtualHostACLTest
Running org.apache.qpid.systest.rest.acl.BrokerACLTest
Tests run: 45, Failures: 0, Errors: 0, Skipped: 0, Time elapsed: 0.028 sec - in org.apache.qpid.systest.rest.acl.BrokerACLTest
Running org.apache.qpid.systest.rest.acl.ExchangeRestACLTest
Tests run: 9, Failures: 0, Errors: 0, Skipped: 0, Time elapsed: 0.008 sec - in org.apache.qpid.systest.rest.acl.ExchangeRestACLTest
Running org.apache.qpid.systest.rest.acl.UserRestACLTest
Tests run: 3, Failures: 0, Errors: 0, Skipped: 0, Time elapsed: 0 sec - in org.apache.qpid.systest.rest.acl.UserRestACLTest
Running org.apache.qpid.systest.rest.acl.QueueRestACLTest
Tests run: 6, Failures: 0, Errors: 0, Skipped: 0, Time elapsed: 0.005 sec - in org.apache.qpid.systest.rest.acl.QueueRestACLTest
Running org.apache.qpid.systest.rest.VirtualHostLoggerRestTest
Tests run: 2, Failures: 0, Errors: 0, Skipped: 0, Time elapsed: 0 sec - in org.apache.qpid.systest.rest.VirtualHostLoggerRestTest
Running org.apache.qpid.systest.rest.StructureRestTest
Tests run: 1, Failures: 0, Errors: 0, Skipped: 0, Time elapsed: 0.001 sec - in org.apache.qpid.systest.rest.StructureRestTest
Running org.apache.qpid.systest.rest.BrokerRestTest
Tests run: 8, Failures: 0, Errors: 0, Skipped: 0, Time elapsed: 0.002 sec - in org.apache.qpid.systest.rest.BrokerRestTest
Running org.apache.qpid.systest.rest.KeyStoreRestTest
Tests run: 5, Failures: 0, Errors: 0, Skipped: 0, Time elapsed: 0.004 sec - in org.apache.qpid.systest.rest.KeyStoreRestTest
Running org.apache.qpid.systest.rest.AuthenticationProviderRestTest
Tests run: 9, Failures: 0, Errors: 0, Skipped: 0, Time elapsed: 0.004 sec - in org.apache.qpid.systest.rest.AuthenticationProviderRestTest
Running org.apache.qpid.systest.rest.AccessControlProviderRestTest
Tests run: 4, Failures: 0, Errors: 0, Skipped: 0, Time elapsed: 0.004 sec - in org.apache.qpid.systest.rest.AccessControlProviderRestTest
Running org.apache.qpid.systest.rest.UserPreferencesRestTest
Tests run: 9, Failures: 0, Errors: 0, Skipped: 0, Time elapsed: 0.007 sec - in org.apache.qpid.systest.rest.UserPreferencesRestTest
Running org.apache.qpid.systest.rest.PublishMessageRestTest
Tests run: 6, Failures: 0, Errors: 0, Skipped: 0, Time elapsed: 0.005 sec - in org.apache.qpid.systest.rest.PublishMessageRestTest
Running org.apache.qpid.systest.messageencryption.MessageEncryptionTest
Tests run: 8, Failures: 0, Errors: 0, Skipped: 0, Time elapsed: 0.092 sec - in org.apache.qpid.systest.messageencryption.MessageEncryptionTest
Running org.apache.qpid.systest.MessageCompressionTest
Tests run: 10, Failures: 0, Errors: 0, Skipped: 0, Time elapsed: 0.008 sec - in org.apache.qpid.systest.MessageCompressionTest
Running org.apache.qpid.systest.management.amqp.AmqpManagementTest
Tests run: 13, Failures: 0, Errors: 0, Skipped: 0, Time elapsed: 0.008 sec - in org.apache.qpid.systest.management.amqp.AmqpManagementTest

Results :

Tests in error: 
  BrokerClosesClientConnectionTest>QpidTestCase.run:165->QpidBrokerTestCase.runBare:91->QpidBrokerTestCase.tearDown:568
ยป JMS

Tests run: 1033, Failures: 0, Errors: 1, Skipped: 0

[INFO] ------------------------------------------------------------------------
[INFO] BUILD FAILURE
[INFO] ------------------------------------------------------------------------
[INFO] Total time: 08:22 min
[INFO] Finished at: 2017-06-06T10:48:40Z
[INFO] Final Memory: 40M/538M
[INFO] ------------------------------------------------------------------------
[ERROR] Failed to execute goal org.apache.maven.plugins:maven-surefire-plugin:2.19.1:test
(integration-test) on project qpid-systests: There are test failures.
[ERROR] 
[ERROR] Please refer to <https://builds.apache.org/job/Qpid-cpp-JMS-AMQP-0-x-Test/3986/artifact/qpid-broker-j/systests/target/surefire-reports/cpp>
for the individual test results.
[ERROR] -> [Help 1]
[ERROR] 
[ERROR] To see the full stack trace of the errors, re-run Maven with the -e switch.
[ERROR] Re-run Maven using the -X switch to enable full debug logging.
[ERROR] 
[ERROR] For more information about the errors and possible solutions, please read the following
articles:
[ERROR] [Help 1] http://cwiki.apache.org/confluence/display/MAVEN/MojoFailureException
Build step 'Invoke top-level Maven targets' marked build as failure
[locks-and-latches] Releasing all the locks
[locks-and-latches] All the locks released
Archiving artifacts
Recording test results

Mime
View raw message