qpid-notifications mailing list archives

Site index · List index
Message view « Date » · « Thread »
Top « Date » · « Thread »
From Apache Jenkins Server <jenk...@builds.apache.org>
Subject Build failed in Jenkins: Qpid-cpp-JMS-AMQP-0-x-Test #4012
Date Wed, 21 Jun 2017 17:29:47 GMT
See <https://builds.apache.org/job/Qpid-cpp-JMS-AMQP-0-x-Test/4012/display/redirect?page=changes>

Changes:

[kwall] QPID-7820: Address review comments from Alex Rudyy <orudyy@apache.org>

[kwall] QPID-7831: Address review comments from Alex Rudyy <orudyy@apache.org>

------------------------------------------
[...truncated 516.64 KB...]
Tests run: 7, Failures: 0, Errors: 0, Skipped: 0, Time elapsed: 0.546 sec - in org.apache.qpid.test.client.message.JMSDestinationTest
Running org.apache.qpid.test.client.message.JMSXUserIDTest
Tests run: 2, Failures: 0, Errors: 0, Skipped: 0, Time elapsed: 0.156 sec - in org.apache.qpid.test.client.message.JMSXUserIDTest
Running org.apache.qpid.test.client.message.JMSReplyToTest
Tests run: 2, Failures: 0, Errors: 0, Skipped: 0, Time elapsed: 0.268 sec - in org.apache.qpid.test.client.message.JMSReplyToTest
Running org.apache.qpid.test.client.message.MessageToStringTest
Tests run: 5, Failures: 0, Errors: 0, Skipped: 0, Time elapsed: 0.607 sec - in org.apache.qpid.test.client.message.MessageToStringTest
Running org.apache.qpid.test.client.message.SelectorTest
Tests run: 5, Failures: 0, Errors: 0, Skipped: 0, Time elapsed: 3.393 sec - in org.apache.qpid.test.client.message.SelectorTest
Running org.apache.qpid.test.client.message.ObjectMessageTest
Tests run: 5, Failures: 0, Errors: 0, Skipped: 0, Time elapsed: 0.91 sec - in org.apache.qpid.test.client.message.ObjectMessageTest
Running org.apache.qpid.test.client.ImmediateAndMandatoryPublishingTest
Tests run: 13, Failures: 0, Errors: 0, Skipped: 0, Time elapsed: 0.009 sec - in org.apache.qpid.test.client.ImmediateAndMandatoryPublishingTest
Running org.apache.qpid.test.client.QueueBrowserDupsOkTest
Tests run: 7, Failures: 0, Errors: 0, Skipped: 0, Time elapsed: 5.188 sec - in org.apache.qpid.test.client.QueueBrowserDupsOkTest
Running org.apache.qpid.test.client.QueueBrowserNoAckTest
Tests run: 7, Failures: 0, Errors: 0, Skipped: 0, Time elapsed: 4.938 sec - in org.apache.qpid.test.client.QueueBrowserNoAckTest
Running org.apache.qpid.test.unit.basic.BytesMessageTest
Tests run: 2, Failures: 0, Errors: 0, Skipped: 0, Time elapsed: 0.35 sec - in org.apache.qpid.test.unit.basic.BytesMessageTest
Running org.apache.qpid.test.unit.basic.FieldTableMessageTest
Tests run: 1, Failures: 0, Errors: 0, Skipped: 0, Time elapsed: 0.142 sec - in org.apache.qpid.test.unit.basic.FieldTableMessageTest
Running org.apache.qpid.test.unit.basic.LargeMessageTest
Tests run: 10, Failures: 0, Errors: 0, Skipped: 0, Time elapsed: 0.885 sec - in org.apache.qpid.test.unit.basic.LargeMessageTest
Running org.apache.qpid.test.unit.basic.MapMessageTest
Tests run: 1, Failures: 0, Errors: 0, Skipped: 0, Time elapsed: 0.298 sec - in org.apache.qpid.test.unit.basic.MapMessageTest
Running org.apache.qpid.test.unit.basic.PubSubTwoConnectionTest
Tests run: 1, Failures: 0, Errors: 0, Skipped: 0, Time elapsed: 0.073 sec - in org.apache.qpid.test.unit.basic.PubSubTwoConnectionTest
Running org.apache.qpid.test.unit.basic.SessionStartTest
Tests run: 1, Failures: 0, Errors: 0, Skipped: 0, Time elapsed: 0.081 sec - in org.apache.qpid.test.unit.basic.SessionStartTest
Running org.apache.qpid.test.unit.basic.MultipleConnectionTest
Tests run: 1, Failures: 0, Errors: 0, Skipped: 0, Time elapsed: 0.51 sec - in org.apache.qpid.test.unit.basic.MultipleConnectionTest
Running org.apache.qpid.test.unit.basic.PropertyValueTest
Tests run: 8, Failures: 0, Errors: 0, Skipped: 0, Time elapsed: 2.766 sec - in org.apache.qpid.test.unit.basic.PropertyValueTest
Running org.apache.qpid.test.unit.basic.ObjectMessageTest
Tests run: 1, Failures: 0, Errors: 0, Skipped: 0, Time elapsed: 0.27 sec - in org.apache.qpid.test.unit.basic.ObjectMessageTest
Running org.apache.qpid.test.unit.basic.TextMessageTest
Tests run: 1, Failures: 0, Errors: 0, Skipped: 0, Time elapsed: 0.235 sec - in org.apache.qpid.test.unit.basic.TextMessageTest
Running org.apache.qpid.test.unit.basic.close.CloseTest
Tests run: 1, Failures: 0, Errors: 0, Skipped: 0, Time elapsed: 0.072 sec - in org.apache.qpid.test.unit.basic.close.CloseTest
Running org.apache.qpid.test.unit.basic.InvalidDestinationTest
Tests run: 3, Failures: 0, Errors: 0, Skipped: 0, Time elapsed: 0.233 sec - in org.apache.qpid.test.unit.basic.InvalidDestinationTest
Running org.apache.qpid.test.unit.client.channelclose.CloseWithBlockingReceiveTest
Tests run: 1, Failures: 0, Errors: 0, Skipped: 0, Time elapsed: 1.075 sec - in org.apache.qpid.test.unit.client.channelclose.CloseWithBlockingReceiveTest
Running org.apache.qpid.test.unit.client.TopicSessionFactoryTest
Tests run: 4, Failures: 0, Errors: 0, Skipped: 0, Time elapsed: 0.19 sec - in org.apache.qpid.test.unit.client.TopicSessionFactoryTest
Running org.apache.qpid.test.unit.client.MaxDeliveryCountTest
Tests run: 7, Failures: 0, Errors: 0, Skipped: 0, Time elapsed: 0.006 sec - in org.apache.qpid.test.unit.client.MaxDeliveryCountTest
Running org.apache.qpid.test.unit.client.temporaryqueue.TemporaryQueueTest
Tests run: 6, Failures: 0, Errors: 0, Skipped: 0, Time elapsed: 0.405 sec - in org.apache.qpid.test.unit.client.temporaryqueue.TemporaryQueueTest
Running org.apache.qpid.test.unit.client.QueueSessionFactoryTest
Tests run: 5, Failures: 0, Errors: 0, Skipped: 0, Time elapsed: 0.254 sec - in org.apache.qpid.test.unit.client.QueueSessionFactoryTest
Running org.apache.qpid.test.unit.client.message.ObjectMessageTest
Tests run: 9, Failures: 0, Errors: 0, Skipped: 0, Time elapsed: 1.15 sec - in org.apache.qpid.test.unit.client.message.ObjectMessageTest
Running org.apache.qpid.test.unit.client.connection.ConnectionFactoryTest
Tests run: 2, Failures: 0, Errors: 0, Skipped: 0, Time elapsed: 0.11 sec - in org.apache.qpid.test.unit.client.connection.ConnectionFactoryTest
Running org.apache.qpid.test.unit.client.connection.ConnectionStartTest
Tests run: 2, Failures: 0, Errors: 0, Skipped: 0, Time elapsed: 1.245 sec - in org.apache.qpid.test.unit.client.connection.ConnectionStartTest
Running org.apache.qpid.test.unit.client.connection.ConnectionTest
Tests run: 13, Failures: 0, Errors: 0, Skipped: 0, Time elapsed: 0.839 sec - in org.apache.qpid.test.unit.client.connection.ConnectionTest
Running org.apache.qpid.test.unit.client.connection.BrokerClosesClientConnectionTest
Tests run: 4, Failures: 0, Errors: 0, Skipped: 0, Time elapsed: 22.339 sec - in org.apache.qpid.test.unit.client.connection.BrokerClosesClientConnectionTest
Running org.apache.qpid.test.unit.client.connection.ExceptionListenerTest
Tests run: 4, Failures: 0, Errors: 0, Skipped: 0, Time elapsed: 0.161 sec - in org.apache.qpid.test.unit.client.connection.ExceptionListenerTest
Running org.apache.qpid.test.unit.client.AMQSessionTest
Tests run: 3, Failures: 0, Errors: 0, Skipped: 0, Time elapsed: 0.142 sec - in org.apache.qpid.test.unit.client.AMQSessionTest
Running org.apache.qpid.test.unit.client.DynamicQueueExchangeCreateTest
Tests run: 9, Failures: 0, Errors: 0, Skipped: 0, Time elapsed: 0.01 sec - in org.apache.qpid.test.unit.client.DynamicQueueExchangeCreateTest
Running org.apache.qpid.test.unit.transacted.TransactionTimeoutDisabledTest
Tests run: 2, Failures: 0, Errors: 0, Skipped: 0, Time elapsed: 0 sec - in org.apache.qpid.test.unit.transacted.TransactionTimeoutDisabledTest
Running org.apache.qpid.test.unit.transacted.TransactionTimeoutTest
Tests run: 15, Failures: 0, Errors: 0, Skipped: 0, Time elapsed: 0.013 sec - in org.apache.qpid.test.unit.transacted.TransactionTimeoutTest
Running org.apache.qpid.test.unit.transacted.CommitRollbackTest
Tests run: 13, Failures: 0, Errors: 0, Skipped: 0, Time elapsed: 9.898 sec - in org.apache.qpid.test.unit.transacted.CommitRollbackTest
Running org.apache.qpid.test.unit.transacted.TransactedTest
Tests run: 7, Failures: 0, Errors: 0, Skipped: 0, Time elapsed: 8.519 sec - in org.apache.qpid.test.unit.transacted.TransactedTest
Running org.apache.qpid.test.unit.ct.DurableSubscriberTest
Tests run: 4, Failures: 0, Errors: 0, Skipped: 0, Time elapsed: 0.008 sec - in org.apache.qpid.test.unit.ct.DurableSubscriberTest
Running org.apache.qpid.test.unit.ack.AcknowledgeOnMessageTest
Tests run: 6, Failures: 0, Errors: 0, Skipped: 0, Time elapsed: 0.699 sec - in org.apache.qpid.test.unit.ack.AcknowledgeOnMessageTest
Running org.apache.qpid.test.unit.ack.RecoverTest
Tests run: 7, Failures: 0, Errors: 0, Skipped: 0, Time elapsed: 2.184 sec - in org.apache.qpid.test.unit.ack.RecoverTest
Running org.apache.qpid.test.unit.ack.Acknowledge2ConsumersTest
Tests run: 3, Failures: 0, Errors: 0, Skipped: 0, Time elapsed: 9.905 sec - in org.apache.qpid.test.unit.ack.Acknowledge2ConsumersTest
Running org.apache.qpid.test.unit.ack.ClientAcknowledgeTest
Tests run: 1, Failures: 0, Errors: 0, Skipped: 0, Time elapsed: 0.001 sec - in org.apache.qpid.test.unit.ack.ClientAcknowledgeTest
Running org.apache.qpid.test.unit.ack.AcknowledgeTest
Tests run: 6, Failures: 0, Errors: 0, Skipped: 0, Time elapsed: 6.717 sec - in org.apache.qpid.test.unit.ack.AcknowledgeTest
Running org.apache.qpid.test.unit.topic.TopicSessionTest
Tests run: 9, Failures: 0, Errors: 0, Skipped: 0, Time elapsed: 10.258 sec - in org.apache.qpid.test.unit.topic.TopicSessionTest
Running org.apache.qpid.test.unit.topic.DurableSubscriptionTest
Tests run: 19, Failures: 0, Errors: 0, Skipped: 0, Time elapsed: 31.172 sec - in org.apache.qpid.test.unit.topic.DurableSubscriptionTest
Running org.apache.qpid.test.unit.topic.TopicPublisherTest
Tests run: 1, Failures: 0, Errors: 0, Skipped: 0, Time elapsed: 0.084 sec - in org.apache.qpid.test.unit.topic.TopicPublisherTest
Running org.apache.qpid.test.unit.topic.TemporaryTopicTest
Tests run: 5, Failures: 0, Errors: 0, Skipped: 0, Time elapsed: 0.426 sec - in org.apache.qpid.test.unit.topic.TemporaryTopicTest
Running org.apache.qpid.test.unit.topic.TopicSubscriberTest
Tests run: 3, Failures: 0, Errors: 0, Skipped: 0, Time elapsed: 0.267 sec - in org.apache.qpid.test.unit.topic.TopicSubscriberTest
Running org.apache.qpid.test.unit.message.StreamMessageTest
Tests run: 2, Failures: 0, Errors: 0, Skipped: 0, Time elapsed: 0.209 sec - in org.apache.qpid.test.unit.message.StreamMessageTest
Running org.apache.qpid.test.unit.message.JMSPropertiesTest
Tests run: 2, Failures: 0, Errors: 0, Skipped: 0, Time elapsed: 0.191 sec - in org.apache.qpid.test.unit.message.JMSPropertiesTest
Running org.apache.qpid.test.unit.message.JMSHeaderTest
Tests run: 1, Failures: 0, Errors: 0, Skipped: 0, Time elapsed: 0.062 sec - in org.apache.qpid.test.unit.message.JMSHeaderTest
Running org.apache.qpid.test.unit.message.ForeignMessageTest
Tests run: 1, Failures: 0, Errors: 0, Skipped: 0, Time elapsed: 0.114 sec - in org.apache.qpid.test.unit.message.ForeignMessageTest
Running org.apache.qpid.test.unit.message.UTF8Test
Tests run: 2, Failures: 0, Errors: 0, Skipped: 0, Time elapsed: 0.176 sec - in org.apache.qpid.test.unit.message.UTF8Test
Running org.apache.qpid.test.unit.close.MessageConsumerCloseTest
Tests run: 4, Failures: 0, Errors: 0, Skipped: 0, Time elapsed: 0.545 sec - in org.apache.qpid.test.unit.close.MessageConsumerCloseTest
Running org.apache.qpid.test.unit.close.TopicPublisherCloseTest
Tests run: 1, Failures: 0, Errors: 0, Skipped: 0, Time elapsed: 0.062 sec - in org.apache.qpid.test.unit.close.TopicPublisherCloseTest
Running org.apache.qpid.test.unit.close.JavaServerCloseRaceConditionTest
Tests run: 1, Failures: 0, Errors: 0, Skipped: 0, Time elapsed: 0.002 sec - in org.apache.qpid.test.unit.close.JavaServerCloseRaceConditionTest
Running org.apache.qpid.test.utils.SpawnedBrokerHolderTest
Tests run: 1, Failures: 0, Errors: 0, Skipped: 0, Time elapsed: 0.31 sec - in org.apache.qpid.test.utils.SpawnedBrokerHolderTest
Running org.apache.qpid.test.utils.BrokerCommandHelperTest
Tests run: 1, Failures: 0, Errors: 0, Skipped: 0, Time elapsed: 0.001 sec - in org.apache.qpid.test.utils.BrokerCommandHelperTest
Running org.apache.qpid.server.exchange.ReturnUnroutableMandatoryMessageTest
Tests run: 3, Failures: 0, Errors: 0, Skipped: 0, Time elapsed: 0.011 sec - in org.apache.qpid.server.exchange.ReturnUnroutableMandatoryMessageTest
Running org.apache.qpid.server.failover.FailoverMethodTest
Tests run: 3, Failures: 0, Errors: 0, Skipped: 0, Time elapsed: 0.003 sec - in org.apache.qpid.server.failover.FailoverMethodTest
Running org.apache.qpid.server.routing.AlternateBindingRoutingTest
Tests run: 1, Failures: 0, Errors: 1, Skipped: 0, Time elapsed: 0.109 sec <<< FAILURE!
- in org.apache.qpid.server.routing.AlternateBindingRoutingTest
testFanoutExchangeAsAlternateBinding(org.apache.qpid.server.routing.AlternateBindingRoutingTest)
 Time elapsed: 0.108 sec  <<< ERROR!
javax.jms.JMSException: Error creating producer
	at org.apache.qpid.server.routing.AlternateBindingRoutingTest.testFanoutExchangeAsAlternateBinding(AlternateBindingRoutingTest.java:50)
Caused by: org.apache.qpid.QpidException: The name '$management' supplied in the address doesn't
resolve to an exchange or a queue
	at org.apache.qpid.server.routing.AlternateBindingRoutingTest.testFanoutExchangeAsAlternateBinding(AlternateBindingRoutingTest.java:50)

Running org.apache.qpid.server.security.auth.manager.ScramSha1AuthenticationManagerTest
Tests run: 0, Failures: 0, Errors: 0, Skipped: 0, Time elapsed: 0.001 sec - in org.apache.qpid.server.security.auth.manager.ScramSha1AuthenticationManagerTest
Running org.apache.qpid.server.security.auth.manager.MultipleAuthenticationManagersTest
Tests run: 0, Failures: 0, Errors: 0, Skipped: 0, Time elapsed: 0 sec - in org.apache.qpid.server.security.auth.manager.MultipleAuthenticationManagersTest
Running org.apache.qpid.server.security.auth.manager.MD5AuthenticationManagerTest
Tests run: 0, Failures: 0, Errors: 0, Skipped: 0, Time elapsed: 0 sec - in org.apache.qpid.server.security.auth.manager.MD5AuthenticationManagerTest
Running org.apache.qpid.server.security.auth.manager.ExternalAuthenticationTest
Tests run: 0, Failures: 0, Errors: 0, Skipped: 0, Time elapsed: 0 sec - in org.apache.qpid.server.security.auth.manager.ExternalAuthenticationTest
Running org.apache.qpid.server.security.auth.manager.ScramSha256AuthenticationManagerTest
Tests run: 0, Failures: 0, Errors: 0, Skipped: 0, Time elapsed: 0 sec - in org.apache.qpid.server.security.auth.manager.ScramSha256AuthenticationManagerTest
Running org.apache.qpid.server.security.acl.ExhaustiveACLTest
Tests run: 0, Failures: 0, Errors: 0, Skipped: 0, Time elapsed: 0 sec - in org.apache.qpid.server.security.acl.ExhaustiveACLTest
Running org.apache.qpid.server.security.acl.ExternalACLTest
Tests run: 0, Failures: 0, Errors: 0, Skipped: 0, Time elapsed: 0.029 sec - in org.apache.qpid.server.security.acl.ExternalACLTest
Running org.apache.qpid.server.store.VirtualHostMessageStoreTest
Tests run: 0, Failures: 0, Errors: 0, Skipped: 0, Time elapsed: 0.019 sec - in org.apache.qpid.server.store.VirtualHostMessageStoreTest
Running org.apache.qpid.server.store.SplitStoreTest
Tests run: 0, Failures: 0, Errors: 0, Skipped: 0, Time elapsed: 0.016 sec - in org.apache.qpid.server.store.SplitStoreTest
Running org.apache.qpid.server.store.PersistentStoreTest
Tests run: 0, Failures: 0, Errors: 0, Skipped: 0, Time elapsed: 0.008 sec - in org.apache.qpid.server.store.PersistentStoreTest
Running org.apache.qpid.server.queue.NodeAutoCreationPolicyTest
Tests run: 0, Failures: 0, Errors: 0, Skipped: 0, Time elapsed: 0.011 sec - in org.apache.qpid.server.queue.NodeAutoCreationPolicyTest
Running org.apache.qpid.server.queue.QueueMessageDurabilityTest
Tests run: 0, Failures: 0, Errors: 0, Skipped: 0, Time elapsed: 0.012 sec - in org.apache.qpid.server.queue.QueueMessageDurabilityTest
Running org.apache.qpid.server.queue.MultipleTransactedBatchProducerTest
Tests run: 1, Failures: 0, Errors: 0, Skipped: 0, Time elapsed: 10.436 sec - in org.apache.qpid.server.queue.MultipleTransactedBatchProducerTest
Running org.apache.qpid.server.queue.FlowToDiskTest
Tests run: 1, Failures: 0, Errors: 0, Skipped: 0, Time elapsed: 0 sec - in org.apache.qpid.server.queue.FlowToDiskTest
Running org.apache.qpid.server.queue.ConsumerPriorityTest
Tests run: 5, Failures: 0, Errors: 0, Skipped: 0, Time elapsed: 0.003 sec - in org.apache.qpid.server.queue.ConsumerPriorityTest
Running org.apache.qpid.server.queue.ModelTest
Tests run: 4, Failures: 0, Errors: 0, Skipped: 0, Time elapsed: 0.002 sec - in org.apache.qpid.server.queue.ModelTest
Running org.apache.qpid.server.queue.DefaultFiltersTest
Tests run: 2, Failures: 0, Errors: 0, Skipped: 0, Time elapsed: 0 sec - in org.apache.qpid.server.queue.DefaultFiltersTest
Running org.apache.qpid.server.queue.EnsureNondestructiveConsumersTest
Tests run: 1, Failures: 0, Errors: 0, Skipped: 0, Time elapsed: 0 sec - in org.apache.qpid.server.queue.EnsureNondestructiveConsumersTest
Running org.apache.qpid.server.queue.PriorityQueueTest
Tests run: 3, Failures: 0, Errors: 0, Skipped: 0, Time elapsed: 1.437 sec - in org.apache.qpid.server.queue.PriorityQueueTest
Running org.apache.qpid.server.queue.ProducerFlowControlTest
Tests run: 7, Failures: 0, Errors: 0, Skipped: 0, Time elapsed: 0.011 sec - in org.apache.qpid.server.queue.ProducerFlowControlTest
Running org.apache.qpid.server.queue.SortedQueueTest
Tests run: 8, Failures: 0, Errors: 0, Skipped: 0, Time elapsed: 0.001 sec - in org.apache.qpid.server.queue.SortedQueueTest
Running org.apache.qpid.server.queue.LiveQueueOperationsTest
Tests run: 1, Failures: 0, Errors: 0, Skipped: 0, Time elapsed: 0.001 sec - in org.apache.qpid.server.queue.LiveQueueOperationsTest
Running org.apache.qpid.server.queue.QueueDepthWithSelectorTest
Tests run: 1, Failures: 0, Errors: 0, Skipped: 0, Time elapsed: 0.241 sec - in org.apache.qpid.server.queue.QueueDepthWithSelectorTest
Running org.apache.qpid.server.queue.MessageGroupQueueTest
Tests run: 9, Failures: 0, Errors: 0, Skipped: 0, Time elapsed: 6.404 sec - in org.apache.qpid.server.queue.MessageGroupQueueTest
Running org.apache.qpid.server.queue.LastValueQueueTest
Tests run: 7, Failures: 0, Errors: 0, Skipped: 0, Time elapsed: 13.518 sec - in org.apache.qpid.server.queue.LastValueQueueTest
Running org.apache.qpid.server.queue.ArrivalTimeFilterTest
Tests run: 2, Failures: 0, Errors: 0, Skipped: 0, Time elapsed: 0.004 sec - in org.apache.qpid.server.queue.ArrivalTimeFilterTest
Running org.apache.qpid.server.queue.QueueBindTest
Tests run: 2, Failures: 0, Errors: 0, Skipped: 0, Time elapsed: 0.197 sec - in org.apache.qpid.server.queue.QueueBindTest
Running org.apache.qpid.server.queue.TimeToLiveTest
Tests run: 5, Failures: 0, Errors: 0, Skipped: 0, Time elapsed: 2.171 sec - in org.apache.qpid.server.queue.TimeToLiveTest
Running org.apache.qpid.server.stats.StatisticsReportingTest
Tests run: 2, Failures: 0, Errors: 0, Skipped: 0, Time elapsed: 0 sec - in org.apache.qpid.server.stats.StatisticsReportingTest
Running org.apache.qpid.server.BrokerStartupTest
Tests run: 2, Failures: 0, Errors: 0, Skipped: 0, Time elapsed: 0 sec - in org.apache.qpid.server.BrokerStartupTest
Running org.apache.qpid.server.logging.ConnectionLoggingTest
Tests run: 2, Failures: 0, Errors: 0, Skipped: 0, Time elapsed: 0 sec - in org.apache.qpid.server.logging.ConnectionLoggingTest
Running org.apache.qpid.server.logging.AccessControlLoggingTest
Tests run: 4, Failures: 0, Errors: 0, Skipped: 0, Time elapsed: 0 sec - in org.apache.qpid.server.logging.AccessControlLoggingTest
Running org.apache.qpid.server.logging.BrokerLoggingTest
Tests run: 8, Failures: 0, Errors: 0, Skipped: 0, Time elapsed: 0.001 sec - in org.apache.qpid.server.logging.BrokerLoggingTest
Running org.apache.qpid.server.logging.QueueLoggingTest
Tests run: 2, Failures: 0, Errors: 0, Skipped: 0, Time elapsed: 0.001 sec - in org.apache.qpid.server.logging.QueueLoggingTest
Running org.apache.qpid.server.logging.ConsumerLoggingTest
Tests run: 6, Failures: 0, Errors: 0, Skipped: 0, Time elapsed: 0.001 sec - in org.apache.qpid.server.logging.ConsumerLoggingTest
Running org.apache.qpid.server.logging.TransientQueueLoggingTest
Tests run: 5, Failures: 0, Errors: 0, Skipped: 0, Time elapsed: 0 sec - in org.apache.qpid.server.logging.TransientQueueLoggingTest
Running org.apache.qpid.server.logging.ExchangeLoggingTest
Tests run: 4, Failures: 0, Errors: 0, Skipped: 0, Time elapsed: 0 sec - in org.apache.qpid.server.logging.ExchangeLoggingTest
Running org.apache.qpid.server.logging.ChannelLoggingTest
Tests run: 6, Failures: 0, Errors: 0, Skipped: 0, Time elapsed: 0.002 sec - in org.apache.qpid.server.logging.ChannelLoggingTest
Running org.apache.qpid.server.logging.AlertingTest
Tests run: 3, Failures: 0, Errors: 0, Skipped: 0, Time elapsed: 0.001 sec - in org.apache.qpid.server.logging.AlertingTest
Running org.apache.qpid.server.logging.VirtualHostLoggingTest
Tests run: 2, Failures: 0, Errors: 0, Skipped: 0, Time elapsed: 0 sec - in org.apache.qpid.server.logging.VirtualHostLoggingTest
Running org.apache.qpid.server.logging.DurableQueueLoggingTest
Tests run: 5, Failures: 0, Errors: 0, Skipped: 0, Time elapsed: 0.001 sec - in org.apache.qpid.server.logging.DurableQueueLoggingTest
Running org.apache.qpid.server.message.MessageProtocolConversionTest
Tests run: 2, Failures: 0, Errors: 0, Skipped: 0, Time elapsed: 0.001 sec - in org.apache.qpid.server.message.MessageProtocolConversionTest
Running org.apache.qpid.server.persistent.NoLocalAfterRecoveryTest
Tests run: 2, Failures: 0, Errors: 0, Skipped: 0, Time elapsed: 0 sec - in org.apache.qpid.server.persistent.NoLocalAfterRecoveryTest
Running org.apache.qpid.server.SupportedProtocolVersionsTest
Tests run: 4, Failures: 0, Errors: 0, Skipped: 0, Time elapsed: 0.003 sec - in org.apache.qpid.server.SupportedProtocolVersionsTest
Running org.apache.qpid.server.AbruptClientDisconnectTest
Tests run: 2, Failures: 0, Errors: 0, Skipped: 0, Time elapsed: 5.378 sec - in org.apache.qpid.server.AbruptClientDisconnectTest

Results :

Tests in error: 
  AlternateBindingRoutingTest>QpidTestCase.run:165->QpidBrokerTestCase.runBare:91->QpidTestCase.runTest:181->testFanoutExchangeAsAlternateBinding:50->QpidBrokerTestCase.createEntityUsingAmqpManagement:355
ยป JMS

Tests run: 968, Failures: 0, Errors: 1, Skipped: 0

[INFO] ------------------------------------------------------------------------
[INFO] BUILD FAILURE
[INFO] ------------------------------------------------------------------------
[INFO] Total time: 07:42 min
[INFO] Finished at: 2017-06-21T17:23:08Z
[INFO] Final Memory: 34M/632M
[INFO] ------------------------------------------------------------------------
[ERROR] Failed to execute goal org.apache.maven.plugins:maven-surefire-plugin:2.19.1:test
(integration-test) on project qpid-systests: There are test failures.
[ERROR] 
[ERROR] Please refer to <https://builds.apache.org/job/Qpid-cpp-JMS-AMQP-0-x-Test/4012/artifact/qpid-broker-j/systests/target/surefire-reports/cpp>
for the individual test results.
[ERROR] -> [Help 1]
[ERROR] 
[ERROR] To see the full stack trace of the errors, re-run Maven with the -e switch.
[ERROR] Re-run Maven using the -X switch to enable full debug logging.
[ERROR] 
[ERROR] For more information about the errors and possible solutions, please read the following
articles:
[ERROR] [Help 1] http://cwiki.apache.org/confluence/display/MAVEN/MojoFailureException
Build step 'Invoke top-level Maven targets' marked build as failure
[locks-and-latches] Releasing all the locks
[locks-and-latches] All the locks released
Archiving artifacts
Recording test results

Mime
View raw message