qpid-notifications mailing list archives

Site index · List index
Message view « Date » · « Thread »
Top « Date » · « Thread »
From Apache Jenkins Server <jenk...@builds.apache.org>
Subject Build failed in Jenkins: Qpid-cpp-JMS-AMQP-0-x-Test #3995
Date Fri, 09 Jun 2017 10:46:37 GMT
See <https://builds.apache.org/job/Qpid-cpp-JMS-AMQP-0-x-Test/3995/display/redirect?page=changes>

Changes:

[kwall] QPID-7731: Return the bound port rather than configured port number

------------------------------------------
[...truncated 514.75 KB...]
Running org.apache.qpid.systest.rest.QueryRestTest
Tests run: 4, Failures: 0, Errors: 0, Skipped: 0, Time elapsed: 0.007 sec - in org.apache.qpid.systest.rest.QueryRestTest
Running org.apache.qpid.systest.rest.HttpManagementRestTest
Tests run: 3, Failures: 0, Errors: 0, Skipped: 0, Time elapsed: 0.008 sec - in org.apache.qpid.systest.rest.HttpManagementRestTest
Running org.apache.qpid.systest.rest.PreemtiveAuthRestTest
Tests run: 8, Failures: 0, Errors: 0, Skipped: 0, Time elapsed: 0.008 sec - in org.apache.qpid.systest.rest.PreemtiveAuthRestTest
Running org.apache.qpid.systest.rest.KeyStoreRestTest
Tests run: 5, Failures: 0, Errors: 0, Skipped: 0, Time elapsed: 0.022 sec - in org.apache.qpid.systest.rest.KeyStoreRestTest
Running org.apache.qpid.systest.rest.VirtualHostNodeRestTest
Tests run: 9, Failures: 0, Errors: 0, Skipped: 0, Time elapsed: 0.012 sec - in org.apache.qpid.systest.rest.VirtualHostNodeRestTest
Running org.apache.qpid.systest.rest.SaslRestTest
Tests run: 14, Failures: 0, Errors: 0, Skipped: 0, Time elapsed: 0.04 sec - in org.apache.qpid.systest.rest.SaslRestTest
Running org.apache.qpid.systest.rest.AuthenticationProviderRestTest
Tests run: 9, Failures: 0, Errors: 0, Skipped: 0, Time elapsed: 0.03 sec - in org.apache.qpid.systest.rest.AuthenticationProviderRestTest
Running org.apache.qpid.systest.rest.ExportImportMessagesRestTest
Tests run: 1, Failures: 0, Errors: 0, Skipped: 0, Time elapsed: 0 sec - in org.apache.qpid.systest.rest.ExportImportMessagesRestTest
Running org.apache.qpid.systest.rest.UserPreferencesRestTest
Tests run: 9, Failures: 0, Errors: 0, Skipped: 0, Time elapsed: 0.109 sec - in org.apache.qpid.systest.rest.UserPreferencesRestTest
Running org.apache.qpid.systest.rest.QueueRestTest
Tests run: 3, Failures: 0, Errors: 0, Skipped: 0, Time elapsed: 0.004 sec - in org.apache.qpid.systest.rest.QueueRestTest
Running org.apache.qpid.systest.rest.UserRestTest
Tests run: 7, Failures: 0, Errors: 0, Skipped: 0, Time elapsed: 0.017 sec - in org.apache.qpid.systest.rest.UserRestTest
Running org.apache.qpid.systest.rest.BrokerRestHttpAndHttpsTest
Tests run: 4, Failures: 0, Errors: 0, Skipped: 0, Time elapsed: 0.003 sec - in org.apache.qpid.systest.rest.BrokerRestHttpAndHttpsTest
Running org.apache.qpid.systest.rest.AccessControlProviderRestTest
Tests run: 4, Failures: 0, Errors: 0, Skipped: 0, Time elapsed: 0 sec - in org.apache.qpid.systest.rest.AccessControlProviderRestTest
Running org.apache.qpid.systest.rest.TrustStoreRestTest
Tests run: 5, Failures: 0, Errors: 0, Skipped: 0, Time elapsed: 0.016 sec - in org.apache.qpid.systest.rest.TrustStoreRestTest
Running org.apache.qpid.systest.rest.BrokerRestHttpsTest
Tests run: 1, Failures: 0, Errors: 0, Skipped: 0, Time elapsed: 0.007 sec - in org.apache.qpid.systest.rest.BrokerRestHttpsTest
Running org.apache.qpid.systest.rest.VirtualHostLoggerRestTest
Tests run: 2, Failures: 0, Errors: 0, Skipped: 0, Time elapsed: 0.005 sec - in org.apache.qpid.systest.rest.VirtualHostLoggerRestTest
Running org.apache.qpid.systest.rest.MessagesRestTest
Tests run: 14, Failures: 0, Errors: 0, Skipped: 0, Time elapsed: 0.038 sec - in org.apache.qpid.systest.rest.MessagesRestTest
Running org.apache.qpid.systest.rest.acl.BrokerACLTest
Tests run: 45, Failures: 0, Errors: 0, Skipped: 0, Time elapsed: 0.107 sec - in org.apache.qpid.systest.rest.acl.BrokerACLTest
Running org.apache.qpid.systest.rest.acl.VirtualHostAccessControlProviderRestTest
Tests run: 6, Failures: 0, Errors: 0, Skipped: 0, Time elapsed: 0.005 sec - in org.apache.qpid.systest.rest.acl.VirtualHostAccessControlProviderRestTest
Running org.apache.qpid.systest.rest.acl.ExchangeRestACLTest
Tests run: 9, Failures: 0, Errors: 0, Skipped: 0, Time elapsed: 0.01 sec - in org.apache.qpid.systest.rest.acl.ExchangeRestACLTest
Running org.apache.qpid.systest.rest.acl.GroupRestACLTest
Tests run: 4, Failures: 0, Errors: 0, Skipped: 0, Time elapsed: 0.006 sec - in org.apache.qpid.systest.rest.acl.GroupRestACLTest
Running org.apache.qpid.systest.rest.acl.UserRestACLTest
Tests run: 3, Failures: 0, Errors: 0, Skipped: 0, Time elapsed: 0.001 sec - in org.apache.qpid.systest.rest.acl.UserRestACLTest
Running org.apache.qpid.systest.rest.acl.VirtualHostACLTest
Tests run: 5, Failures: 0, Errors: 0, Skipped: 0, Time elapsed: 0.003 sec - in org.apache.qpid.systest.rest.acl.VirtualHostACLTest
Running org.apache.qpid.systest.rest.acl.QueueRestACLTest
Tests run: 6, Failures: 0, Errors: 0, Skipped: 0, Time elapsed: 0.009 sec - in org.apache.qpid.systest.rest.acl.QueueRestACLTest
Running org.apache.qpid.systest.rest.acl.VirtualHostNodeACLTest
Tests run: 3, Failures: 0, Errors: 0, Skipped: 0, Time elapsed: 0.004 sec - in org.apache.qpid.systest.rest.acl.VirtualHostNodeACLTest
Running org.apache.qpid.systest.rest.GroupProviderRestTest
Tests run: 10, Failures: 0, Errors: 0, Skipped: 0, Time elapsed: 0.019 sec - in org.apache.qpid.systest.rest.GroupProviderRestTest
Running org.apache.qpid.systest.rest.ExchangeRestTest
Tests run: 4, Failures: 0, Errors: 0, Skipped: 0, Time elapsed: 0.006 sec - in org.apache.qpid.systest.rest.ExchangeRestTest
Running org.apache.qpid.systest.rest.GroupRestTest
Tests run: 5, Failures: 0, Errors: 0, Skipped: 0, Time elapsed: 0.011 sec - in org.apache.qpid.systest.rest.GroupRestTest
Running org.apache.qpid.systest.rest.AnonymousAccessRestTest
Tests run: 4, Failures: 0, Errors: 0, Skipped: 0, Time elapsed: 0.007 sec - in org.apache.qpid.systest.rest.AnonymousAccessRestTest
Running org.apache.qpid.systest.AnonymousProducerTest
Tests run: 4, Failures: 2, Errors: 0, Skipped: 0, Time elapsed: 0.516 sec <<< FAILURE!
- in org.apache.qpid.systest.AnonymousProducerTest
testSyncPublishIntoNonExistingQueue(org.apache.qpid.systest.AnonymousProducerTest)  Time elapsed:
0.131 sec  <<< FAILURE!
junit.framework.AssertionFailedError: Send to unknown destination should result in error
	at org.apache.qpid.systest.AnonymousProducerTest.testSyncPublishIntoNonExistingQueue(AnonymousProducerTest.java:108)

testPublishIntoNonExistingQueue(org.apache.qpid.systest.AnonymousProducerTest)  Time elapsed:
0.135 sec  <<< FAILURE!
junit.framework.AssertionFailedError: Expected exception was not thrown
	at org.apache.qpid.systest.AnonymousProducerTest.testPublishIntoNonExistingQueue(AnonymousProducerTest.java:92)

Running org.apache.qpid.systest.MessageCompressionTest
Tests run: 10, Failures: 0, Errors: 0, Skipped: 0, Time elapsed: 0.003 sec - in org.apache.qpid.systest.MessageCompressionTest
Running org.apache.qpid.systest.management.amqp.AmqpManagementTest
Tests run: 13, Failures: 0, Errors: 0, Skipped: 0, Time elapsed: 0.038 sec - in org.apache.qpid.systest.management.amqp.AmqpManagementTest
Running org.apache.qpid.systest.prefetch.ZeroPrefetchTest
Tests run: 1, Failures: 0, Errors: 0, Skipped: 0, Time elapsed: 0.19 sec - in org.apache.qpid.systest.prefetch.ZeroPrefetchTest
Running org.apache.qpid.test.unit.transacted.CommitRollbackTest
Tests run: 13, Failures: 0, Errors: 0, Skipped: 0, Time elapsed: 11.998 sec - in org.apache.qpid.test.unit.transacted.CommitRollbackTest
Running org.apache.qpid.test.unit.transacted.TransactedTest
Tests run: 7, Failures: 0, Errors: 0, Skipped: 0, Time elapsed: 9.724 sec - in org.apache.qpid.test.unit.transacted.TransactedTest
Running org.apache.qpid.test.unit.transacted.TransactionTimeoutTest
Tests run: 15, Failures: 0, Errors: 0, Skipped: 0, Time elapsed: 0.041 sec - in org.apache.qpid.test.unit.transacted.TransactionTimeoutTest
Running org.apache.qpid.test.unit.transacted.TransactionTimeoutDisabledTest
Tests run: 2, Failures: 0, Errors: 0, Skipped: 0, Time elapsed: 0.004 sec - in org.apache.qpid.test.unit.transacted.TransactionTimeoutDisabledTest
Running org.apache.qpid.test.unit.ack.ClientAcknowledgeTest
Tests run: 1, Failures: 0, Errors: 0, Skipped: 0, Time elapsed: 0 sec - in org.apache.qpid.test.unit.ack.ClientAcknowledgeTest
Running org.apache.qpid.test.unit.ack.Acknowledge2ConsumersTest
Tests run: 3, Failures: 0, Errors: 0, Skipped: 0, Time elapsed: 11.73 sec - in org.apache.qpid.test.unit.ack.Acknowledge2ConsumersTest
Running org.apache.qpid.test.unit.ack.AcknowledgeOnMessageTest
Tests run: 6, Failures: 0, Errors: 0, Skipped: 0, Time elapsed: 1.93 sec - in org.apache.qpid.test.unit.ack.AcknowledgeOnMessageTest
Running org.apache.qpid.test.unit.ack.RecoverTest
Tests run: 7, Failures: 0, Errors: 0, Skipped: 0, Time elapsed: 3.944 sec - in org.apache.qpid.test.unit.ack.RecoverTest
Running org.apache.qpid.test.unit.ack.AcknowledgeTest
Tests run: 6, Failures: 0, Errors: 0, Skipped: 0, Time elapsed: 7.11 sec - in org.apache.qpid.test.unit.ack.AcknowledgeTest
Running org.apache.qpid.test.unit.close.JavaServerCloseRaceConditionTest
Tests run: 1, Failures: 0, Errors: 0, Skipped: 0, Time elapsed: 0 sec - in org.apache.qpid.test.unit.close.JavaServerCloseRaceConditionTest
Running org.apache.qpid.test.unit.close.TopicPublisherCloseTest
Tests run: 1, Failures: 0, Errors: 0, Skipped: 0, Time elapsed: 0.075 sec - in org.apache.qpid.test.unit.close.TopicPublisherCloseTest
Running org.apache.qpid.test.unit.close.MessageConsumerCloseTest
Tests run: 4, Failures: 0, Errors: 0, Skipped: 0, Time elapsed: 0.686 sec - in org.apache.qpid.test.unit.close.MessageConsumerCloseTest
Running org.apache.qpid.test.unit.topic.TopicSessionTest
Tests run: 9, Failures: 0, Errors: 0, Skipped: 0, Time elapsed: 10.617 sec - in org.apache.qpid.test.unit.topic.TopicSessionTest
Running org.apache.qpid.test.unit.topic.TopicSubscriberTest
Tests run: 3, Failures: 0, Errors: 0, Skipped: 0, Time elapsed: 0.366 sec - in org.apache.qpid.test.unit.topic.TopicSubscriberTest
Running org.apache.qpid.test.unit.topic.TemporaryTopicTest
Tests run: 5, Failures: 0, Errors: 0, Skipped: 0, Time elapsed: 0.58 sec - in org.apache.qpid.test.unit.topic.TemporaryTopicTest
Running org.apache.qpid.test.unit.topic.DurableSubscriptionTest
Tests run: 19, Failures: 0, Errors: 0, Skipped: 0, Time elapsed: 32.129 sec - in org.apache.qpid.test.unit.topic.DurableSubscriptionTest
Running org.apache.qpid.test.unit.topic.TopicPublisherTest
Tests run: 1, Failures: 0, Errors: 0, Skipped: 0, Time elapsed: 0.095 sec - in org.apache.qpid.test.unit.topic.TopicPublisherTest
Running org.apache.qpid.test.unit.ct.DurableSubscriberTest
Tests run: 4, Failures: 0, Errors: 0, Skipped: 0, Time elapsed: 0.005 sec - in org.apache.qpid.test.unit.ct.DurableSubscriberTest
Running org.apache.qpid.test.unit.message.StreamMessageTest
Tests run: 2, Failures: 0, Errors: 0, Skipped: 0, Time elapsed: 0.259 sec - in org.apache.qpid.test.unit.message.StreamMessageTest
Running org.apache.qpid.test.unit.message.UTF8Test
Tests run: 2, Failures: 0, Errors: 0, Skipped: 0, Time elapsed: 0.236 sec - in org.apache.qpid.test.unit.message.UTF8Test
Running org.apache.qpid.test.unit.message.JMSPropertiesTest
Tests run: 2, Failures: 0, Errors: 0, Skipped: 0, Time elapsed: 0.226 sec - in org.apache.qpid.test.unit.message.JMSPropertiesTest
Running org.apache.qpid.test.unit.message.ForeignMessageTest
Tests run: 1, Failures: 0, Errors: 0, Skipped: 0, Time elapsed: 0.196 sec - in org.apache.qpid.test.unit.message.ForeignMessageTest
Running org.apache.qpid.test.unit.message.JMSHeaderTest
Tests run: 1, Failures: 0, Errors: 0, Skipped: 0, Time elapsed: 0.076 sec - in org.apache.qpid.test.unit.message.JMSHeaderTest
Running org.apache.qpid.test.unit.basic.BytesMessageTest
Tests run: 2, Failures: 0, Errors: 0, Skipped: 0, Time elapsed: 0.69 sec - in org.apache.qpid.test.unit.basic.BytesMessageTest
Running org.apache.qpid.test.unit.basic.ObjectMessageTest
Tests run: 1, Failures: 0, Errors: 0, Skipped: 0, Time elapsed: 0.423 sec - in org.apache.qpid.test.unit.basic.ObjectMessageTest
Running org.apache.qpid.test.unit.basic.close.CloseTest
Tests run: 1, Failures: 0, Errors: 0, Skipped: 0, Time elapsed: 0.125 sec - in org.apache.qpid.test.unit.basic.close.CloseTest
Running org.apache.qpid.test.unit.basic.MapMessageTest
Tests run: 1, Failures: 0, Errors: 0, Skipped: 0, Time elapsed: 0.593 sec - in org.apache.qpid.test.unit.basic.MapMessageTest
Running org.apache.qpid.test.unit.basic.LargeMessageTest
Tests run: 10, Failures: 0, Errors: 0, Skipped: 0, Time elapsed: 1.217 sec - in org.apache.qpid.test.unit.basic.LargeMessageTest
Running org.apache.qpid.test.unit.basic.TextMessageTest
Tests run: 1, Failures: 0, Errors: 0, Skipped: 0, Time elapsed: 0.304 sec - in org.apache.qpid.test.unit.basic.TextMessageTest
Running org.apache.qpid.test.unit.basic.PropertyValueTest
Tests run: 8, Failures: 0, Errors: 0, Skipped: 0, Time elapsed: 2.542 sec - in org.apache.qpid.test.unit.basic.PropertyValueTest
Running org.apache.qpid.test.unit.basic.PubSubTwoConnectionTest
Tests run: 1, Failures: 0, Errors: 0, Skipped: 0, Time elapsed: 0.12 sec - in org.apache.qpid.test.unit.basic.PubSubTwoConnectionTest
Running org.apache.qpid.test.unit.basic.MultipleConnectionTest
Tests run: 1, Failures: 0, Errors: 0, Skipped: 0, Time elapsed: 0.602 sec - in org.apache.qpid.test.unit.basic.MultipleConnectionTest
Running org.apache.qpid.test.unit.basic.InvalidDestinationTest
Tests run: 3, Failures: 0, Errors: 0, Skipped: 0, Time elapsed: 0.299 sec - in org.apache.qpid.test.unit.basic.InvalidDestinationTest
Running org.apache.qpid.test.unit.basic.FieldTableMessageTest
Tests run: 1, Failures: 0, Errors: 0, Skipped: 0, Time elapsed: 0.191 sec - in org.apache.qpid.test.unit.basic.FieldTableMessageTest
Running org.apache.qpid.test.unit.basic.SessionStartTest
Tests run: 1, Failures: 0, Errors: 0, Skipped: 0, Time elapsed: 0.098 sec - in org.apache.qpid.test.unit.basic.SessionStartTest
Running org.apache.qpid.test.unit.client.connection.ConnectionStartTest
Tests run: 2, Failures: 0, Errors: 0, Skipped: 0, Time elapsed: 1.234 sec - in org.apache.qpid.test.unit.client.connection.ConnectionStartTest
Running org.apache.qpid.test.unit.client.connection.BrokerClosesClientConnectionTest
Tests run: 4, Failures: 0, Errors: 0, Skipped: 0, Time elapsed: 22.363 sec - in org.apache.qpid.test.unit.client.connection.BrokerClosesClientConnectionTest
Running org.apache.qpid.test.unit.client.connection.ConnectionFactoryTest
Tests run: 2, Failures: 0, Errors: 0, Skipped: 0, Time elapsed: 0.213 sec - in org.apache.qpid.test.unit.client.connection.ConnectionFactoryTest
Running org.apache.qpid.test.unit.client.connection.ExceptionListenerTest
Tests run: 4, Failures: 0, Errors: 0, Skipped: 0, Time elapsed: 0.412 sec - in org.apache.qpid.test.unit.client.connection.ExceptionListenerTest
Running org.apache.qpid.test.unit.client.connection.ConnectionTest
Tests run: 13, Failures: 0, Errors: 0, Skipped: 0, Time elapsed: 1.064 sec - in org.apache.qpid.test.unit.client.connection.ConnectionTest
Running org.apache.qpid.test.unit.client.QueueSessionFactoryTest
Tests run: 5, Failures: 0, Errors: 0, Skipped: 0, Time elapsed: 0.508 sec - in org.apache.qpid.test.unit.client.QueueSessionFactoryTest
Running org.apache.qpid.test.unit.client.MaxDeliveryCountTest
Tests run: 8, Failures: 0, Errors: 0, Skipped: 0, Time elapsed: 0.007 sec - in org.apache.qpid.test.unit.client.MaxDeliveryCountTest
Running org.apache.qpid.test.unit.client.DynamicQueueExchangeCreateTest
Tests run: 9, Failures: 0, Errors: 0, Skipped: 0, Time elapsed: 0.016 sec - in org.apache.qpid.test.unit.client.DynamicQueueExchangeCreateTest
Running org.apache.qpid.test.unit.client.TopicSessionFactoryTest
Tests run: 4, Failures: 0, Errors: 0, Skipped: 0, Time elapsed: 0.415 sec - in org.apache.qpid.test.unit.client.TopicSessionFactoryTest
Running org.apache.qpid.test.unit.client.AMQSessionTest
Tests run: 3, Failures: 0, Errors: 0, Skipped: 0, Time elapsed: 0.283 sec - in org.apache.qpid.test.unit.client.AMQSessionTest
Running org.apache.qpid.test.unit.client.message.ObjectMessageTest
Tests run: 9, Failures: 0, Errors: 0, Skipped: 0, Time elapsed: 1.291 sec - in org.apache.qpid.test.unit.client.message.ObjectMessageTest
Running org.apache.qpid.test.unit.client.temporaryqueue.TemporaryQueueTest
Tests run: 6, Failures: 0, Errors: 0, Skipped: 0, Time elapsed: 0.65 sec - in org.apache.qpid.test.unit.client.temporaryqueue.TemporaryQueueTest
Running org.apache.qpid.test.unit.client.channelclose.CloseWithBlockingReceiveTest
Tests run: 1, Failures: 0, Errors: 0, Skipped: 0, Time elapsed: 1.172 sec - in org.apache.qpid.test.unit.client.channelclose.CloseWithBlockingReceiveTest
Running org.apache.qpid.test.utils.SpawnedBrokerHolderTest
Tests run: 1, Failures: 0, Errors: 0, Skipped: 0, Time elapsed: 0.215 sec - in org.apache.qpid.test.utils.SpawnedBrokerHolderTest
Running org.apache.qpid.test.utils.BrokerCommandHelperTest
Tests run: 1, Failures: 0, Errors: 0, Skipped: 0, Time elapsed: 0.003 sec - in org.apache.qpid.test.utils.BrokerCommandHelperTest
Running org.apache.qpid.test.client.CloseOnNoRouteForMandatoryMessageTest
Tests run: 4, Failures: 0, Errors: 0, Skipped: 0, Time elapsed: 0.008 sec - in org.apache.qpid.test.client.CloseOnNoRouteForMandatoryMessageTest
Running org.apache.qpid.test.client.QueueBrowserClientAckTest
Tests run: 7, Failures: 0, Errors: 0, Skipped: 0, Time elapsed: 7.102 sec - in org.apache.qpid.test.client.QueueBrowserClientAckTest
Running org.apache.qpid.test.client.destination.AddressBasedDestinationTest
Tests run: 45, Failures: 0, Errors: 0, Skipped: 0, Time elapsed: 17.86 sec - in org.apache.qpid.test.client.destination.AddressBasedDestinationTest
Running org.apache.qpid.test.client.QueueBrowserNoAckTest
Tests run: 7, Failures: 0, Errors: 0, Skipped: 0, Time elapsed: 7.104 sec - in org.apache.qpid.test.client.QueueBrowserNoAckTest
Running org.apache.qpid.test.client.QueueBrowserPreAckTest
Tests run: 7, Failures: 0, Errors: 0, Skipped: 0, Time elapsed: 6.938 sec - in org.apache.qpid.test.client.QueueBrowserPreAckTest
Running org.apache.qpid.test.client.ConsumerFlowControlTest
Tests run: 3, Failures: 0, Errors: 0, Skipped: 0, Time elapsed: 0.003 sec - in org.apache.qpid.test.client.ConsumerFlowControlTest
Running org.apache.qpid.test.client.QueueBrowserAutoAckTest
Tests run: 7, Failures: 0, Errors: 0, Skipped: 0, Time elapsed: 7.073 sec - in org.apache.qpid.test.client.QueueBrowserAutoAckTest
Running org.apache.qpid.test.client.failover.FailoverTest
Tests run: 7, Failures: 0, Errors: 0, Skipped: 0, Time elapsed: 1.212 sec - in org.apache.qpid.test.client.failover.FailoverTest
Running org.apache.qpid.test.client.QueueBrowserDupsOkTest
Tests run: 7, Failures: 0, Errors: 0, Skipped: 0, Time elapsed: 5.408 sec - in org.apache.qpid.test.client.QueueBrowserDupsOkTest
Running org.apache.qpid.test.client.queue.QueuePolicyTest
Tests run: 2, Failures: 0, Errors: 0, Skipped: 0, Time elapsed: 0.204 sec - in org.apache.qpid.test.client.queue.QueuePolicyTest
Running org.apache.qpid.test.client.queue.QueueReceiverTest
Tests run: 1, Failures: 0, Errors: 0, Skipped: 0, Time elapsed: 0.096 sec - in org.apache.qpid.test.client.queue.QueueReceiverTest
Running org.apache.qpid.test.client.message.MessageToStringTest
Tests run: 5, Failures: 0, Errors: 0, Skipped: 0, Time elapsed: 0.611 sec - in org.apache.qpid.test.client.message.MessageToStringTest
Running org.apache.qpid.test.client.message.JMSXUserIDTest
Tests run: 2, Failures: 0, Errors: 0, Skipped: 0, Time elapsed: 0.234 sec - in org.apache.qpid.test.client.message.JMSXUserIDTest
Running org.apache.qpid.test.client.message.SelectorTest
Tests run: 5, Failures: 0, Errors: 0, Skipped: 0, Time elapsed: 3.624 sec - in org.apache.qpid.test.client.message.SelectorTest
Running org.apache.qpid.test.client.message.ObjectMessageTest
Tests run: 5, Failures: 0, Errors: 0, Skipped: 0, Time elapsed: 0.582 sec - in org.apache.qpid.test.client.message.ObjectMessageTest
Running org.apache.qpid.test.client.message.JMSDestinationTest
Tests run: 7, Failures: 0, Errors: 0, Skipped: 0, Time elapsed: 0.671 sec - in org.apache.qpid.test.client.message.JMSDestinationTest
Running org.apache.qpid.test.client.message.JMSReplyToTest
Tests run: 2, Failures: 0, Errors: 0, Skipped: 0, Time elapsed: 0.335 sec - in org.apache.qpid.test.client.message.JMSReplyToTest
Running org.apache.qpid.test.client.ImmediateAndMandatoryPublishingTest
Tests run: 13, Failures: 0, Errors: 0, Skipped: 0, Time elapsed: 0.027 sec - in org.apache.qpid.test.client.ImmediateAndMandatoryPublishingTest
Running org.apache.qpid.test.client.RollbackOrderTest
Tests run: 2, Failures: 0, Errors: 0, Skipped: 0, Time elapsed: 3.547 sec - in org.apache.qpid.test.client.RollbackOrderTest
Running org.apache.qpid.test.client.QueueBrowserTransactedTest
Tests run: 7, Failures: 0, Errors: 0, Skipped: 0, Time elapsed: 6.343 sec - in org.apache.qpid.test.client.QueueBrowserTransactedTest
Running org.apache.qpid.test.client.DupsOkTest
Tests run: 1, Failures: 0, Errors: 0, Skipped: 0, Time elapsed: 0.314 sec - in org.apache.qpid.test.client.DupsOkTest
Running org.apache.qpid.test.client.ProducerFlowControlTest
Tests run: 1, Failures: 0, Errors: 0, Skipped: 0, Time elapsed: 0.003 sec - in org.apache.qpid.test.client.ProducerFlowControlTest

Results :

Failed tests: 
  AnonymousProducerTest>QpidTestCase.run:165->QpidBrokerTestCase.runBare:91->QpidTestCase.runTest:181->testPublishIntoNonExistingQueue:92
Expected exception was not thrown
  AnonymousProducerTest>QpidTestCase.run:165->QpidBrokerTestCase.runBare:91->QpidTestCase.runTest:181->testSyncPublishIntoNonExistingQueue:108
Send to unknown destination should result in error

Tests run: 1036, Failures: 2, Errors: 0, Skipped: 0

[INFO] ------------------------------------------------------------------------
[INFO] BUILD FAILURE
[INFO] ------------------------------------------------------------------------
[INFO] Total time: 10:59 min
[INFO] Finished at: 2017-06-09T10:31:52Z
[INFO] Final Memory: 37M/575M
[INFO] ------------------------------------------------------------------------
[ERROR] Failed to execute goal org.apache.maven.plugins:maven-surefire-plugin:2.19.1:test
(integration-test) on project qpid-systests: There are test failures.
[ERROR] 
[ERROR] Please refer to <https://builds.apache.org/job/Qpid-cpp-JMS-AMQP-0-x-Test/3995/artifact/qpid-broker-j/systests/target/surefire-reports/cpp>
for the individual test results.
[ERROR] -> [Help 1]
[ERROR] 
[ERROR] To see the full stack trace of the errors, re-run Maven with the -e switch.
[ERROR] Re-run Maven using the -X switch to enable full debug logging.
[ERROR] 
[ERROR] For more information about the errors and possible solutions, please read the following
articles:
[ERROR] [Help 1] http://cwiki.apache.org/confluence/display/MAVEN/MojoFailureException
Build step 'Invoke top-level Maven targets' marked build as failure
[locks-and-latches] Releasing all the locks
[locks-and-latches] All the locks released
Archiving artifacts
Recording test results

Mime
View raw message