qpid-notifications mailing list archives

Site index · List index
Message view « Date » · « Thread »
Top « Date » · « Thread »
From Apache Jenkins Server <jenk...@builds.apache.org>
Subject Build failed in Jenkins: Qpid-BrokerForJava-JoramJMSTest » ubuntu,JDK 1.8.0_102,qpid-jms-client #1187
Date Fri, 09 Jun 2017 15:08:21 GMT
See <https://builds.apache.org/job/Qpid-BrokerForJava-JoramJMSTest/Ubuntu%20Slaves=ubuntu,jdk=JDK%201.8.0_102,qpid.joramtests=qpid-jms-client/1187/display/redirect>

------------------------------------------
Started by upstream project "Qpid-BrokerForJava-JoramJMSTest" build number 1187
originally caused by:
 Started by an SCM change
[EnvInject] - Loading node environment variables.
Building remotely on H17 (ubuntu xenial) in workspace <https://builds.apache.org/job/Qpid-BrokerForJava-JoramJMSTest/Ubuntu%20Slaves=ubuntu,jdk=JDK%201.8.0_102,qpid.joramtests=qpid-jms-client/ws/>
java.io.IOException: Failed to mkdirs: <https://builds.apache.org/job/Qpid-BrokerForJava-JoramJMSTest/Ubuntu%20Slaves=ubuntu,jdk=JDK%201.8.0_102,qpid.joramtests=qpid-jms-client/ws/>
	at hudson.FilePath.mkdirs(FilePath.java:1169)
	at hudson.model.AbstractProject.checkout(AbstractProject.java:1279)
	at hudson.model.AbstractBuild$AbstractBuildExecution.defaultCheckout(AbstractBuild.java:604)
	at jenkins.scm.SCMCheckoutStrategy.checkout(SCMCheckoutStrategy.java:86)
	at hudson.model.AbstractBuild$AbstractBuildExecution.run(AbstractBuild.java:529)
	at hudson.model.Run.execute(Run.java:1728)
	at hudson.matrix.MatrixRun.run(MatrixRun.java:146)
	at hudson.model.ResourceController.execute(ResourceController.java:98)
	at hudson.model.Executor.run(Executor.java:405)
Retrying after 10 seconds
java.io.IOException: Failed to mkdirs: <https://builds.apache.org/job/Qpid-BrokerForJava-JoramJMSTest/Ubuntu%20Slaves=ubuntu,jdk=JDK%201.8.0_102,qpid.joramtests=qpid-jms-client/ws/>
	at hudson.FilePath.mkdirs(FilePath.java:1169)
	at hudson.model.AbstractProject.checkout(AbstractProject.java:1279)
	at hudson.model.AbstractBuild$AbstractBuildExecution.defaultCheckout(AbstractBuild.java:604)
	at jenkins.scm.SCMCheckoutStrategy.checkout(SCMCheckoutStrategy.java:86)
	at hudson.model.AbstractBuild$AbstractBuildExecution.run(AbstractBuild.java:529)
	at hudson.model.Run.execute(Run.java:1728)
	at hudson.matrix.MatrixRun.run(MatrixRun.java:146)
	at hudson.model.ResourceController.execute(ResourceController.java:98)
	at hudson.model.Executor.run(Executor.java:405)
Retrying after 10 seconds
java.io.IOException: Failed to mkdirs: <https://builds.apache.org/job/Qpid-BrokerForJava-JoramJMSTest/Ubuntu%20Slaves=ubuntu,jdk=JDK%201.8.0_102,qpid.joramtests=qpid-jms-client/ws/>
	at hudson.FilePath.mkdirs(FilePath.java:1169)
	at hudson.model.AbstractProject.checkout(AbstractProject.java:1279)
	at hudson.model.AbstractBuild$AbstractBuildExecution.defaultCheckout(AbstractBuild.java:604)
	at jenkins.scm.SCMCheckoutStrategy.checkout(SCMCheckoutStrategy.java:86)
	at hudson.model.AbstractBuild$AbstractBuildExecution.run(AbstractBuild.java:529)
	at hudson.model.Run.execute(Run.java:1728)
	at hudson.matrix.MatrixRun.run(MatrixRun.java:146)
	at hudson.model.ResourceController.execute(ResourceController.java:98)
	at hudson.model.Executor.run(Executor.java:405)
Performing Post build task...
Match found for : : True
Logical operation result is TRUE
Running script  : #!/bin/bash -x

if [[ "${BROKER_PID}" ]]
then
  echo Killing broker "${BROKER_PID}"
  kill -15 "${BROKER_PID}"
fi
FATAL: Unable to produce a script file
java.io.IOException: No space left on device
	at java.io.FileOutputStream.writeBytes(Native Method)
	at java.io.FileOutputStream.write(FileOutputStream.java:345)
	at sun.nio.cs.StreamEncoder.writeBytes(StreamEncoder.java:221)
	at sun.nio.cs.StreamEncoder.implClose(StreamEncoder.java:316)
	at sun.nio.cs.StreamEncoder.close(StreamEncoder.java:149)
	at java.io.OutputStreamWriter.close(OutputStreamWriter.java:233)
	at hudson.FilePath$17.invoke(FilePath.java:1379)
	at hudson.FilePath$17.invoke(FilePath.java:1362)
	at hudson.FilePath$FileCallableWrapper.call(FilePath.java:2731)
	at hudson.remoting.UserRequest.perform(UserRequest.java:153)
	at hudson.remoting.UserRequest.perform(UserRequest.java:50)
	at hudson.remoting.Request$2.run(Request.java:336)
	at hudson.remoting.InterceptingExecutorService$1.call(InterceptingExecutorService.java:68)
	at java.util.concurrent.FutureTask.run(FutureTask.java:262)
	at java.util.concurrent.ThreadPoolExecutor.runWorker(ThreadPoolExecutor.java:1145)
	at java.util.concurrent.ThreadPoolExecutor$Worker.run(ThreadPoolExecutor.java:615)
	at java.lang.Thread.run(Thread.java:745)
	at ......remote call to H17(Native Method)
	at hudson.remoting.Channel.attachCallSiteStackTrace(Channel.java:1545)
	at hudson.remoting.UserResponse.retrieve(UserRequest.java:253)
	at hudson.remoting.Channel.call(Channel.java:830)
	at hudson.FilePath.act(FilePath.java:985)
Caused: java.io.IOException: remote file operation failed: <https://builds.apache.org/job/Qpid-BrokerForJava-JoramJMSTest/Ubuntu%20Slaves=ubuntu,jdk=JDK%201.8.0_102,qpid.joramtests=qpid-jms-client/ws/>
at hudson.remoting.Channel@78843214:H17
	at hudson.FilePath.act(FilePath.java:992)
	at hudson.FilePath.act(FilePath.java:974)
	at hudson.FilePath.createTextTempFile(FilePath.java:1362)
Caused: java.io.IOException: Failed to create a temp file on <https://builds.apache.org/job/Qpid-BrokerForJava-JoramJMSTest/Ubuntu%20Slaves=ubuntu,jdk=JDK%201.8.0_102,qpid.joramtests=qpid-jms-client/ws/>
	at hudson.FilePath.createTextTempFile(FilePath.java:1385)
	at hudson.tasks.CommandInterpreter.createScriptFile(CommandInterpreter.java:162)
	at hudson.tasks.CommandInterpreter.perform(CommandInterpreter.java:94)
	at hudson.tasks.CommandInterpreter.perform(CommandInterpreter.java:66)
	at hudson.plugins.postbuildtask.PostbuildTask.perform(PostbuildTask.java:123)
	at hudson.tasks.BuildStepMonitor$1.perform(BuildStepMonitor.java:20)
	at hudson.model.AbstractBuild$AbstractBuildExecution.perform(AbstractBuild.java:779)
	at hudson.model.AbstractBuild$AbstractBuildExecution.performAllBuildSteps(AbstractBuild.java:720)
	at hudson.model.Build$BuildExecution.post2(Build.java:186)
	at hudson.model.AbstractBuild$AbstractBuildExecution.post(AbstractBuild.java:665)
	at hudson.model.Run.execute(Run.java:1753)
	at hudson.matrix.MatrixRun.run(MatrixRun.java:146)
	at hudson.model.ResourceController.execute(ResourceController.java:98)
	at hudson.model.Executor.run(Executor.java:405)
POST BUILD TASK : FAILURE
END OF POST BUILD TASK : 0
Archiving artifacts
ERROR: Build step failed with exception
<https://builds.apache.org/job/Qpid-BrokerForJava-JoramJMSTest/Ubuntu%20Slaves=ubuntu,jdk=JDK%201.8.0_102,qpid.joramtests=qpid-jms-client/ws/>
does not exist.
	at org.apache.tools.ant.types.AbstractFileSet.getDirectoryScanner(AbstractFileSet.java:483)
	at org.apache.tools.ant.types.AbstractFileSet.getDirectoryScanner(AbstractFileSet.java:460)
	at hudson.tasks.ArtifactArchiver$ListFiles.invoke(ArtifactArchiver.java:292)
	at hudson.tasks.ArtifactArchiver$ListFiles.invoke(ArtifactArchiver.java:272)
	at hudson.FilePath$FileCallableWrapper.call(FilePath.java:2731)
	at hudson.remoting.UserRequest.perform(UserRequest.java:153)
	at hudson.remoting.UserRequest.perform(UserRequest.java:50)
	at hudson.remoting.Request$2.run(Request.java:336)
	at hudson.remoting.InterceptingExecutorService$1.call(InterceptingExecutorService.java:68)
	at java.util.concurrent.FutureTask.run(FutureTask.java:262)
	at java.util.concurrent.ThreadPoolExecutor.runWorker(ThreadPoolExecutor.java:1145)
	at java.util.concurrent.ThreadPoolExecutor$Worker.run(ThreadPoolExecutor.java:615)
	at java.lang.Thread.run(Thread.java:745)
	at ......remote call to H17(Native Method)
	at hudson.remoting.Channel.attachCallSiteStackTrace(Channel.java:1545)
	at hudson.remoting.UserResponse.retrieve(UserRequest.java:253)
	at hudson.remoting.Channel.call(Channel.java:830)
	at hudson.FilePath.act(FilePath.java:985)
	at hudson.FilePath.act(FilePath.java:974)
	at hudson.tasks.ArtifactArchiver.perform(ArtifactArchiver.java:238)
	at hudson.tasks.BuildStepCompatibilityLayer.perform(BuildStepCompatibilityLayer.java:78)
	at hudson.tasks.BuildStepMonitor$1.perform(BuildStepMonitor.java:20)
	at hudson.model.AbstractBuild$AbstractBuildExecution.perform(AbstractBuild.java:779)
	at hudson.model.AbstractBuild$AbstractBuildExecution.performAllBuildSteps(AbstractBuild.java:720)
	at hudson.model.Build$BuildExecution.post2(Build.java:186)
	at hudson.model.AbstractBuild$AbstractBuildExecution.post(AbstractBuild.java:665)
	at hudson.model.Run.execute(Run.java:1753)
	at hudson.matrix.MatrixRun.run(MatrixRun.java:146)
	at hudson.model.ResourceController.execute(ResourceController.java:98)
	at hudson.model.Executor.run(Executor.java:405)
Build step 'Archive the artifacts' marked build as failure
Recording test results
ERROR: Build step failed with exception
<https://builds.apache.org/job/Qpid-BrokerForJava-JoramJMSTest/Ubuntu%20Slaves=ubuntu,jdk=JDK%201.8.0_102,qpid.joramtests=qpid-jms-client/ws/>
does not exist.
	at org.apache.tools.ant.types.AbstractFileSet.getDirectoryScanner(AbstractFileSet.java:483)
	at org.apache.tools.ant.types.AbstractFileSet.getDirectoryScanner(AbstractFileSet.java:460)
	at hudson.tasks.junit.JUnitParser$ParseResultCallable.invoke(JUnitParser.java:127)
	at hudson.tasks.junit.JUnitParser$ParseResultCallable.invoke(JUnitParser.java:107)
	at hudson.FilePath$FileCallableWrapper.call(FilePath.java:2731)
	at hudson.remoting.UserRequest.perform(UserRequest.java:153)
	at hudson.remoting.UserRequest.perform(UserRequest.java:50)
	at hudson.remoting.Request$2.run(Request.java:336)
	at hudson.remoting.InterceptingExecutorService$1.call(InterceptingExecutorService.java:68)
	at java.util.concurrent.FutureTask.run(FutureTask.java:262)
	at java.util.concurrent.ThreadPoolExecutor.runWorker(ThreadPoolExecutor.java:1145)
	at java.util.concurrent.ThreadPoolExecutor$Worker.run(ThreadPoolExecutor.java:615)
	at java.lang.Thread.run(Thread.java:745)
	at ......remote call to H17(Native Method)
	at hudson.remoting.Channel.attachCallSiteStackTrace(Channel.java:1545)
	at hudson.remoting.UserResponse.retrieve(UserRequest.java:253)
	at hudson.remoting.Channel.call(Channel.java:830)
	at hudson.FilePath.act(FilePath.java:985)
	at hudson.FilePath.act(FilePath.java:974)
	at hudson.tasks.junit.JUnitParser.parseResult(JUnitParser.java:103)
	at hudson.tasks.junit.JUnitResultArchiver.parse(JUnitResultArchiver.java:128)
	at hudson.tasks.junit.JUnitResultArchiver.perform(JUnitResultArchiver.java:149)
	at hudson.tasks.BuildStepCompatibilityLayer.perform(BuildStepCompatibilityLayer.java:78)
	at hudson.tasks.BuildStepMonitor$1.perform(BuildStepMonitor.java:20)
	at hudson.model.AbstractBuild$AbstractBuildExecution.perform(AbstractBuild.java:779)
	at hudson.model.AbstractBuild$AbstractBuildExecution.performAllBuildSteps(AbstractBuild.java:720)
	at hudson.model.Build$BuildExecution.post2(Build.java:186)
	at hudson.model.AbstractBuild$AbstractBuildExecution.post(AbstractBuild.java:665)
	at hudson.model.Run.execute(Run.java:1753)
	at hudson.matrix.MatrixRun.run(MatrixRun.java:146)
	at hudson.model.ResourceController.execute(ResourceController.java:98)
	at hudson.model.Executor.run(Executor.java:405)
Build step 'Publish JUnit test result report' marked build as failure

Mime
View raw message