qpid-notifications mailing list archives

Site index · List index
Message view « Date » · « Thread »
Top « Date » · « Thread »
From Apache Jenkins Server <jenk...@builds.apache.org>
Subject Build failed in Jenkins: Qpid-Java-Artefact-Release-6.0.x #117
Date Fri, 30 Jun 2017 13:52:28 GMT
See <https://builds.apache.org/job/Qpid-Java-Artefact-Release-6.0.x/117/display/redirect?page=changes>

Changes:

[kwall] QPID-7844: Recover metadata into direct memory [6.0.x]

------------------------------------------
[...truncated 98.19 KB...]
Running org.apache.qpid.server.logging.CompositeFilterTest
Tests run: 6, Failures: 0, Errors: 0, Skipped: 0, Time elapsed: 0.032 sec - in org.apache.qpid.server.logging.CompositeFilterTest
Running org.apache.qpid.server.logging.BrokerFileLoggerStatusListenerTest
Tests run: 5, Failures: 0, Errors: 0, Skipped: 0, Time elapsed: 0.046 sec - in org.apache.qpid.server.logging.BrokerFileLoggerStatusListenerTest
Running org.apache.qpid.server.logging.UnitTestMessageLoggerTest
Tests run: 3, Failures: 0, Errors: 0, Skipped: 0, Time elapsed: 0.005 sec - in org.apache.qpid.server.logging.UnitTestMessageLoggerTest
Running org.apache.qpid.server.logging.BrokerNameAndLevelLogInclusionRuleTest
Tests run: 3, Failures: 0, Errors: 0, Skipped: 0, Time elapsed: 0.038 sec - in org.apache.qpid.server.logging.BrokerNameAndLevelLogInclusionRuleTest
Running org.apache.qpid.server.logging.VirtualHostLogEventExcludingFilterTest
Tests run: 6, Failures: 0, Errors: 0, Skipped: 0, Time elapsed: 0.022 sec - in org.apache.qpid.server.logging.VirtualHostLogEventExcludingFilterTest
Running org.apache.qpid.server.logging.LoggerNameAndLevelFilterTest
Tests run: 5, Failures: 0, Errors: 0, Skipped: 0, Time elapsed: 0.009 sec - in org.apache.qpid.server.logging.LoggerNameAndLevelFilterTest
Running org.apache.qpid.server.logging.actors.AMQPConnectionActorTest
Tests run: 2, Failures: 0, Errors: 0, Skipped: 0, Time elapsed: 0.112 sec - in org.apache.qpid.server.logging.actors.AMQPConnectionActorTest
Running org.apache.qpid.server.logging.actors.HttpManagementActorTest
Tests run: 2, Failures: 0, Errors: 0, Skipped: 0, Time elapsed: 0.012 sec - in org.apache.qpid.server.logging.actors.HttpManagementActorTest
Running org.apache.qpid.server.logging.StartupAppenderTest
Tests run: 3, Failures: 0, Errors: 0, Skipped: 0, Time elapsed: 0.022 sec - in org.apache.qpid.server.logging.StartupAppenderTest
Running org.apache.qpid.server.logging.subjects.ExchangeLogSubjectTest
Tests run: 2, Failures: 0, Errors: 0, Skipped: 0, Time elapsed: 0.083 sec - in org.apache.qpid.server.logging.subjects.ExchangeLogSubjectTest
Running org.apache.qpid.server.logging.subjects.QueueLogSubjectTest
Tests run: 2, Failures: 0, Errors: 0, Skipped: 0, Time elapsed: 0.114 sec - in org.apache.qpid.server.logging.subjects.QueueLogSubjectTest
Running org.apache.qpid.server.logging.subjects.ConnectionLogSubjectTest
Tests run: 2, Failures: 0, Errors: 0, Skipped: 0, Time elapsed: 0.009 sec - in org.apache.qpid.server.logging.subjects.ConnectionLogSubjectTest
Running org.apache.qpid.server.logging.subjects.BindingLogSubjectTest
Tests run: 2, Failures: 0, Errors: 0, Skipped: 0, Time elapsed: 0.094 sec - in org.apache.qpid.server.logging.subjects.BindingLogSubjectTest
Running org.apache.qpid.server.logging.subjects.MessageStoreLogSubjectTest
Tests run: 2, Failures: 0, Errors: 0, Skipped: 0, Time elapsed: 0.072 sec - in org.apache.qpid.server.logging.subjects.MessageStoreLogSubjectTest
Running org.apache.qpid.server.logging.subjects.ChannelLogSubjectTest
Tests run: 2, Failures: 0, Errors: 0, Skipped: 0, Time elapsed: 0.018 sec - in org.apache.qpid.server.logging.subjects.ChannelLogSubjectTest
Running org.apache.qpid.server.logging.BrokerMemoryLoggerTest
Tests run: 2, Failures: 0, Errors: 0, Skipped: 0, Time elapsed: 0.013 sec - in org.apache.qpid.server.logging.BrokerMemoryLoggerTest
Running org.apache.qpid.server.logging.PrincipalLogEventFilterTest
Tests run: 4, Failures: 0, Errors: 0, Skipped: 0, Time elapsed: 0.008 sec - in org.apache.qpid.server.logging.PrincipalLogEventFilterTest
Running org.apache.qpid.server.logging.messages.QueueMessagesTest
Tests run: 16, Failures: 0, Errors: 0, Skipped: 0, Time elapsed: 0.031 sec - in org.apache.qpid.server.logging.messages.QueueMessagesTest
Running org.apache.qpid.server.logging.messages.VirtualHostMessagesTest
Tests run: 2, Failures: 0, Errors: 0, Skipped: 0, Time elapsed: 0.003 sec - in org.apache.qpid.server.logging.messages.VirtualHostMessagesTest
Running org.apache.qpid.server.logging.messages.ChannelMessagesTest
Tests run: 4, Failures: 0, Errors: 0, Skipped: 0, Time elapsed: 0.009 sec - in org.apache.qpid.server.logging.messages.ChannelMessagesTest
Running org.apache.qpid.server.logging.messages.ConnectionMessagesTest
Tests run: 4, Failures: 0, Errors: 0, Skipped: 0, Time elapsed: 0.008 sec - in org.apache.qpid.server.logging.messages.ConnectionMessagesTest
Running org.apache.qpid.server.logging.messages.ExchangeMessagesTest
Tests run: 4, Failures: 0, Errors: 0, Skipped: 0, Time elapsed: 0.017 sec - in org.apache.qpid.server.logging.messages.ExchangeMessagesTest
Running org.apache.qpid.server.logging.messages.BindingMessagesTest
Tests run: 3, Failures: 0, Errors: 0, Skipped: 0, Time elapsed: 0.005 sec - in org.apache.qpid.server.logging.messages.BindingMessagesTest
Running org.apache.qpid.server.logging.messages.ConsumerMessagesTest
Tests run: 4, Failures: 0, Errors: 0, Skipped: 0, Time elapsed: 0.021 sec - in org.apache.qpid.server.logging.messages.ConsumerMessagesTest
Running org.apache.qpid.server.logging.messages.BrokerMessagesTest
Tests run: 8, Failures: 0, Errors: 0, Skipped: 0, Time elapsed: 0.013 sec - in org.apache.qpid.server.logging.messages.BrokerMessagesTest
Running org.apache.qpid.server.logging.messages.MessageStoreMessagesTest
Tests run: 4, Failures: 0, Errors: 0, Skipped: 0, Time elapsed: 0.006 sec - in org.apache.qpid.server.logging.messages.MessageStoreMessagesTest
Running org.apache.qpid.server.logging.messages.ManagementConsoleMessagesTest
Tests run: 5, Failures: 0, Errors: 0, Skipped: 0, Time elapsed: 0.021 sec - in org.apache.qpid.server.logging.messages.ManagementConsoleMessagesTest
Running org.apache.qpid.server.plugin.ProtocolEngineCreatorComparatorTest
Tests run: 1, Failures: 0, Errors: 0, Skipped: 0, Time elapsed: 0.008 sec - in org.apache.qpid.server.plugin.ProtocolEngineCreatorComparatorTest
Running org.apache.qpid.server.plugin.AMQPProtocolVersionWrapperTest
Tests run: 3, Failures: 0, Errors: 0, Skipped: 0, Time elapsed: 0.005 sec - in org.apache.qpid.server.plugin.AMQPProtocolVersionWrapperTest
Running org.apache.qpid.server.txn.LocalTransactionTest
Tests run: 27, Failures: 0, Errors: 0, Skipped: 0, Time elapsed: 0.064 sec - in org.apache.qpid.server.txn.LocalTransactionTest
Running org.apache.qpid.server.txn.AutoCommitTransactionTest
Tests run: 14, Failures: 0, Errors: 0, Skipped: 0, Time elapsed: 0.029 sec - in org.apache.qpid.server.txn.AutoCommitTransactionTest
Running org.apache.qpid.server.txn.AsyncAutoCommitTransactionTest
Tests run: 5, Failures: 0, Errors: 0, Skipped: 0, Time elapsed: 0.027 sec - in org.apache.qpid.server.txn.AsyncAutoCommitTransactionTest
Running org.apache.qpid.server.virtualhostnode.AbstractStandardVirtualHostNodeTest
Tests run: 17, Failures: 0, Errors: 0, Skipped: 0, Time elapsed: 0.332 sec - in org.apache.qpid.server.virtualhostnode.AbstractStandardVirtualHostNodeTest
Running org.apache.qpid.server.virtualhostalias.VirtualHostAliasTest
Tests run: 5, Failures: 0, Errors: 0, Skipped: 0, Time elapsed: 1.709 sec - in org.apache.qpid.server.virtualhostalias.VirtualHostAliasTest
Running org.apache.qpid.server.BrokerTest
Tests run: 3, Failures: 0, Errors: 0, Skipped: 0, Time elapsed: 0.114 sec - in org.apache.qpid.server.BrokerTest
Running org.apache.qpid.server.queue.StandardQueueTest
Tests run: 30, Failures: 0, Errors: 0, Skipped: 0, Time elapsed: 18.526 sec - in org.apache.qpid.server.queue.StandardQueueTest
Running org.apache.qpid.server.queue.QueueMessageRecoveryTest
Tests run: 3, Failures: 0, Errors: 0, Skipped: 0, Time elapsed: 2.474 sec - in org.apache.qpid.server.queue.QueueMessageRecoveryTest
Running org.apache.qpid.server.queue.ConsumerListTest
Tests run: 17, Failures: 0, Errors: 0, Skipped: 0, Time elapsed: 0.126 sec - in org.apache.qpid.server.queue.ConsumerListTest
Running org.apache.qpid.server.queue.PriorityQueueTest
Tests run: 27, Failures: 0, Errors: 0, Skipped: 0, Time elapsed: 16.113 sec - in org.apache.qpid.server.queue.PriorityQueueTest
Running org.apache.qpid.server.queue.NotificationCheckTest
Tests run: 4, Failures: 0, Errors: 0, Skipped: 0, Time elapsed: 0.011 sec - in org.apache.qpid.server.queue.NotificationCheckTest
Running org.apache.qpid.server.queue.SortedQueueTest
Tests run: 26, Failures: 0, Errors: 0, Skipped: 0, Time elapsed: 14.077 sec - in org.apache.qpid.server.queue.SortedQueueTest
Running org.apache.qpid.server.queue.SortedQueueEntryTest
Tests run: 12, Failures: 0, Errors: 0, Skipped: 0, Time elapsed: 0.758 sec - in org.apache.qpid.server.queue.SortedQueueEntryTest
Running org.apache.qpid.server.queue.LastValueQueueListTest
Tests run: 10, Failures: 0, Errors: 0, Skipped: 0, Time elapsed: 0.555 sec - in org.apache.qpid.server.queue.LastValueQueueListTest
Running org.apache.qpid.server.queue.SimpleQueueEntryImplTest
Tests run: 12, Failures: 0, Errors: 0, Skipped: 0, Time elapsed: 0.647 sec - in org.apache.qpid.server.queue.SimpleQueueEntryImplTest
Running org.apache.qpid.server.queue.StandardQueueEntryListTest
Tests run: 11, Failures: 0, Errors: 0, Skipped: 0, Time elapsed: 0.902 sec - in org.apache.qpid.server.queue.StandardQueueEntryListTest
Running org.apache.qpid.server.queue.PriorityQueueListTest
Tests run: 3, Failures: 0, Errors: 0, Skipped: 0, Time elapsed: 0.248 sec - in org.apache.qpid.server.queue.PriorityQueueListTest
Running org.apache.qpid.server.queue.LastValueQueueTest
Tests run: 26, Failures: 1, Errors: 0, Skipped: 0, Time elapsed: 14.609 sec <<< FAILURE!
- in org.apache.qpid.server.queue.LastValueQueueTest
testEnqueueTwoMessagesThenRegisterConsumer(org.apache.qpid.server.queue.LastValueQueueTest)
 Time elapsed: 0.907 sec  <<< FAILURE!
junit.framework.AssertionFailedError: expected:<Mock for ServerMessage, hashCode: 1673038719>
but was:<null>
	at junit.framework.Assert.fail(Assert.java:57)
	at junit.framework.Assert.failNotEquals(Assert.java:329)
	at junit.framework.Assert.assertEquals(Assert.java:78)
	at junit.framework.Assert.assertEquals(Assert.java:86)
	at junit.framework.TestCase.assertEquals(TestCase.java:253)
	at org.apache.qpid.server.queue.AbstractQueueTestBase.testEnqueueTwoMessagesThenRegisterConsumer(AbstractQueueTestBase.java:233)
	at org.apache.qpid.server.queue.LastValueQueueTest.testEnqueueTwoMessagesThenRegisterConsumer(LastValueQueueTest.java:29)

Running org.apache.qpid.server.queue.SortedQueueEntryListTest
Tests run: 17, Failures: 0, Errors: 0, Skipped: 0, Time elapsed: 1.917 sec - in org.apache.qpid.server.queue.SortedQueueEntryListTest
Running org.apache.qpid.server.security.SubjectCreatorTest
Tests run: 7, Failures: 0, Errors: 0, Skipped: 0, Time elapsed: 0.035 sec - in org.apache.qpid.server.security.SubjectCreatorTest
Running org.apache.qpid.server.security.FileTrustStoreTest
Tests run: 10, Failures: 0, Errors: 0, Skipped: 0, Time elapsed: 0.671 sec - in org.apache.qpid.server.security.FileTrustStoreTest
Running org.apache.qpid.server.security.FileKeyStoreTest
Tests run: 12, Failures: 0, Errors: 0, Skipped: 0, Time elapsed: 0.085 sec - in org.apache.qpid.server.security.FileKeyStoreTest
Running org.apache.qpid.server.security.SecurityManagerTest
Tests run: 57, Failures: 0, Errors: 0, Skipped: 0, Time elapsed: 0.276 sec - in org.apache.qpid.server.security.SecurityManagerTest
Running org.apache.qpid.server.security.TrustStoreMessageSourceTest
Tests run: 1, Failures: 0, Errors: 0, Skipped: 0, Time elapsed: 0.012 sec - in org.apache.qpid.server.security.TrustStoreMessageSourceTest
Running org.apache.qpid.server.security.NonJavaKeyStoreTest
Tests run: 4, Failures: 0, Errors: 0, Skipped: 0, Time elapsed: 0.11 sec - in org.apache.qpid.server.security.NonJavaKeyStoreTest
Running org.apache.qpid.server.security.auth.UsernamePrincipalTest
Tests run: 6, Failures: 0, Errors: 0, Skipped: 0, Time elapsed: 0.008 sec - in org.apache.qpid.server.security.auth.UsernamePrincipalTest
Running org.apache.qpid.server.security.auth.AuthenticationResultTest
Tests run: 7, Failures: 0, Errors: 0, Skipped: 0, Time elapsed: 0.01 sec - in org.apache.qpid.server.security.auth.AuthenticationResultTest
Running org.apache.qpid.server.security.auth.manager.PlainAuthenticationManagerTest
Tests run: 4, Failures: 0, Errors: 0, Skipped: 0, Time elapsed: 0.052 sec - in org.apache.qpid.server.security.auth.manager.PlainAuthenticationManagerTest
Running org.apache.qpid.server.security.auth.manager.oauth2.OAuth2SaslServerTest
Tests run: 5, Failures: 0, Errors: 0, Skipped: 0, Time elapsed: 0.008 sec - in org.apache.qpid.server.security.auth.manager.oauth2.OAuth2SaslServerTest
Running org.apache.qpid.server.security.auth.manager.MD5AuthenticationManagerTest
Tests run: 7, Failures: 0, Errors: 0, Skipped: 0, Time elapsed: 0.078 sec - in org.apache.qpid.server.security.auth.manager.MD5AuthenticationManagerTest
Running org.apache.qpid.server.security.auth.manager.ScramSHA1AuthenticationManagerTest
Tests run: 5, Failures: 0, Errors: 0, Skipped: 0, Time elapsed: 0.419 sec - in org.apache.qpid.server.security.auth.manager.ScramSHA1AuthenticationManagerTest
Running org.apache.qpid.server.security.auth.manager.SimpleAuthenticationManagerTest
Tests run: 11, Failures: 0, Errors: 0, Skipped: 0, Time elapsed: 0.055 sec - in org.apache.qpid.server.security.auth.manager.SimpleAuthenticationManagerTest
Running org.apache.qpid.server.security.auth.manager.ldap.LDAPSSLSocketFactoryGeneratorTest
Tests run: 4, Failures: 0, Errors: 0, Skipped: 0, Time elapsed: 0.186 sec - in org.apache.qpid.server.security.auth.manager.ldap.LDAPSSLSocketFactoryGeneratorTest
Running org.apache.qpid.server.security.auth.manager.AnonymousAuthenticationManagerTest
Tests run: 3, Failures: 0, Errors: 0, Skipped: 0, Time elapsed: 0.01 sec - in org.apache.qpid.server.security.auth.manager.AnonymousAuthenticationManagerTest
Running org.apache.qpid.server.security.auth.manager.SimpleLDAPAuthenticationManagerFactoryTest
Tests run: 2, Failures: 0, Errors: 0, Skipped: 0, Time elapsed: 0.186 sec - in org.apache.qpid.server.security.auth.manager.SimpleLDAPAuthenticationManagerFactoryTest
Running org.apache.qpid.server.security.auth.manager.PrincipalDatabaseAuthenticationManagerTest
Tests run: 11, Failures: 0, Errors: 0, Skipped: 0, Time elapsed: 0.113 sec - in org.apache.qpid.server.security.auth.manager.PrincipalDatabaseAuthenticationManagerTest
Running org.apache.qpid.server.security.auth.manager.PlainPasswordFileAuthenticationManagerFactoryTest
Tests run: 3, Failures: 0, Errors: 0, Skipped: 0, Time elapsed: 0.013 sec - in org.apache.qpid.server.security.auth.manager.PlainPasswordFileAuthenticationManagerFactoryTest
Running org.apache.qpid.server.security.auth.manager.ExternalAuthenticationManagerTest
Tests run: 12, Failures: 0, Errors: 0, Skipped: 0, Time elapsed: 0.126 sec - in org.apache.qpid.server.security.auth.manager.ExternalAuthenticationManagerTest
Running org.apache.qpid.server.security.auth.AuthenticatedPrincipalTest
Tests run: 9, Failures: 0, Errors: 0, Skipped: 0, Time elapsed: 0.012 sec - in org.apache.qpid.server.security.auth.AuthenticatedPrincipalTest
Running org.apache.qpid.server.security.auth.jmx.JMXPasswordAuthenticatorTest
Tests run: 4, Failures: 0, Errors: 0, Skipped: 0, Time elapsed: 0.018 sec - in org.apache.qpid.server.security.auth.jmx.JMXPasswordAuthenticatorTest
Running org.apache.qpid.server.security.auth.AuthenticationProviderTest
Tests run: 1, Failures: 0, Errors: 0, Skipped: 0, Time elapsed: 0.032 sec - in org.apache.qpid.server.security.auth.AuthenticationProviderTest
Running org.apache.qpid.server.security.auth.sasl.CRAMMD5HexInitialiserTest
Tests run: 1, Failures: 0, Errors: 0, Skipped: 0, Time elapsed: 0.01 sec - in org.apache.qpid.server.security.auth.sasl.CRAMMD5HexInitialiserTest
Running org.apache.qpid.server.security.auth.sasl.CRAMMD5HexServerTest
Tests run: 4, Failures: 0, Errors: 0, Skipped: 0, Time elapsed: 0.054 sec - in org.apache.qpid.server.security.auth.sasl.CRAMMD5HexServerTest
Running org.apache.qpid.server.security.auth.sasl.plain.PlainSaslServerTest
Tests run: 2, Failures: 0, Errors: 0, Skipped: 0, Time elapsed: 0.003 sec - in org.apache.qpid.server.security.auth.sasl.plain.PlainSaslServerTest
Running org.apache.qpid.server.security.auth.database.HashedUserTest
Tests run: 2, Failures: 0, Errors: 0, Skipped: 0, Time elapsed: 0.004 sec - in org.apache.qpid.server.security.auth.database.HashedUserTest
Running org.apache.qpid.server.security.auth.database.PlainUserTest
Tests run: 2, Failures: 0, Errors: 0, Skipped: 0, Time elapsed: 0.003 sec - in org.apache.qpid.server.security.auth.database.PlainUserTest
Running org.apache.qpid.server.security.auth.database.Base64MD5PasswordFilePrincipalDatabaseTest
Tests run: 11, Failures: 0, Errors: 0, Skipped: 0, Time elapsed: 0.11 sec - in org.apache.qpid.server.security.auth.database.Base64MD5PasswordFilePrincipalDatabaseTest
Running org.apache.qpid.server.security.auth.database.PlainPasswordFilePrincipalDatabaseTest
Tests run: 9, Failures: 0, Errors: 0, Skipped: 0, Time elapsed: 0.128 sec - in org.apache.qpid.server.security.auth.database.PlainPasswordFilePrincipalDatabaseTest
Running org.apache.qpid.server.security.encryption.AESKeyFileEncrypterTest
Tests run: 7, Failures: 0, Errors: 0, Skipped: 0, Time elapsed: 0.009 sec - in org.apache.qpid.server.security.encryption.AESKeyFileEncrypterTest
Running org.apache.qpid.server.security.encryption.AESKeyFileEncrypterFactoryTest
Tests run: 5, Failures: 0, Errors: 0, Skipped: 0, Time elapsed: 0.009 sec - in org.apache.qpid.server.security.encryption.AESKeyFileEncrypterFactoryTest
Running org.apache.qpid.server.security.NonJavaTrustStoreTest
Tests run: 2, Failures: 0, Errors: 0, Skipped: 0, Time elapsed: 0.018 sec - in org.apache.qpid.server.security.NonJavaTrustStoreTest
Running org.apache.qpid.server.security.group.FileGroupDatabaseTest
Tests run: 26, Failures: 0, Errors: 0, Skipped: 0, Time elapsed: 0.447 sec - in org.apache.qpid.server.security.group.FileGroupDatabaseTest
Running org.apache.qpid.server.security.group.GroupPrincipalTest
Tests run: 7, Failures: 0, Errors: 0, Skipped: 0, Time elapsed: 0.009 sec - in org.apache.qpid.server.security.group.GroupPrincipalTest

Results :

Failed tests: 
  LastValueQueueTest>QpidTestCase.run:166->QpidTestCase.runTest:181->testEnqueueTwoMessagesThenRegisterConsumer:29->AbstractQueueTestBase.testEnqueueTwoMessagesThenRegisterConsumer:233
expected:<Mock for ServerMessage, hashCode: 1673038719> but was:<null>

Tests run: 1102, Failures: 1, Errors: 0, Skipped: 0

[INFO] ------------------------------------------------------------------------
[INFO] Reactor Summary:
[INFO] 
[INFO] Apache Qpid for Java ............................... SUCCESS [  4.107 s]
[INFO] Apache Qpid Broker Code Generation ................. SUCCESS [  2.179 s]
[INFO] Apache Qpid Test Utilities ......................... SUCCESS [  0.871 s]
[INFO] Apache Qpid Common ................................. SUCCESS [ 28.825 s]
[INFO] Qpid Management Common ............................. SUCCESS [  2.049 s]
[INFO] Apache Qpid Broker Core ............................ FAILURE [01:59 min]
[INFO] Apache Qpid Access Control Broker Plug-in .......... SKIPPED
[INFO] Apache Qpid AMQP 0-8 Protocol Broker Plug-in ....... SKIPPED
[INFO] Apache Qpid AMQP 0-10 Protocol Plug-in ............. SKIPPED
[INFO] Apache Qpid AMQP 1-0 Protocol Broker Plug-in ....... SKIPPED
[INFO] Apache Qpid AMQP 0-8 to 0-10 Message Conversion Broker Plug-in SKIPPED
[INFO] Apache Qpid AMQP 0-8 to 1-0 Message Conversion Broker Plug-in SKIPPED
[INFO] Apache Qpid AMQP 0-10 to 1-0 Message Conversion Broker Plug-in SKIPPED
[INFO] Apache Qpid Derby Message Store Broker Plug-in ..... SKIPPED
[INFO] Apache Qpid JDBC Message Store Connection Pooling Plug-in SKIPPED
[INFO] Apache Qpid JDBC Message Store Broker Plug-in ...... SKIPPED
[INFO] Apache Qpid HTTP Management Broker Plug-in ......... SKIPPED
[INFO] Qpid JMX Management Broker Plug-in ................. SKIPPED
[INFO] Apache Qpid Memory Message Store Broker Plug-in .... SKIPPED
[INFO] Apache Qpid WebSocket Broker Plug-in ............... SKIPPED
[INFO] Apache Qpid JMS Client for AMQP 0-9-1/0-10 ......... SKIPPED
[INFO] Apache Qpid BDB Message Store Broker Plug-in ....... SKIPPED
[INFO] Qpid BDB Message Store JMX ......................... SKIPPED
[INFO] Apache Qpid Broker for Java ........................ SKIPPED
[INFO] Apache Qpid AMQP Management Protocol Broker Plug-in  SKIPPED
[INFO] Apache Qpid Client for AMQP 0-9-1/0-10 Examples .... SKIPPED
[INFO] Apache Qpid JCA .................................... SKIPPED
[INFO] Apache Qpid Resource Adaptor ....................... SKIPPED
[INFO] Apache Qpid Tools .................................. SKIPPED
[INFO] Qpid Management Examples ........................... SKIPPED
[INFO] Apache Qpid System Test Parent ..................... SKIPPED
[INFO] Apache Qpid System Tests ........................... SKIPPED
[INFO] Apache Qpid Performance Tests ...................... SKIPPED
[INFO] Apache Qpid Performance Test System Tests .......... SKIPPED
[INFO] Apache Qpid Performance Tests Visualisation JFC .... SKIPPED
[INFO] Apache Qpid BDB Store System Tests ................. SKIPPED
[INFO] Apache Qpid Joram JMS Tests ........................ SKIPPED
[INFO] Apache Qpid for Java Docbook ....................... SKIPPED
[INFO] Apache Qpid Broker for Java Docbook ................ SKIPPED
[INFO] Apache Qpid JMS Client for AMQP 0-8, 0-9 and 0-9-1 Docbook SKIPPED
[INFO] Apache Qpid JMS Client for AMQP 0-10 Docbook ....... SKIPPED
[INFO] Apache Qpid Performance Test Docbook ............... SKIPPED
[INFO] ------------------------------------------------------------------------
[INFO] BUILD FAILURE
[INFO] ------------------------------------------------------------------------
[INFO] Total time: 02:38 min
[INFO] Finished at: 2017-06-30T13:52:27Z
[INFO] Final Memory: 51M/1357M
[INFO] ------------------------------------------------------------------------
[ERROR] Failed to execute goal org.apache.maven.plugins:maven-surefire-plugin:2.17:test (default-test)
on project qpid-broker-core: There are test failures.
[ERROR] 
[ERROR] Please refer to <https://builds.apache.org/job/Qpid-Java-Artefact-Release-6.0.x/ws/broker-core/target/surefire-reports>
for the individual test results.
[ERROR] -> [Help 1]
[ERROR] 
[ERROR] To see the full stack trace of the errors, re-run Maven with the -e switch.
[ERROR] Re-run Maven using the -X switch to enable full debug logging.
[ERROR] 
[ERROR] For more information about the errors and possible solutions, please read the following
articles:
[ERROR] [Help 1] http://cwiki.apache.org/confluence/display/MAVEN/MojoFailureException
[ERROR] 
[ERROR] After correcting the problems, you can resume the build with the command
[ERROR]   mvn <goals> -rf :qpid-broker-core
Build step 'Invoke top-level Maven targets' marked build as failure
Archiving artifacts

Mime
View raw message