qpid-notifications mailing list archives

Site index · List index
Message view « Date » · « Thread »
Top « Date » · « Thread »
From Apache Jenkins Server <jenk...@builds.apache.org>
Subject Build failed in Jenkins: Qpid-Java-Java-6.1.x-TestMatrix » ubuntu,JDK 1.7 (latest),java-dby.0-10 #82
Date Thu, 22 Jun 2017 05:00:59 GMT
See <https://builds.apache.org/job/Qpid-Java-Java-6.1.x-TestMatrix/Ubuntu%20Slaves=ubuntu,jdk=JDK%201.7%20(latest),profile=java-dby.0-10/82/display/redirect?page=changes>

Changes:

[kwall] QPID-7791: Ensure that threads used by the recoverer dispose

[kwall] [maven-release-plugin] prepare release 6.1.4

[kwall] [maven-release-plugin] prepare for next development iteration

------------------------------------------
[...truncated 383.29 KB...]
[INFO] Executing tasks

main:
     [echo] Qpid Test Profile Properties
     [echo] [profile] java-dby.0-10
     [echo] [profile.broker.language] java
     [echo] [profile.broker.type] internal
     [echo] [profile.broker.command] "<https://builds.apache.org/job/Qpid-Java-Java-6.1.x-TestMatrix/Ubuntu%20Slaves=ubuntu,jdk=JDK%201.7%20(latest),profile=java-dby.0-10/ws/doc/jms-client-0-8/bin/qpid-server">
-sp "@STORE_PATH" -st @STORE_TYPE -prop test.port=@PORT -prop "qpid.work_dir=@QPID_WORK"
     [echo] [profile.specific.excludes] JavaPersistentExcludes JavaDerbyExcludes Java010Excludes
     [echo] [profile.test.excludes] Excludes JavaExcludes java-dby.0-10.excludes JavaPersistentExcludes
JavaDerbyExcludes Java010Excludes
     [echo] [profile.broker.version] v0_10
     [echo] [profile.test.amqp_port_protocols] ["AMQP_0_8","AMQP_0_9","AMQP_0_9_1","AMQP_0_10"]
     [echo] [profile.broker.persistent] true
     [echo] [profile.virtualhostnode.type] DERBY
     [echo] [profile.virtualhostnode.context.blueprint] {"type":"ProvidedStore","globalAddressDomains":"${qpid.globalAddressDomains}"}
     [echo] [profile.test_receive_timeout] 2000
[INFO] Executed tasks
[INFO] 
[INFO] --- maven-enforcer-plugin:1.3.1:enforce (enforce-minimum-versions) @ qpid-java-doc-jms-client-0-8
---
[INFO] 
[INFO] --- maven-enforcer-plugin:1.3.1:enforce (enforce-versions-standard-properties) @ qpid-java-doc-jms-client-0-8
---
[INFO] 
[INFO] --- jacoco-maven-plugin:0.7.5.201505241946:prepare-agent (default-prepare-agent) @
qpid-java-doc-jms-client-0-8 ---
[INFO] argLine set to "-javaagent:/home/jenkins/.m2/repository/org/jacoco/org.jacoco.agent/0.7.5.201505241946/org.jacoco.agent-0.7.5.201505241946-runtime.jar=destfile=<https://builds.apache.org/job/Qpid-Java-Java-6.1.x-TestMatrix/Ubuntu%20Slaves=ubuntu,jdk=JDK%201.7%20(latest),profile=java-dby.0-10/ws/doc/jms-client-0-8/target/jacoco.exec">
-Xmx512m
[INFO] 
[INFO] --- maven-resources-plugin:2.6:copy-resources (filter-docbook-sources) @ qpid-java-doc-jms-client-0-8
---
[INFO] Using 'UTF-8' encoding to copy filtered resources.
[INFO] Copying 17 resources
[INFO] 
[INFO] --- maven-remote-resources-plugin:1.5:process (default) @ qpid-java-doc-jms-client-0-8
---
[INFO] 
[INFO] --- maven-resources-plugin:2.6:resources (default-resources) @ qpid-java-doc-jms-client-0-8
---
[INFO] Using 'UTF-8' encoding to copy filtered resources.
[INFO] Copying 17 resources
[INFO] 
[INFO] --- maven-compiler-plugin:3.1:compile (default-compile) @ qpid-java-doc-jms-client-0-8
---
[INFO] No sources to compile
[INFO] 
[INFO] --- maven-resources-plugin:2.6:testResources (default-testResources) @ qpid-java-doc-jms-client-0-8
---
[INFO] Using 'UTF-8' encoding to copy filtered resources.
[INFO] Copying 17 resources
[INFO] 
[INFO] --- maven-compiler-plugin:3.1:testCompile (default-testCompile) @ qpid-java-doc-jms-client-0-8
---
[INFO] No sources to compile
[INFO] 
[INFO] --- maven-surefire-plugin:2.17:test (default-test) @ qpid-java-doc-jms-client-0-8 ---
[INFO] Tests are skipped.
[INFO] 
[INFO] --- maven-jar-plugin:2.5:jar (default-jar) @ qpid-java-doc-jms-client-0-8 ---
[INFO] Skipping packaging of the jar
[INFO] 
[INFO] --- maven-site-plugin:3.4:attach-descriptor (attach-descriptor) @ qpid-java-doc-jms-client-0-8
---
[INFO] 
[INFO] --- maven-assembly-plugin:2.4.1:single (default) @ qpid-java-doc-jms-client-0-8 ---
[INFO] Assemblies have been skipped per configuration of the skipAssembly parameter.
[INFO] 
[INFO] ------------------------------------------------------------------------
[INFO] Building Apache Qpid JMS Client for AMQP 0-10 Docbook 6.1.5-SNAPSHOT
[INFO] ------------------------------------------------------------------------
[INFO] 
[INFO] --- maven-clean-plugin:2.5:clean (default-clean) @ qpid-java-doc-jms-client-0-10 ---
[INFO] 
[INFO] --- maven-antrun-plugin:1.7:run (output-test-properties) @ qpid-java-doc-jms-client-0-10
---
[INFO] Executing tasks

main:
     [echo] Qpid Test Profile Properties
     [echo] [profile] java-dby.0-10
     [echo] [profile.broker.language] java
     [echo] [profile.broker.type] internal
     [echo] [profile.broker.command] "<https://builds.apache.org/job/Qpid-Java-Java-6.1.x-TestMatrix/Ubuntu%20Slaves=ubuntu,jdk=JDK%201.7%20(latest),profile=java-dby.0-10/ws/doc/jms-client-0-10/bin/qpid-server">
-sp "@STORE_PATH" -st @STORE_TYPE -prop test.port=@PORT -prop "qpid.work_dir=@QPID_WORK"
     [echo] [profile.specific.excludes] JavaPersistentExcludes JavaDerbyExcludes Java010Excludes
     [echo] [profile.test.excludes] Excludes JavaExcludes java-dby.0-10.excludes JavaPersistentExcludes
JavaDerbyExcludes Java010Excludes
     [echo] [profile.broker.version] v0_10
     [echo] [profile.test.amqp_port_protocols] ["AMQP_0_8","AMQP_0_9","AMQP_0_9_1","AMQP_0_10"]
     [echo] [profile.broker.persistent] true
     [echo] [profile.virtualhostnode.type] DERBY
     [echo] [profile.virtualhostnode.context.blueprint] {"type":"ProvidedStore","globalAddressDomains":"${qpid.globalAddressDomains}"}
     [echo] [profile.test_receive_timeout] 2000
[INFO] Executed tasks
[INFO] 
[INFO] --- maven-enforcer-plugin:1.3.1:enforce (enforce-minimum-versions) @ qpid-java-doc-jms-client-0-10
---
[INFO] 
[INFO] --- maven-enforcer-plugin:1.3.1:enforce (enforce-versions-standard-properties) @ qpid-java-doc-jms-client-0-10
---
[INFO] 
[INFO] --- jacoco-maven-plugin:0.7.5.201505241946:prepare-agent (default-prepare-agent) @
qpid-java-doc-jms-client-0-10 ---
[INFO] argLine set to "-javaagent:/home/jenkins/.m2/repository/org/jacoco/org.jacoco.agent/0.7.5.201505241946/org.jacoco.agent-0.7.5.201505241946-runtime.jar=destfile=<https://builds.apache.org/job/Qpid-Java-Java-6.1.x-TestMatrix/Ubuntu%20Slaves=ubuntu,jdk=JDK%201.7%20(latest),profile=java-dby.0-10/ws/doc/jms-client-0-10/target/jacoco.exec">
-Xmx512m
[INFO] 
[INFO] --- maven-resources-plugin:2.6:copy-resources (filter-docbook-sources) @ qpid-java-doc-jms-client-0-10
---
[INFO] Using 'UTF-8' encoding to copy filtered resources.
[INFO] Copying 1 resource
[INFO] 
[INFO] --- maven-remote-resources-plugin:1.5:process (default) @ qpid-java-doc-jms-client-0-10
---
[INFO] 
[INFO] --- maven-resources-plugin:2.6:resources (default-resources) @ qpid-java-doc-jms-client-0-10
---
[INFO] Using 'UTF-8' encoding to copy filtered resources.
[INFO] Copying 1 resource
[INFO] 
[INFO] --- maven-compiler-plugin:3.1:compile (default-compile) @ qpid-java-doc-jms-client-0-10
---
[INFO] No sources to compile
[INFO] 
[INFO] --- maven-resources-plugin:2.6:testResources (default-testResources) @ qpid-java-doc-jms-client-0-10
---
[INFO] Using 'UTF-8' encoding to copy filtered resources.
[INFO] Copying 1 resource
[INFO] 
[INFO] --- maven-compiler-plugin:3.1:testCompile (default-testCompile) @ qpid-java-doc-jms-client-0-10
---
[INFO] No sources to compile
[INFO] 
[INFO] --- maven-surefire-plugin:2.17:test (default-test) @ qpid-java-doc-jms-client-0-10
---
[INFO] Tests are skipped.
[INFO] 
[INFO] --- maven-jar-plugin:2.5:jar (default-jar) @ qpid-java-doc-jms-client-0-10 ---
[INFO] Skipping packaging of the jar
[INFO] 
[INFO] --- maven-site-plugin:3.4:attach-descriptor (attach-descriptor) @ qpid-java-doc-jms-client-0-10
---
[INFO] 
[INFO] --- maven-assembly-plugin:2.4.1:single (default) @ qpid-java-doc-jms-client-0-10 ---
[INFO] Assemblies have been skipped per configuration of the skipAssembly parameter.
[INFO] 
[INFO] ------------------------------------------------------------------------
[INFO] Building Apache Qpid Performance Test Docbook 6.1.5-SNAPSHOT
[INFO] ------------------------------------------------------------------------
[INFO] 
[INFO] --- maven-clean-plugin:2.5:clean (default-clean) @ qpid-java-doc-perftests ---
[INFO] 
[INFO] --- maven-antrun-plugin:1.7:run (output-test-properties) @ qpid-java-doc-perftests
---
[INFO] Executing tasks

main:
     [echo] Qpid Test Profile Properties
     [echo] [profile] java-dby.0-10
     [echo] [profile.broker.language] java
     [echo] [profile.broker.type] internal
     [echo] [profile.broker.command] "<https://builds.apache.org/job/Qpid-Java-Java-6.1.x-TestMatrix/Ubuntu%20Slaves=ubuntu,jdk=JDK%201.7%20(latest),profile=java-dby.0-10/ws/doc/java-perftests/bin/qpid-server">
-sp "@STORE_PATH" -st @STORE_TYPE -prop test.port=@PORT -prop "qpid.work_dir=@QPID_WORK"
     [echo] [profile.specific.excludes] JavaPersistentExcludes JavaDerbyExcludes Java010Excludes
     [echo] [profile.test.excludes] Excludes JavaExcludes java-dby.0-10.excludes JavaPersistentExcludes
JavaDerbyExcludes Java010Excludes
     [echo] [profile.broker.version] v0_10
     [echo] [profile.test.amqp_port_protocols] ["AMQP_0_8","AMQP_0_9","AMQP_0_9_1","AMQP_0_10"]
     [echo] [profile.broker.persistent] true
     [echo] [profile.virtualhostnode.type] DERBY
     [echo] [profile.virtualhostnode.context.blueprint] {"type":"ProvidedStore","globalAddressDomains":"${qpid.globalAddressDomains}"}
     [echo] [profile.test_receive_timeout] 2000
[INFO] Executed tasks
[INFO] 
[INFO] --- maven-enforcer-plugin:1.3.1:enforce (enforce-minimum-versions) @ qpid-java-doc-perftests
---
[INFO] 
[INFO] --- maven-enforcer-plugin:1.3.1:enforce (enforce-versions-standard-properties) @ qpid-java-doc-perftests
---
[INFO] 
[INFO] --- jacoco-maven-plugin:0.7.5.201505241946:prepare-agent (default-prepare-agent) @
qpid-java-doc-perftests ---
[INFO] argLine set to "-javaagent:/home/jenkins/.m2/repository/org/jacoco/org.jacoco.agent/0.7.5.201505241946/org.jacoco.agent-0.7.5.201505241946-runtime.jar=destfile=<https://builds.apache.org/job/Qpid-Java-Java-6.1.x-TestMatrix/Ubuntu%20Slaves=ubuntu,jdk=JDK%201.7%20(latest),profile=java-dby.0-10/ws/doc/java-perftests/target/jacoco.exec">
-Xmx512m
[INFO] 
[INFO] --- maven-resources-plugin:2.6:copy-resources (filter-docbook-sources) @ qpid-java-doc-perftests
---
[INFO] Using 'UTF-8' encoding to copy filtered resources.
[INFO] Copying 1 resource
[INFO] 
[INFO] --- maven-remote-resources-plugin:1.5:process (default) @ qpid-java-doc-perftests ---
[INFO] 
[INFO] --- maven-resources-plugin:2.6:resources (default-resources) @ qpid-java-doc-perftests
---
[INFO] Using 'UTF-8' encoding to copy filtered resources.
[INFO] Copying 1 resource
[INFO] 
[INFO] --- maven-compiler-plugin:3.1:compile (default-compile) @ qpid-java-doc-perftests ---
[INFO] No sources to compile
[INFO] 
[INFO] --- maven-resources-plugin:2.6:testResources (default-testResources) @ qpid-java-doc-perftests
---
[INFO] Using 'UTF-8' encoding to copy filtered resources.
[INFO] Copying 1 resource
[INFO] 
[INFO] --- maven-compiler-plugin:3.1:testCompile (default-testCompile) @ qpid-java-doc-perftests
---
[INFO] No sources to compile
[INFO] 
[INFO] --- maven-surefire-plugin:2.17:test (default-test) @ qpid-java-doc-perftests ---
[INFO] Tests are skipped.
[INFO] 
[INFO] --- maven-jar-plugin:2.5:jar (default-jar) @ qpid-java-doc-perftests ---
[INFO] Skipping packaging of the jar
[INFO] 
[INFO] --- maven-site-plugin:3.4:attach-descriptor (attach-descriptor) @ qpid-java-doc-perftests
---
[INFO] 
[INFO] --- maven-assembly-plugin:2.4.1:single (default) @ qpid-java-doc-perftests ---
[INFO] Assemblies have been skipped per configuration of the skipAssembly parameter.
[INFO] ------------------------------------------------------------------------
[INFO] Reactor Summary:
[INFO] 
[INFO] Apache Qpid for Java ............................... SUCCESS [  5.863 s]
[INFO] Apache Qpid Broker Code Generation ................. SUCCESS [  3.563 s]
[INFO] Apache Qpid Test Utilities ......................... SUCCESS [  0.733 s]
[INFO] Apache Qpid Common ................................. SUCCESS [  6.926 s]
[INFO] Apache Qpid Broker Core ............................ SUCCESS [ 11.389 s]
[INFO] Apache Qpid LogBack Logging Broker Plug-in ......... SUCCESS [  1.043 s]
[INFO] Apache Qpid Access Control Broker Plug-in .......... SUCCESS [  0.701 s]
[INFO] Apache Qpid AMQP 0-8 Protocol Broker Plug-in ....... SUCCESS [  0.603 s]
[INFO] Apache Qpid AMQP 0-10 Protocol Plug-in ............. SUCCESS [  0.571 s]
[INFO] Apache Qpid AMQP 1-0 Protocol Broker Plug-in ....... SUCCESS [  1.232 s]
[INFO] Apache Qpid AMQP 0-8 to 0-10 Message Conversion Broker Plug-in SUCCESS [  0.239 s]
[INFO] Apache Qpid AMQP 0-8 to 1-0 Message Conversion Broker Plug-in SUCCESS [  0.206 s]
[INFO] Apache Qpid AMQP 0-10 to 1-0 Message Conversion Broker Plug-in SUCCESS [  0.183 s]
[INFO] Apache Qpid Derby Message Store Broker Plug-in ..... SUCCESS [  1.133 s]
[INFO] Apache Qpid JDBC Message Store Connection Pooling Plug-in SUCCESS [  0.689 s]
[INFO] Apache Qpid JDBC Message Store Broker Plug-in ...... SUCCESS [  0.467 s]
[INFO] Apache Qpid HTTP Management Broker Plug-in ......... SUCCESS [  3.077 s]
[INFO] Apache Qpid Memory Message Store Broker Plug-in .... SUCCESS [  0.268 s]
[INFO] Apache Qpid WebSocket Broker Plug-in ............... SUCCESS [  0.370 s]
[INFO] Apache Qpid JMS Client for AMQP 0-9-1/0-10 ......... SUCCESS [  2.604 s]
[INFO] Apache Qpid BDB Message Store Broker Plug-in ....... SUCCESS [  1.688 s]
[INFO] Apache Qpid Broker for Java ........................ SUCCESS [  5.314 s]
[INFO] Apache Qpid AMQP Management Protocol Broker Plug-in  SUCCESS [  0.195 s]
[INFO] Apache Qpid Client for AMQP 0-9-1/0-10 Examples .... SUCCESS [  0.183 s]
[INFO] Apache Qpid JCA .................................... SUCCESS [  1.088 s]
[INFO] Apache Qpid Resource Adaptor ....................... SUCCESS [  0.659 s]
[INFO] Apache Qpid Tools .................................. SUCCESS [  0.435 s]
[INFO] Apache Qpid System Test Parent ..................... SUCCESS [  1.532 s]
[INFO] Apache Qpid System Tests ........................... FAILURE [40:47 min]
[INFO] Apache Qpid Performance Tests ...................... SUCCESS [  2.097 s]
[INFO] Apache Qpid Performance Test System Tests .......... SKIPPED
[INFO] Apache Qpid Performance Tests Visualisation JFC .... SUCCESS [  1.472 s]
[INFO] Apache Qpid BDB Store System Tests ................. SKIPPED
[INFO] Apache Qpid Joram JMS Tests ........................ SUCCESS [  0.705 s]
[INFO] Apache Qpid JMX TCK Configuration .................. SUCCESS [  0.213 s]
[INFO] Apache Qpid for Java Docbook ....................... SUCCESS [  0.045 s]
[INFO] Apache Qpid Broker for Java Docbook ................ SUCCESS [  0.580 s]
[INFO] Apache Qpid JMS Client for AMQP 0-8, 0-9 and 0-9-1 Docbook SUCCESS [  0.172 s]
[INFO] Apache Qpid JMS Client for AMQP 0-10 Docbook ....... SUCCESS [  0.099 s]
[INFO] Apache Qpid Performance Test Docbook ............... SUCCESS [  0.068 s]
[INFO] ------------------------------------------------------------------------
[INFO] BUILD FAILURE
[INFO] ------------------------------------------------------------------------
[INFO] Total time: 41:47 min
[INFO] Finished at: 2017-06-22T04:59:02Z
[INFO] Final Memory: 136M/3543M
[INFO] ------------------------------------------------------------------------
[ERROR] Failed to execute goal org.apache.maven.plugins:maven-surefire-plugin:2.17:test (integration-test)
on project qpid-systests: There are test failures.
[ERROR] 
[ERROR] Please refer to <https://builds.apache.org/job/Qpid-Java-Java-6.1.x-TestMatrix/Ubuntu%20Slaves=ubuntu,jdk=JDK%201.7%20(latest),profile=java-dby.0-10/82/artifact/systests/target/surefire-reports/java-dby.0-10>
for the individual test results.
[ERROR] -> [Help 1]
[ERROR] 
[ERROR] To see the full stack trace of the errors, re-run Maven with the -e switch.
[ERROR] Re-run Maven using the -X switch to enable full debug logging.
[ERROR] 
[ERROR] For more information about the errors and possible solutions, please read the following
articles:
[ERROR] [Help 1] http://cwiki.apache.org/confluence/display/MAVEN/MojoFailureException
[ERROR] 
[ERROR] After correcting the problems, you can resume the build with the command
[ERROR]   mvn <goals> -rf :qpid-systests
Build step 'Invoke top-level Maven targets' marked build as failure
[locks-and-latches] Releasing all the locks
[locks-and-latches] All the locks released
Archiving artifacts
Recording test results

Mime
View raw message