qpid-notifications mailing list archives

Site index · List index
Message view « Date » · « Thread »
Top « Date » · « Thread »
From Apache Jenkins Server <jenk...@builds.apache.org>
Subject Build failed in Jenkins: Qpid-cpp-JMS-AMQP-0-x-Test #4010
Date Tue, 20 Jun 2017 15:10:20 GMT
See <https://builds.apache.org/job/Qpid-cpp-JMS-AMQP-0-x-Test/4010/display/redirect?page=changes>

Changes:

[kwall] QPID-7791: Recover metadata into direct memory

------------------------------------------
[...truncated 514.38 KB...]
Tests run: 14, Failures: 0, Errors: 0, Skipped: 0, Time elapsed: 0.009 sec - in org.apache.qpid.systest.rest.SaslRestTest
Running org.apache.qpid.systest.rest.AccessControlProviderRestTest
Tests run: 4, Failures: 0, Errors: 0, Skipped: 0, Time elapsed: 0.002 sec - in org.apache.qpid.systest.rest.AccessControlProviderRestTest
Running org.apache.qpid.systest.rest.PublishMessageRestTest
Tests run: 6, Failures: 0, Errors: 0, Skipped: 0, Time elapsed: 0.003 sec - in org.apache.qpid.systest.rest.PublishMessageRestTest
Running org.apache.qpid.systest.rest.ConnectionRestTest
Tests run: 9, Failures: 0, Errors: 0, Skipped: 0, Time elapsed: 0.005 sec - in org.apache.qpid.systest.rest.ConnectionRestTest
Running org.apache.qpid.systest.rest.ExportImportMessagesRestTest
Tests run: 1, Failures: 0, Errors: 0, Skipped: 0, Time elapsed: 0 sec - in org.apache.qpid.systest.rest.ExportImportMessagesRestTest
Running org.apache.qpid.systest.rest.UserRestTest
Tests run: 7, Failures: 0, Errors: 0, Skipped: 0, Time elapsed: 0.016 sec - in org.apache.qpid.systest.rest.UserRestTest
Running org.apache.qpid.systest.rest.BrokerRestTest
Tests run: 8, Failures: 0, Errors: 0, Skipped: 0, Time elapsed: 0.006 sec - in org.apache.qpid.systest.rest.BrokerRestTest
Running org.apache.qpid.systest.rest.ExchangeRestTest
Tests run: 4, Failures: 0, Errors: 0, Skipped: 0, Time elapsed: 0.003 sec - in org.apache.qpid.systest.rest.ExchangeRestTest
Running org.apache.qpid.systest.rest.KeyStoreRestTest
Tests run: 5, Failures: 0, Errors: 0, Skipped: 0, Time elapsed: 0.003 sec - in org.apache.qpid.systest.rest.KeyStoreRestTest
Running org.apache.qpid.systest.rest.AuthenticationProviderRestTest
Tests run: 9, Failures: 0, Errors: 0, Skipped: 0, Time elapsed: 0.006 sec - in org.apache.qpid.systest.rest.AuthenticationProviderRestTest
Running org.apache.qpid.systest.rest.PreemtiveAuthRestTest
Tests run: 8, Failures: 0, Errors: 0, Skipped: 0, Time elapsed: 0.005 sec - in org.apache.qpid.systest.rest.PreemtiveAuthRestTest
Running org.apache.qpid.systest.rest.VirtualHostLoggerRestTest
Tests run: 2, Failures: 0, Errors: 0, Skipped: 0, Time elapsed: 0.001 sec - in org.apache.qpid.systest.rest.VirtualHostLoggerRestTest
Running org.apache.qpid.systest.rest.QueryRestTest
Tests run: 4, Failures: 0, Errors: 0, Skipped: 0, Time elapsed: 0.001 sec - in org.apache.qpid.systest.rest.QueryRestTest
Running org.apache.qpid.systest.rest.GroupProviderRestTest
Tests run: 10, Failures: 0, Errors: 0, Skipped: 0, Time elapsed: 0.006 sec - in org.apache.qpid.systest.rest.GroupProviderRestTest
Running org.apache.qpid.systest.rest.TrustStoreRestTest
Tests run: 5, Failures: 0, Errors: 0, Skipped: 0, Time elapsed: 0.008 sec - in org.apache.qpid.systest.rest.TrustStoreRestTest
Running org.apache.qpid.systest.rest.HttpManagementRestTest
Tests run: 3, Failures: 0, Errors: 0, Skipped: 0, Time elapsed: 0 sec - in org.apache.qpid.systest.rest.HttpManagementRestTest
Running org.apache.qpid.systest.messageencryption.MessageEncryptionTest
Tests run: 8, Failures: 0, Errors: 0, Skipped: 0, Time elapsed: 0.112 sec - in org.apache.qpid.systest.messageencryption.MessageEncryptionTest
Running org.apache.qpid.systest.AnonymousProducerTest
Tests run: 4, Failures: 0, Errors: 0, Skipped: 0, Time elapsed: 0.184 sec - in org.apache.qpid.systest.AnonymousProducerTest
Running org.apache.qpid.client.HeartbeatTest
Tests run: 8, Failures: 0, Errors: 0, Skipped: 0, Time elapsed: 13.435 sec - in org.apache.qpid.client.HeartbeatTest
Running org.apache.qpid.client.SyncPublishTest
Tests run: 1, Failures: 0, Errors: 0, Skipped: 0, Time elapsed: 0 sec - in org.apache.qpid.client.SyncPublishTest
Running org.apache.qpid.client.failover.FailoverBehaviourTest
Tests run: 37, Failures: 0, Errors: 0, Skipped: 0, Time elapsed: 45.675 sec - in org.apache.qpid.client.failover.FailoverBehaviourTest
Running org.apache.qpid.client.failover.MultipleBrokersFailoverTest
Tests run: 2, Failures: 0, Errors: 0, Skipped: 0, Time elapsed: 0.005 sec - in org.apache.qpid.client.failover.MultipleBrokersFailoverTest
Running org.apache.qpid.client.failover.AddressBasedFailoverBehaviourTest
Tests run: 37, Failures: 0, Errors: 0, Skipped: 0, Time elapsed: 46.397 sec - in org.apache.qpid.client.failover.AddressBasedFailoverBehaviourTest
Running org.apache.qpid.client.message.AMQPEncodedMapMessageTest
Tests run: 6, Failures: 0, Errors: 0, Skipped: 0, Time elapsed: 0.466 sec - in org.apache.qpid.client.message.AMQPEncodedMapMessageTest
Running org.apache.qpid.client.message.ObjectMessageClassWhitelistingTest
Tests run: 9, Failures: 0, Errors: 0, Skipped: 0, Time elapsed: 0.708 sec - in org.apache.qpid.client.message.ObjectMessageClassWhitelistingTest
Running org.apache.qpid.client.prefetch.PrefetchBehaviourTest
Tests run: 4, Failures: 0, Errors: 0, Skipped: 0, Time elapsed: 5.224 sec - in org.apache.qpid.client.prefetch.PrefetchBehaviourTest
Running org.apache.qpid.client.redelivered.RedeliveredMessageTest
Tests run: 1, Failures: 0, Errors: 0, Skipped: 0, Time elapsed: 0.064 sec - in org.apache.qpid.client.redelivered.RedeliveredMessageTest
Running org.apache.qpid.client.ssl.SSLTest
Tests run: 17, Failures: 0, Errors: 0, Skipped: 0, Time elapsed: 0.02 sec - in org.apache.qpid.client.ssl.SSLTest
Running org.apache.qpid.client.AsynchMessageListenerTest
Tests run: 9, Failures: 0, Errors: 0, Skipped: 0, Time elapsed: 1.116 sec - in org.apache.qpid.client.AsynchMessageListenerTest
Running org.apache.qpid.client.session.ExchangeDeleteTest
Tests run: 2, Failures: 0, Errors: 0, Skipped: 0, Time elapsed: 0.097 sec - in org.apache.qpid.client.session.ExchangeDeleteTest
Running org.apache.qpid.client.session.QueueDeclareTest
Tests run: 3, Failures: 0, Errors: 0, Skipped: 0, Time elapsed: 0.197 sec - in org.apache.qpid.client.session.QueueDeclareTest
Running org.apache.qpid.client.session.QueueDeleteTest
Tests run: 2, Failures: 0, Errors: 0, Skipped: 0, Time elapsed: 0.112 sec - in org.apache.qpid.client.session.QueueDeleteTest
Running org.apache.qpid.client.SynchReceiveTest
Tests run: 4, Failures: 0, Errors: 0, Skipped: 0, Time elapsed: 1.23 sec - in org.apache.qpid.client.SynchReceiveTest
Running org.apache.qpid.client.TemporaryQueuePrefixTest
Tests run: 4, Failures: 0, Errors: 0, Skipped: 0, Time elapsed: 0 sec - in org.apache.qpid.client.TemporaryQueuePrefixTest
Running org.apache.qpid.client.AMQQueueDeferredOrderingTest
Tests run: 1, Failures: 0, Errors: 0, Skipped: 0, Time elapsed: 1.748 sec - in org.apache.qpid.client.AMQQueueDeferredOrderingTest
Running org.apache.qpid.client.SessionCreateTest
Tests run: 1, Failures: 0, Errors: 0, Skipped: 0, Time elapsed: 74.854 sec - in org.apache.qpid.client.SessionCreateTest
Running org.apache.qpid.client.connection.ExistingSocketTest
Tests run: 2, Failures: 0, Errors: 0, Skipped: 0, Time elapsed: 0.202 sec - in org.apache.qpid.client.connection.ExistingSocketTest
Running org.apache.qpid.util.LogMonitorTest
Tests run: 8, Failures: 0, Errors: 0, Skipped: 0, Time elapsed: 2.026 sec - in org.apache.qpid.util.LogMonitorTest
Running org.apache.qpid.test.unit.transacted.CommitRollbackTest
Tests run: 13, Failures: 0, Errors: 0, Skipped: 0, Time elapsed: 9.19 sec - in org.apache.qpid.test.unit.transacted.CommitRollbackTest
Running org.apache.qpid.test.unit.transacted.TransactionTimeoutDisabledTest
Tests run: 2, Failures: 0, Errors: 0, Skipped: 0, Time elapsed: 0.001 sec - in org.apache.qpid.test.unit.transacted.TransactionTimeoutDisabledTest
Running org.apache.qpid.test.unit.transacted.TransactedTest
Tests run: 7, Failures: 0, Errors: 0, Skipped: 0, Time elapsed: 8.249 sec - in org.apache.qpid.test.unit.transacted.TransactedTest
Running org.apache.qpid.test.unit.transacted.TransactionTimeoutTest
Tests run: 15, Failures: 0, Errors: 0, Skipped: 0, Time elapsed: 0.006 sec - in org.apache.qpid.test.unit.transacted.TransactionTimeoutTest
Running org.apache.qpid.test.unit.message.ForeignMessageTest
Tests run: 1, Failures: 0, Errors: 0, Skipped: 0, Time elapsed: 0.07 sec - in org.apache.qpid.test.unit.message.ForeignMessageTest
Running org.apache.qpid.test.unit.message.StreamMessageTest
Tests run: 2, Failures: 0, Errors: 0, Skipped: 0, Time elapsed: 0.115 sec - in org.apache.qpid.test.unit.message.StreamMessageTest
Running org.apache.qpid.test.unit.message.UTF8Test
Tests run: 2, Failures: 0, Errors: 0, Skipped: 0, Time elapsed: 0.165 sec - in org.apache.qpid.test.unit.message.UTF8Test
Running org.apache.qpid.test.unit.message.JMSPropertiesTest
Tests run: 2, Failures: 0, Errors: 0, Skipped: 0, Time elapsed: 0.185 sec - in org.apache.qpid.test.unit.message.JMSPropertiesTest
Running org.apache.qpid.test.unit.message.JMSHeaderTest
Tests run: 1, Failures: 0, Errors: 0, Skipped: 0, Time elapsed: 0.041 sec - in org.apache.qpid.test.unit.message.JMSHeaderTest
Running org.apache.qpid.test.unit.topic.TopicSubscriberTest
Tests run: 3, Failures: 0, Errors: 0, Skipped: 0, Time elapsed: 0.182 sec - in org.apache.qpid.test.unit.topic.TopicSubscriberTest
Running org.apache.qpid.test.unit.topic.TemporaryTopicTest
Tests run: 5, Failures: 0, Errors: 0, Skipped: 0, Time elapsed: 0.351 sec - in org.apache.qpid.test.unit.topic.TemporaryTopicTest
Running org.apache.qpid.test.unit.topic.TopicPublisherTest
Tests run: 1, Failures: 0, Errors: 0, Skipped: 0, Time elapsed: 0.068 sec - in org.apache.qpid.test.unit.topic.TopicPublisherTest
Running org.apache.qpid.test.unit.topic.DurableSubscriptionTest
Tests run: 19, Failures: 0, Errors: 0, Skipped: 0, Time elapsed: 31.066 sec - in org.apache.qpid.test.unit.topic.DurableSubscriptionTest
Running org.apache.qpid.test.unit.topic.TopicSessionTest
Tests run: 9, Failures: 0, Errors: 0, Skipped: 0, Time elapsed: 10.005 sec - in org.apache.qpid.test.unit.topic.TopicSessionTest
Running org.apache.qpid.test.unit.ack.ClientAcknowledgeTest
Tests run: 1, Failures: 0, Errors: 0, Skipped: 0, Time elapsed: 0.001 sec - in org.apache.qpid.test.unit.ack.ClientAcknowledgeTest
Running org.apache.qpid.test.unit.ack.Acknowledge2ConsumersTest
Tests run: 3, Failures: 0, Errors: 0, Skipped: 0, Time elapsed: 9.733 sec - in org.apache.qpid.test.unit.ack.Acknowledge2ConsumersTest
Running org.apache.qpid.test.unit.ack.AcknowledgeOnMessageTest
Tests run: 6, Failures: 0, Errors: 0, Skipped: 0, Time elapsed: 0.501 sec - in org.apache.qpid.test.unit.ack.AcknowledgeOnMessageTest
Running org.apache.qpid.test.unit.ack.RecoverTest
Tests run: 7, Failures: 0, Errors: 0, Skipped: 0, Time elapsed: 2.087 sec - in org.apache.qpid.test.unit.ack.RecoverTest
Running org.apache.qpid.test.unit.ack.AcknowledgeTest
Tests run: 6, Failures: 0, Errors: 0, Skipped: 0, Time elapsed: 6.607 sec - in org.apache.qpid.test.unit.ack.AcknowledgeTest
Running org.apache.qpid.test.unit.close.TopicPublisherCloseTest
Tests run: 1, Failures: 0, Errors: 0, Skipped: 0, Time elapsed: 0.064 sec - in org.apache.qpid.test.unit.close.TopicPublisherCloseTest
Running org.apache.qpid.test.unit.close.JavaServerCloseRaceConditionTest
Tests run: 1, Failures: 0, Errors: 0, Skipped: 0, Time elapsed: 0.001 sec - in org.apache.qpid.test.unit.close.JavaServerCloseRaceConditionTest
Running org.apache.qpid.test.unit.close.MessageConsumerCloseTest
Tests run: 4, Failures: 0, Errors: 0, Skipped: 0, Time elapsed: 0.394 sec - in org.apache.qpid.test.unit.close.MessageConsumerCloseTest
Running org.apache.qpid.test.unit.ct.DurableSubscriberTest
Tests run: 4, Failures: 0, Errors: 0, Skipped: 0, Time elapsed: 0.002 sec - in org.apache.qpid.test.unit.ct.DurableSubscriberTest
Running org.apache.qpid.test.unit.client.QueueSessionFactoryTest
Tests run: 5, Failures: 0, Errors: 0, Skipped: 0, Time elapsed: 0.236 sec - in org.apache.qpid.test.unit.client.QueueSessionFactoryTest
Running org.apache.qpid.test.unit.client.message.ObjectMessageTest
Tests run: 9, Failures: 0, Errors: 0, Skipped: 0, Time elapsed: 0.634 sec - in org.apache.qpid.test.unit.client.message.ObjectMessageTest
Running org.apache.qpid.test.unit.client.TopicSessionFactoryTest
Tests run: 4, Failures: 0, Errors: 0, Skipped: 0, Time elapsed: 0.207 sec - in org.apache.qpid.test.unit.client.TopicSessionFactoryTest
Running org.apache.qpid.test.unit.client.AMQSessionTest
Tests run: 3, Failures: 0, Errors: 0, Skipped: 0, Time elapsed: 0.113 sec - in org.apache.qpid.test.unit.client.AMQSessionTest
Running org.apache.qpid.test.unit.client.DynamicQueueExchangeCreateTest
Tests run: 9, Failures: 0, Errors: 0, Skipped: 0, Time elapsed: 0.004 sec - in org.apache.qpid.test.unit.client.DynamicQueueExchangeCreateTest
Running org.apache.qpid.test.unit.client.MaxDeliveryCountTest
Tests run: 7, Failures: 0, Errors: 0, Skipped: 0, Time elapsed: 0.002 sec - in org.apache.qpid.test.unit.client.MaxDeliveryCountTest
Running org.apache.qpid.test.unit.client.temporaryqueue.TemporaryQueueTest
Tests run: 6, Failures: 0, Errors: 0, Skipped: 0, Time elapsed: 0.243 sec - in org.apache.qpid.test.unit.client.temporaryqueue.TemporaryQueueTest
Running org.apache.qpid.test.unit.client.channelclose.CloseWithBlockingReceiveTest
Tests run: 1, Failures: 0, Errors: 0, Skipped: 0, Time elapsed: 1.048 sec - in org.apache.qpid.test.unit.client.channelclose.CloseWithBlockingReceiveTest
Running org.apache.qpid.test.unit.client.connection.ConnectionStartTest
Tests run: 2, Failures: 0, Errors: 0, Skipped: 0, Time elapsed: 1.204 sec - in org.apache.qpid.test.unit.client.connection.ConnectionStartTest
Running org.apache.qpid.test.unit.client.connection.ConnectionFactoryTest
Tests run: 2, Failures: 0, Errors: 0, Skipped: 0, Time elapsed: 0.128 sec - in org.apache.qpid.test.unit.client.connection.ConnectionFactoryTest
Running org.apache.qpid.test.unit.client.connection.BrokerClosesClientConnectionTest
Tests run: 4, Failures: 0, Errors: 0, Skipped: 0, Time elapsed: 22.211 sec - in org.apache.qpid.test.unit.client.connection.BrokerClosesClientConnectionTest
Running org.apache.qpid.test.unit.client.connection.ExceptionListenerTest
Tests run: 4, Failures: 0, Errors: 0, Skipped: 0, Time elapsed: 0.171 sec - in org.apache.qpid.test.unit.client.connection.ExceptionListenerTest
Running org.apache.qpid.test.unit.client.connection.ConnectionTest
Tests run: 13, Failures: 0, Errors: 0, Skipped: 0, Time elapsed: 0.494 sec - in org.apache.qpid.test.unit.client.connection.ConnectionTest
Running org.apache.qpid.test.unit.basic.PropertyValueTest
Tests run: 8, Failures: 0, Errors: 0, Skipped: 0, Time elapsed: 1.288 sec - in org.apache.qpid.test.unit.basic.PropertyValueTest
Running org.apache.qpid.test.unit.basic.LargeMessageTest
Tests run: 10, Failures: 0, Errors: 0, Skipped: 0, Time elapsed: 0.703 sec - in org.apache.qpid.test.unit.basic.LargeMessageTest
Running org.apache.qpid.test.unit.basic.FieldTableMessageTest
Tests run: 1, Failures: 0, Errors: 0, Skipped: 0, Time elapsed: 0.107 sec - in org.apache.qpid.test.unit.basic.FieldTableMessageTest
Running org.apache.qpid.test.unit.basic.PubSubTwoConnectionTest
Tests run: 1, Failures: 0, Errors: 0, Skipped: 0, Time elapsed: 0.059 sec - in org.apache.qpid.test.unit.basic.PubSubTwoConnectionTest
Running org.apache.qpid.test.unit.basic.TextMessageTest
Tests run: 1, Failures: 0, Errors: 0, Skipped: 0, Time elapsed: 0.174 sec - in org.apache.qpid.test.unit.basic.TextMessageTest
Running org.apache.qpid.test.unit.basic.close.CloseTest
Tests run: 1, Failures: 0, Errors: 0, Skipped: 0, Time elapsed: 0.095 sec - in org.apache.qpid.test.unit.basic.close.CloseTest
Running org.apache.qpid.test.unit.basic.InvalidDestinationTest
Tests run: 3, Failures: 0, Errors: 0, Skipped: 0, Time elapsed: 0.247 sec - in org.apache.qpid.test.unit.basic.InvalidDestinationTest
Running org.apache.qpid.test.unit.basic.MapMessageTest
Tests run: 1, Failures: 0, Errors: 0, Skipped: 0, Time elapsed: 0.227 sec - in org.apache.qpid.test.unit.basic.MapMessageTest
Running org.apache.qpid.test.unit.basic.SessionStartTest
Tests run: 1, Failures: 0, Errors: 0, Skipped: 0, Time elapsed: 0.054 sec - in org.apache.qpid.test.unit.basic.SessionStartTest
Running org.apache.qpid.test.unit.basic.MultipleConnectionTest
Tests run: 1, Failures: 0, Errors: 0, Skipped: 0, Time elapsed: 0.355 sec - in org.apache.qpid.test.unit.basic.MultipleConnectionTest
Running org.apache.qpid.test.unit.basic.BytesMessageTest
Tests run: 2, Failures: 0, Errors: 0, Skipped: 0, Time elapsed: 0.226 sec - in org.apache.qpid.test.unit.basic.BytesMessageTest
Running org.apache.qpid.test.unit.basic.ObjectMessageTest
Tests run: 1, Failures: 0, Errors: 0, Skipped: 0, Time elapsed: 0.189 sec - in org.apache.qpid.test.unit.basic.ObjectMessageTest
Running org.apache.qpid.test.utils.BrokerCommandHelperTest
Tests run: 1, Failures: 0, Errors: 0, Skipped: 0, Time elapsed: 0.006 sec - in org.apache.qpid.test.utils.BrokerCommandHelperTest
Running org.apache.qpid.test.utils.SpawnedBrokerHolderTest
Tests run: 1, Failures: 0, Errors: 0, Skipped: 0, Time elapsed: 0.148 sec - in org.apache.qpid.test.utils.SpawnedBrokerHolderTest
Running org.apache.qpid.test.client.failover.FailoverTest
Tests run: 7, Failures: 0, Errors: 0, Skipped: 0, Time elapsed: 1.225 sec - in org.apache.qpid.test.client.failover.FailoverTest
Running org.apache.qpid.test.client.message.MessageToStringTest
Tests run: 5, Failures: 0, Errors: 0, Skipped: 0, Time elapsed: 0.264 sec - in org.apache.qpid.test.client.message.MessageToStringTest
Running org.apache.qpid.test.client.message.JMSDestinationTest
Tests run: 7, Failures: 0, Errors: 0, Skipped: 0, Time elapsed: 0.325 sec - in org.apache.qpid.test.client.message.JMSDestinationTest
Running org.apache.qpid.test.client.message.SelectorTest
Tests run: 5, Failures: 0, Errors: 0, Skipped: 0, Time elapsed: 3.276 sec - in org.apache.qpid.test.client.message.SelectorTest
Running org.apache.qpid.test.client.message.JMSReplyToTest
Tests run: 2, Failures: 0, Errors: 0, Skipped: 0, Time elapsed: 0.178 sec - in org.apache.qpid.test.client.message.JMSReplyToTest
Running org.apache.qpid.test.client.message.ObjectMessageTest
Tests run: 5, Failures: 0, Errors: 0, Skipped: 0, Time elapsed: 0.411 sec - in org.apache.qpid.test.client.message.ObjectMessageTest
Running org.apache.qpid.test.client.message.JMSXUserIDTest
Tests run: 2, Failures: 0, Errors: 0, Skipped: 0, Time elapsed: 0.117 sec - in org.apache.qpid.test.client.message.JMSXUserIDTest
Running org.apache.qpid.test.client.RollbackOrderTest
Tests run: 2, Failures: 0, Errors: 0, Skipped: 0, Time elapsed: 1.757 sec - in org.apache.qpid.test.client.RollbackOrderTest
Running org.apache.qpid.test.client.DupsOkTest
Tests run: 1, Failures: 0, Errors: 0, Skipped: 0, Time elapsed: 0.149 sec - in org.apache.qpid.test.client.DupsOkTest
Running org.apache.qpid.test.client.QueueBrowserNoAckTest
Tests run: 7, Failures: 0, Errors: 0, Skipped: 0, Time elapsed: 3.007 sec - in org.apache.qpid.test.client.QueueBrowserNoAckTest
Running org.apache.qpid.test.client.ImmediateAndMandatoryPublishingTest
Tests run: 13, Failures: 0, Errors: 0, Skipped: 0, Time elapsed: 0.022 sec - in org.apache.qpid.test.client.ImmediateAndMandatoryPublishingTest
Running org.apache.qpid.test.client.ConsumerFlowControlTest
Tests run: 3, Failures: 0, Errors: 0, Skipped: 0, Time elapsed: 0.003 sec - in org.apache.qpid.test.client.ConsumerFlowControlTest
Running org.apache.qpid.test.client.QueueBrowserAutoAckTest
Tests run: 7, Failures: 0, Errors: 0, Skipped: 0, Time elapsed: 3.403 sec - in org.apache.qpid.test.client.QueueBrowserAutoAckTest
Running org.apache.qpid.test.client.destination.AddressBasedDestinationTest
Tests run: 45, Failures: 0, Errors: 0, Skipped: 0, Time elapsed: 11.883 sec - in org.apache.qpid.test.client.destination.AddressBasedDestinationTest
Running org.apache.qpid.test.client.QueueBrowserClientAckTest
Tests run: 7, Failures: 0, Errors: 0, Skipped: 0, Time elapsed: 3.272 sec - in org.apache.qpid.test.client.QueueBrowserClientAckTest
Running org.apache.qpid.test.client.QueueBrowserTransactedTest
Tests run: 7, Failures: 0, Errors: 0, Skipped: 0, Time elapsed: 3.131 sec - in org.apache.qpid.test.client.QueueBrowserTransactedTest
Running org.apache.qpid.test.client.QueueBrowserDupsOkTest
Tests run: 7, Failures: 0, Errors: 0, Skipped: 0, Time elapsed: 3.13 sec - in org.apache.qpid.test.client.QueueBrowserDupsOkTest
Running org.apache.qpid.test.client.queue.QueuePolicyTest
Tests run: 2, Failures: 0, Errors: 0, Skipped: 0, Time elapsed: 0.125 sec - in org.apache.qpid.test.client.queue.QueuePolicyTest
Running org.apache.qpid.test.client.queue.QueueReceiverTest
Tests run: 1, Failures: 0, Errors: 0, Skipped: 0, Time elapsed: 0.067 sec - in org.apache.qpid.test.client.queue.QueueReceiverTest
Running org.apache.qpid.test.client.QueueBrowserPreAckTest
Tests run: 7, Failures: 0, Errors: 0, Skipped: 0, Time elapsed: 3.355 sec - in org.apache.qpid.test.client.QueueBrowserPreAckTest
Running org.apache.qpid.test.client.ProducerFlowControlTest
Tests run: 1, Failures: 0, Errors: 0, Skipped: 0, Time elapsed: 0.001 sec - in org.apache.qpid.test.client.ProducerFlowControlTest
Running org.apache.qpid.test.client.CloseOnNoRouteForMandatoryMessageTest
Tests run: 4, Failures: 0, Errors: 0, Skipped: 0, Time elapsed: 0.002 sec - in org.apache.qpid.test.client.CloseOnNoRouteForMandatoryMessageTest

Results :

Tests in error: 
  AlternateBindingRoutingTest>QpidTestCase.run:165->QpidBrokerTestCase.runBare:91->QpidTestCase.runTest:181->testFanoutExchangeAsAlternateBinding:50->QpidBrokerTestCase.createEntityUsingAmqpManagement:355
ยป JMS

Tests run: 978, Failures: 0, Errors: 1, Skipped: 0

[INFO] ------------------------------------------------------------------------
[INFO] BUILD FAILURE
[INFO] ------------------------------------------------------------------------
[INFO] Total time: 06:31 min
[INFO] Finished at: 2017-06-20T15:00:30Z
[INFO] Final Memory: 40M/1398M
[INFO] ------------------------------------------------------------------------
[ERROR] Failed to execute goal org.apache.maven.plugins:maven-surefire-plugin:2.19.1:test
(integration-test) on project qpid-systests: There are test failures.
[ERROR] 
[ERROR] Please refer to <https://builds.apache.org/job/Qpid-cpp-JMS-AMQP-0-x-Test/4010/artifact/qpid-broker-j/systests/target/surefire-reports/cpp>
for the individual test results.
[ERROR] -> [Help 1]
[ERROR] 
[ERROR] To see the full stack trace of the errors, re-run Maven with the -e switch.
[ERROR] Re-run Maven using the -X switch to enable full debug logging.
[ERROR] 
[ERROR] For more information about the errors and possible solutions, please read the following
articles:
[ERROR] [Help 1] http://cwiki.apache.org/confluence/display/MAVEN/MojoFailureException
Build step 'Invoke top-level Maven targets' marked build as failure
[locks-and-latches] Releasing all the locks
[locks-and-latches] All the locks released
Archiving artifacts
Recording test results

Mime
View raw message