qpid-notifications mailing list archives

Site index · List index
Message view « Date » · « Thread »
Top « Date » · « Thread »
From Apache Jenkins Server <jenk...@builds.apache.org>
Subject Build failed in Jenkins: Qpid-Java-Artefact-Release-6.1.x #44
Date Mon, 22 May 2017 16:23:18 GMT
See <https://builds.apache.org/job/Qpid-Java-Artefact-Release-6.1.x/44/display/redirect?page=changes>

Changes:

[lquack] QPID-7794: [Java Broker] Periodically report the number of bytes

[lquack] QPID-7794: [Java Broker] periodically log flow to disk statistics on

[lquack] QPID-7783: [Java Broker] Dispose of QpidByteBuffers associated with

[lquack] QPID-7784: [Java Broker] Dispose QpidByteBuffers associated with pooled

[lquack] QPID-7795: [Java Broker] Ensure that a newly enqueued message that is

[lquack] QPID-7723: Optimize evaluation of metadata storable size for AMQP 0-10

[lquack] QPID-7723: [0-10] Allow header to be optional when computing the encoded

------------------------------------------
[...truncated 16.67 KB...]
     [echo] [profile.test.excludes] Excludes JavaExcludes java-mms.0-10.excludes JavaTransientExcludes
Java010Excludes
     [echo] [profile.broker.version] v0_10
     [echo] [profile.test.amqp_port_protocols] ["AMQP_0_8","AMQP_0_9","AMQP_0_9_1","AMQP_0_10"]
     [echo] [profile.broker.persistent] false
     [echo] [profile.virtualhostnode.type] Memory
     [echo] [profile.virtualhostnode.context.blueprint] {"type":"ProvidedStore","globalAddressDomains":"${qpid.globalAddressDomains}"}
     [echo] [profile.test_receive_timeout] 1000
[INFO] Executed tasks
[INFO] 
[INFO] --- maven-enforcer-plugin:1.3.1:enforce (enforce-minimum-versions) @ qpid-test-utils
---
[INFO] 
[INFO] --- maven-enforcer-plugin:1.3.1:enforce (enforce-versions-standard-properties) @ qpid-test-utils
---
[INFO] 
[INFO] --- jacoco-maven-plugin:0.7.5.201505241946:prepare-agent (default-prepare-agent) @
qpid-test-utils ---
[INFO] argLine set to -javaagent:/home/jenkins/.m2/repository/org/jacoco/org.jacoco.agent/0.7.5.201505241946/org.jacoco.agent-0.7.5.201505241946-runtime.jar=destfile=<https://builds.apache.org/job/Qpid-Java-Artefact-Release-6.1.x/ws/qpid-test-utils/target/jacoco.exec>
-Xmx512m
[INFO] 
[INFO] --- maven-remote-resources-plugin:1.5:process (default) @ qpid-test-utils ---
[INFO] 
[INFO] --- maven-resources-plugin:2.6:resources (default-resources) @ qpid-test-utils ---
[INFO] Using 'UTF-8' encoding to copy filtered resources.
[INFO] Copying 1 resource
[INFO] Copying 3 resources
[INFO] 
[INFO] --- maven-compiler-plugin:3.1:compile (default-compile) @ qpid-test-utils ---
[INFO] Changes detected - recompiling the module!
[INFO] Compiling 6 source files to <https://builds.apache.org/job/Qpid-Java-Artefact-Release-6.1.x/ws/qpid-test-utils/target/classes>
[INFO] 
[INFO] --- maven-resources-plugin:2.6:testResources (default-testResources) @ qpid-test-utils
---
[INFO] Using 'UTF-8' encoding to copy filtered resources.
[INFO] skip non existing resourceDirectory <https://builds.apache.org/job/Qpid-Java-Artefact-Release-6.1.x/ws/qpid-test-utils/src/test/resources>
[INFO] Copying 3 resources
[INFO] 
[INFO] --- maven-compiler-plugin:3.1:testCompile (default-testCompile) @ qpid-test-utils ---
[INFO] No sources to compile
[INFO] 
[INFO] --- maven-surefire-plugin:2.17:test (default-test) @ qpid-test-utils ---
[INFO] 
[INFO] --- maven-jar-plugin:2.5:jar (default-jar) @ qpid-test-utils ---
[INFO] Building jar: <https://builds.apache.org/job/Qpid-Java-Artefact-Release-6.1.x/ws/qpid-test-utils/target/qpid-test-utils-6.1.3-SNAPSHOT.jar>
[INFO] 
[INFO] --- maven-site-plugin:3.4:attach-descriptor (attach-descriptor) @ qpid-test-utils ---
[INFO]                                                                         
[INFO] ------------------------------------------------------------------------
[INFO] Building Apache Qpid Common 6.1.3-SNAPSHOT
[INFO] ------------------------------------------------------------------------
[INFO] 
[INFO] --- maven-clean-plugin:2.5:clean (default-clean) @ qpid-common ---
[INFO] 
[INFO] --- buildnumber-maven-plugin:1.3:create (default) @ qpid-common ---
[INFO] Executing: /bin/sh -c cd <https://builds.apache.org/job/Qpid-Java-Artefact-Release-6.1.x/ws/common>
&& svn --non-interactive info
[INFO] Working directory: <https://builds.apache.org/job/Qpid-Java-Artefact-Release-6.1.x/ws/common>
[INFO] Storing buildNumber: null at timestamp: 1495470194400
[INFO] Executing: /bin/sh -c cd <https://builds.apache.org/job/Qpid-Java-Artefact-Release-6.1.x/ws/common>
&& svn --non-interactive info
[INFO] Working directory: <https://builds.apache.org/job/Qpid-Java-Artefact-Release-6.1.x/ws/common>
[INFO] Storing buildScmBranch: UNKNOWN_BRANCH
[INFO] 
[INFO] --- maven-antrun-plugin:1.7:run (output-test-properties) @ qpid-common ---
[INFO] Executing tasks

main:
     [echo] Qpid Test Profile Properties
     [echo] [profile] java-mms.0-10
     [echo] [profile.broker.language] java
     [echo] [profile.broker.type] internal
     [echo] [profile.broker.command] "<https://builds.apache.org/job/Qpid-Java-Artefact-Release-6.1.x/ws/common/bin/qpid-server">
-sp "@STORE_PATH" -st @STORE_TYPE -prop test.port=@PORT -prop "qpid.work_dir=@QPID_WORK"
     [echo] [profile.specific.excludes] JavaTransientExcludes Java010Excludes
     [echo] [profile.test.excludes] Excludes JavaExcludes java-mms.0-10.excludes JavaTransientExcludes
Java010Excludes
     [echo] [profile.broker.version] v0_10
     [echo] [profile.test.amqp_port_protocols] ["AMQP_0_8","AMQP_0_9","AMQP_0_9_1","AMQP_0_10"]
     [echo] [profile.broker.persistent] false
     [echo] [profile.virtualhostnode.type] Memory
     [echo] [profile.virtualhostnode.context.blueprint] {"type":"ProvidedStore","globalAddressDomains":"${qpid.globalAddressDomains}"}
     [echo] [profile.test_receive_timeout] 1000
[INFO] Executed tasks
[INFO] 
[INFO] --- maven-enforcer-plugin:1.3.1:enforce (enforce-minimum-versions) @ qpid-common ---
[INFO] 
[INFO] --- maven-enforcer-plugin:1.3.1:enforce (enforce-versions-standard-properties) @ qpid-common
---
[INFO] 
[INFO] --- jacoco-maven-plugin:0.7.5.201505241946:prepare-agent (default-prepare-agent) @
qpid-common ---
[INFO] argLine set to -javaagent:/home/jenkins/.m2/repository/org/jacoco/org.jacoco.agent/0.7.5.201505241946/org.jacoco.agent-0.7.5.201505241946-runtime.jar=destfile=<https://builds.apache.org/job/Qpid-Java-Artefact-Release-6.1.x/ws/common/target/jacoco.exec>
-Xmx512m
[INFO] 
[INFO] --- maven-antrun-plugin:1.7:run (amqp-0-8-generated) @ qpid-common ---
[INFO] Executing tasks

main:

amqp-0-10-generation:

generate-sources:
[INFO] Executed tasks
[INFO] 
[INFO] --- maven-remote-resources-plugin:1.5:process (default) @ qpid-common ---
[INFO] 
[INFO] --- maven-resources-plugin:2.6:resources (default-resources) @ qpid-common ---
[INFO] Using 'UTF-8' encoding to copy filtered resources.
[INFO] Copying 1 resource
[INFO] Copying 3 resources
[INFO] 
[INFO] --- maven-compiler-plugin:3.1:compile (default-compile) @ qpid-common ---
[INFO] Changes detected - recompiling the module!
[INFO] Compiling 384 source files to <https://builds.apache.org/job/Qpid-Java-Artefact-Release-6.1.x/ws/common/target/classes>
[INFO] -------------------------------------------------------------
[WARNING] COMPILATION WARNING : 
[INFO] -------------------------------------------------------------
[WARNING] <https://builds.apache.org/job/Qpid-Java-Artefact-Release-6.1.x/ws/common/src/main/java/org/apache/qpid/QpidException.java>:
Some input files use unchecked or unsafe operations.
[WARNING] <https://builds.apache.org/job/Qpid-Java-Artefact-Release-6.1.x/ws/common/src/main/java/org/apache/qpid/QpidException.java>:
Recompile with -Xlint:unchecked for details.
[INFO] 2 warnings 
[INFO] -------------------------------------------------------------
[INFO] -------------------------------------------------------------
[ERROR] COMPILATION ERROR : 
[INFO] -------------------------------------------------------------
[ERROR] <https://builds.apache.org/job/Qpid-Java-Artefact-Release-6.1.x/ws/common/src/main/java/org/apache/qpid/transport/DeliveryProperties.java>:[551,20]
cannot find symbol
  symbol:   variable EncoderUtils
  location: class org.apache.qpid.transport.DeliveryProperties
[ERROR] <https://builds.apache.org/job/Qpid-Java-Artefact-Release-6.1.x/ws/common/src/main/java/org/apache/qpid/transport/DeliveryProperties.java>:[555,20]
cannot find symbol
  symbol:   variable EncoderUtils
  location: class org.apache.qpid.transport.DeliveryProperties
[ERROR] <https://builds.apache.org/job/Qpid-Java-Artefact-Release-6.1.x/ws/common/src/main/java/org/apache/qpid/transport/DeliveryProperties.java>:[559,20]
cannot find symbol
  symbol:   variable EncoderUtils
  location: class org.apache.qpid.transport.DeliveryProperties
[ERROR] <https://builds.apache.org/job/Qpid-Java-Artefact-Release-6.1.x/ws/common/src/main/java/org/apache/qpid/transport/MessageProperties.java>:[412,20]
cannot find symbol
  symbol:   variable EncoderUtils
  location: class org.apache.qpid.transport.MessageProperties
[ERROR] <https://builds.apache.org/job/Qpid-Java-Artefact-Release-6.1.x/ws/common/src/main/java/org/apache/qpid/transport/MessageProperties.java>:[416,20]
cannot find symbol
  symbol:   variable EncoderUtils
  location: class org.apache.qpid.transport.MessageProperties
[ERROR] <https://builds.apache.org/job/Qpid-Java-Artefact-Release-6.1.x/ws/common/src/main/java/org/apache/qpid/transport/MessageProperties.java>:[420,20]
cannot find symbol
  symbol:   variable EncoderUtils
  location: class org.apache.qpid.transport.MessageProperties
[ERROR] <https://builds.apache.org/job/Qpid-Java-Artefact-Release-6.1.x/ws/common/src/main/java/org/apache/qpid/transport/MessageProperties.java>:[424,20]
cannot find symbol
  symbol:   variable EncoderUtils
  location: class org.apache.qpid.transport.MessageProperties
[ERROR] <https://builds.apache.org/job/Qpid-Java-Artefact-Release-6.1.x/ws/common/src/main/java/org/apache/qpid/transport/MessageProperties.java>:[428,20]
cannot find symbol
  symbol:   variable EncoderUtils
  location: class org.apache.qpid.transport.MessageProperties
[ERROR] <https://builds.apache.org/job/Qpid-Java-Artefact-Release-6.1.x/ws/common/src/main/java/org/apache/qpid/transport/MessageProperties.java>:[432,20]
cannot find symbol
  symbol:   variable EncoderUtils
  location: class org.apache.qpid.transport.MessageProperties
[ERROR] <https://builds.apache.org/job/Qpid-Java-Artefact-Release-6.1.x/ws/common/src/main/java/org/apache/qpid/transport/MessageProperties.java>:[436,20]
cannot find symbol
  symbol:   variable EncoderUtils
  location: class org.apache.qpid.transport.MessageProperties
[ERROR] <https://builds.apache.org/job/Qpid-Java-Artefact-Release-6.1.x/ws/common/src/main/java/org/apache/qpid/transport/ReplyTo.java>:[160,20]
cannot find symbol
  symbol:   variable EncoderUtils
  location: class org.apache.qpid.transport.ReplyTo
[ERROR] <https://builds.apache.org/job/Qpid-Java-Artefact-Release-6.1.x/ws/common/src/main/java/org/apache/qpid/transport/ReplyTo.java>:[164,20]
cannot find symbol
  symbol:   variable EncoderUtils
  location: class org.apache.qpid.transport.ReplyTo
[INFO] 12 errors 
[INFO] -------------------------------------------------------------
[INFO] ------------------------------------------------------------------------
[INFO] Reactor Summary:
[INFO] 
[INFO] Apache Qpid for Java ............................... SUCCESS [  2.292 s]
[INFO] Apache Qpid Broker Code Generation ................. SUCCESS [  1.977 s]
[INFO] Apache Qpid Test Utilities ......................... SUCCESS [  0.608 s]
[INFO] Apache Qpid Common ................................. FAILURE [  3.983 s]
[INFO] Apache Qpid Broker Core ............................ SKIPPED
[INFO] Apache Qpid LogBack Logging Broker Plug-in ......... SKIPPED
[INFO] Apache Qpid Access Control Broker Plug-in .......... SKIPPED
[INFO] Apache Qpid AMQP 0-8 Protocol Broker Plug-in ....... SKIPPED
[INFO] Apache Qpid AMQP 0-10 Protocol Plug-in ............. SKIPPED
[INFO] Apache Qpid AMQP 1-0 Protocol Broker Plug-in ....... SKIPPED
[INFO] Apache Qpid AMQP 0-8 to 0-10 Message Conversion Broker Plug-in SKIPPED
[INFO] Apache Qpid AMQP 0-8 to 1-0 Message Conversion Broker Plug-in SKIPPED
[INFO] Apache Qpid AMQP 0-10 to 1-0 Message Conversion Broker Plug-in SKIPPED
[INFO] Apache Qpid Derby Message Store Broker Plug-in ..... SKIPPED
[INFO] Apache Qpid JDBC Message Store Connection Pooling Plug-in SKIPPED
[INFO] Apache Qpid JDBC Message Store Broker Plug-in ...... SKIPPED
[INFO] Apache Qpid HTTP Management Broker Plug-in ......... SKIPPED
[INFO] Apache Qpid Memory Message Store Broker Plug-in .... SKIPPED
[INFO] Apache Qpid WebSocket Broker Plug-in ............... SKIPPED
[INFO] Apache Qpid JMS Client for AMQP 0-9-1/0-10 ......... SKIPPED
[INFO] Apache Qpid BDB Message Store Broker Plug-in ....... SKIPPED
[INFO] Apache Qpid Broker for Java ........................ SKIPPED
[INFO] Apache Qpid AMQP Management Protocol Broker Plug-in  SKIPPED
[INFO] Apache Qpid Client for AMQP 0-9-1/0-10 Examples .... SKIPPED
[INFO] Apache Qpid JCA .................................... SKIPPED
[INFO] Apache Qpid Resource Adaptor ....................... SKIPPED
[INFO] Apache Qpid Tools .................................. SKIPPED
[INFO] Apache Qpid System Test Parent ..................... SKIPPED
[INFO] Apache Qpid System Tests ........................... SKIPPED
[INFO] Apache Qpid Performance Tests ...................... SKIPPED
[INFO] Apache Qpid Performance Test System Tests .......... SKIPPED
[INFO] Apache Qpid Performance Tests Visualisation JFC .... SKIPPED
[INFO] Apache Qpid BDB Store System Tests ................. SKIPPED
[INFO] Apache Qpid Joram JMS Tests ........................ SKIPPED
[INFO] Apache Qpid JMX TCK Configuration .................. SKIPPED
[INFO] Apache Qpid for Java Docbook ....................... SKIPPED
[INFO] Apache Qpid Broker for Java Docbook ................ SKIPPED
[INFO] Apache Qpid JMS Client for AMQP 0-8, 0-9 and 0-9-1 Docbook SKIPPED
[INFO] Apache Qpid JMS Client for AMQP 0-10 Docbook ....... SKIPPED
[INFO] Apache Qpid Performance Test Docbook ............... SKIPPED
[INFO] ------------------------------------------------------------------------
[INFO] BUILD FAILURE
[INFO] ------------------------------------------------------------------------
[INFO] Total time: 10.036 s
[INFO] Finished at: 2017-05-22T16:23:18+00:00
[INFO] Final Memory: 41M/1447M
[INFO] ------------------------------------------------------------------------
[ERROR] Failed to execute goal org.apache.maven.plugins:maven-compiler-plugin:3.1:compile
(default-compile) on project qpid-common: Compilation failure: Compilation failure:
[ERROR] <https://builds.apache.org/job/Qpid-Java-Artefact-Release-6.1.x/ws/common/src/main/java/org/apache/qpid/transport/DeliveryProperties.java>:[551,20]
cannot find symbol
[ERROR] symbol:   variable EncoderUtils
[ERROR] location: class org.apache.qpid.transport.DeliveryProperties
[ERROR] <https://builds.apache.org/job/Qpid-Java-Artefact-Release-6.1.x/ws/common/src/main/java/org/apache/qpid/transport/DeliveryProperties.java>:[555,20]
cannot find symbol
[ERROR] symbol:   variable EncoderUtils
[ERROR] location: class org.apache.qpid.transport.DeliveryProperties
[ERROR] <https://builds.apache.org/job/Qpid-Java-Artefact-Release-6.1.x/ws/common/src/main/java/org/apache/qpid/transport/DeliveryProperties.java>:[559,20]
cannot find symbol
[ERROR] symbol:   variable EncoderUtils
[ERROR] location: class org.apache.qpid.transport.DeliveryProperties
[ERROR] <https://builds.apache.org/job/Qpid-Java-Artefact-Release-6.1.x/ws/common/src/main/java/org/apache/qpid/transport/MessageProperties.java>:[412,20]
cannot find symbol
[ERROR] symbol:   variable EncoderUtils
[ERROR] location: class org.apache.qpid.transport.MessageProperties
[ERROR] <https://builds.apache.org/job/Qpid-Java-Artefact-Release-6.1.x/ws/common/src/main/java/org/apache/qpid/transport/MessageProperties.java>:[416,20]
cannot find symbol
[ERROR] symbol:   variable EncoderUtils
[ERROR] location: class org.apache.qpid.transport.MessageProperties
[ERROR] <https://builds.apache.org/job/Qpid-Java-Artefact-Release-6.1.x/ws/common/src/main/java/org/apache/qpid/transport/MessageProperties.java>:[420,20]
cannot find symbol
[ERROR] symbol:   variable EncoderUtils
[ERROR] location: class org.apache.qpid.transport.MessageProperties
[ERROR] <https://builds.apache.org/job/Qpid-Java-Artefact-Release-6.1.x/ws/common/src/main/java/org/apache/qpid/transport/MessageProperties.java>:[424,20]
cannot find symbol
[ERROR] symbol:   variable EncoderUtils
[ERROR] location: class org.apache.qpid.transport.MessageProperties
[ERROR] <https://builds.apache.org/job/Qpid-Java-Artefact-Release-6.1.x/ws/common/src/main/java/org/apache/qpid/transport/MessageProperties.java>:[428,20]
cannot find symbol
[ERROR] symbol:   variable EncoderUtils
[ERROR] location: class org.apache.qpid.transport.MessageProperties
[ERROR] <https://builds.apache.org/job/Qpid-Java-Artefact-Release-6.1.x/ws/common/src/main/java/org/apache/qpid/transport/MessageProperties.java>:[432,20]
cannot find symbol
[ERROR] symbol:   variable EncoderUtils
[ERROR] location: class org.apache.qpid.transport.MessageProperties
[ERROR] <https://builds.apache.org/job/Qpid-Java-Artefact-Release-6.1.x/ws/common/src/main/java/org/apache/qpid/transport/MessageProperties.java>:[436,20]
cannot find symbol
[ERROR] symbol:   variable EncoderUtils
[ERROR] location: class org.apache.qpid.transport.MessageProperties
[ERROR] <https://builds.apache.org/job/Qpid-Java-Artefact-Release-6.1.x/ws/common/src/main/java/org/apache/qpid/transport/ReplyTo.java>:[160,20]
cannot find symbol
[ERROR] symbol:   variable EncoderUtils
[ERROR] location: class org.apache.qpid.transport.ReplyTo
[ERROR] <https://builds.apache.org/job/Qpid-Java-Artefact-Release-6.1.x/ws/common/src/main/java/org/apache/qpid/transport/ReplyTo.java>:[164,20]
cannot find symbol
[ERROR] symbol:   variable EncoderUtils
[ERROR] location: class org.apache.qpid.transport.ReplyTo
[ERROR] -> [Help 1]
[ERROR] 
[ERROR] To see the full stack trace of the errors, re-run Maven with the -e switch.
[ERROR] Re-run Maven using the -X switch to enable full debug logging.
[ERROR] 
[ERROR] For more information about the errors and possible solutions, please read the following
articles:
[ERROR] [Help 1] http://cwiki.apache.org/confluence/display/MAVEN/MojoFailureException
[ERROR] 
[ERROR] After correcting the problems, you can resume the build with the command
[ERROR]   mvn <goals> -rf :qpid-common
Build step 'Invoke top-level Maven targets' marked build as failure
Archiving artifacts

Mime
View raw message