qpid-notifications mailing list archives

Site index · List index
Message view « Date » · « Thread »
Top « Date » · « Thread »
From Apache Jenkins Server <jenk...@builds.apache.org>
Subject Build failed in Jenkins: Qpid-Java-Artefact-Release-6.1.x #39
Date Wed, 03 May 2017 15:59:58 GMT
See <https://builds.apache.org/job/Qpid-Java-Artefact-Release-6.1.x/39/display/redirect?page=changes>

Changes:

[orudyy] QPID-7763: [Java Broker] Flow to disk if allocated direct memory exceeds

[orudyy] QPID-7763: [Java Broker] Fix mock in unit tests

[orudyy] QPID-7763: [Java Broker] Avoid allocating large non-pooled direct byte

------------------------------------------
[...truncated 17.59 KB...]
[INFO] 
[INFO] --- jacoco-maven-plugin:0.7.5.201505241946:prepare-agent (default-prepare-agent) @
qpid-test-utils ---
[INFO] argLine set to -javaagent:/home/jenkins/.m2/repository/org/jacoco/org.jacoco.agent/0.7.5.201505241946/org.jacoco.agent-0.7.5.201505241946-runtime.jar=destfile=<https://builds.apache.org/job/Qpid-Java-Artefact-Release-6.1.x/ws/qpid-test-utils/target/jacoco.exec>
-Xmx512m
[INFO] 
[INFO] --- maven-remote-resources-plugin:1.5:process (default) @ qpid-test-utils ---
[INFO] 
[INFO] --- maven-resources-plugin:2.6:resources (default-resources) @ qpid-test-utils ---
[INFO] Using 'UTF-8' encoding to copy filtered resources.
[INFO] Copying 1 resource
[INFO] Copying 3 resources
[INFO] 
[INFO] --- maven-compiler-plugin:3.1:compile (default-compile) @ qpid-test-utils ---
[INFO] Changes detected - recompiling the module!
[INFO] Compiling 6 source files to <https://builds.apache.org/job/Qpid-Java-Artefact-Release-6.1.x/ws/qpid-test-utils/target/classes>
[INFO] 
[INFO] --- maven-resources-plugin:2.6:testResources (default-testResources) @ qpid-test-utils
---
[INFO] Using 'UTF-8' encoding to copy filtered resources.
[INFO] skip non existing resourceDirectory <https://builds.apache.org/job/Qpid-Java-Artefact-Release-6.1.x/ws/qpid-test-utils/src/test/resources>
[INFO] Copying 3 resources
[INFO] 
[INFO] --- maven-compiler-plugin:3.1:testCompile (default-testCompile) @ qpid-test-utils ---
[INFO] No sources to compile
[INFO] 
[INFO] --- maven-surefire-plugin:2.17:test (default-test) @ qpid-test-utils ---
[INFO] 
[INFO] --- maven-jar-plugin:2.5:jar (default-jar) @ qpid-test-utils ---
[INFO] Building jar: <https://builds.apache.org/job/Qpid-Java-Artefact-Release-6.1.x/ws/qpid-test-utils/target/qpid-test-utils-6.1.3-SNAPSHOT.jar>
[INFO] 
[INFO] --- maven-site-plugin:3.4:attach-descriptor (attach-descriptor) @ qpid-test-utils ---
[INFO]                                                                         
[INFO] ------------------------------------------------------------------------
[INFO] Building Apache Qpid Common 6.1.3-SNAPSHOT
[INFO] ------------------------------------------------------------------------
[INFO] 
[INFO] --- maven-clean-plugin:2.5:clean (default-clean) @ qpid-common ---
[INFO] 
[INFO] --- buildnumber-maven-plugin:1.3:create (default) @ qpid-common ---
[INFO] Executing: /bin/sh -c cd <https://builds.apache.org/job/Qpid-Java-Artefact-Release-6.1.x/ws/common>
&& svn --non-interactive info
[INFO] Working directory: <https://builds.apache.org/job/Qpid-Java-Artefact-Release-6.1.x/ws/common>
[INFO] Storing buildNumber: null at timestamp: 1493827172490
[INFO] Executing: /bin/sh -c cd <https://builds.apache.org/job/Qpid-Java-Artefact-Release-6.1.x/ws/common>
&& svn --non-interactive info
[INFO] Working directory: <https://builds.apache.org/job/Qpid-Java-Artefact-Release-6.1.x/ws/common>
[INFO] Storing buildScmBranch: UNKNOWN_BRANCH
[INFO] 
[INFO] --- maven-antrun-plugin:1.7:run (output-test-properties) @ qpid-common ---
[INFO] Executing tasks

main:
     [echo] Qpid Test Profile Properties
     [echo] [profile] java-mms.0-10
     [echo] [profile.broker.language] java
     [echo] [profile.broker.type] internal
     [echo] [profile.broker.command] "<https://builds.apache.org/job/Qpid-Java-Artefact-Release-6.1.x/ws/common/bin/qpid-server">
-sp "@STORE_PATH" -st @STORE_TYPE -prop test.port=@PORT -prop "qpid.work_dir=@QPID_WORK"
     [echo] [profile.specific.excludes] JavaTransientExcludes Java010Excludes
     [echo] [profile.test.excludes] Excludes JavaExcludes java-mms.0-10.excludes JavaTransientExcludes
Java010Excludes
     [echo] [profile.broker.version] v0_10
     [echo] [profile.test.amqp_port_protocols] ["AMQP_0_8","AMQP_0_9","AMQP_0_9_1","AMQP_0_10"]
     [echo] [profile.broker.persistent] false
     [echo] [profile.virtualhostnode.type] Memory
     [echo] [profile.virtualhostnode.context.blueprint] {"type":"ProvidedStore","globalAddressDomains":"${qpid.globalAddressDomains}"}
     [echo] [profile.test_receive_timeout] 1000
[INFO] Executed tasks
[INFO] 
[INFO] --- maven-enforcer-plugin:1.3.1:enforce (enforce-minimum-versions) @ qpid-common ---
[INFO] 
[INFO] --- maven-enforcer-plugin:1.3.1:enforce (enforce-versions-standard-properties) @ qpid-common
---
[INFO] 
[INFO] --- jacoco-maven-plugin:0.7.5.201505241946:prepare-agent (default-prepare-agent) @
qpid-common ---
[INFO] argLine set to -javaagent:/home/jenkins/.m2/repository/org/jacoco/org.jacoco.agent/0.7.5.201505241946/org.jacoco.agent-0.7.5.201505241946-runtime.jar=destfile=<https://builds.apache.org/job/Qpid-Java-Artefact-Release-6.1.x/ws/common/target/jacoco.exec>
-Xmx512m
[INFO] 
[INFO] --- maven-antrun-plugin:1.7:run (amqp-0-8-generated) @ qpid-common ---
[INFO] Executing tasks

main:

amqp-0-10-generation:

generate-sources:
[INFO] Executed tasks
[INFO] 
[INFO] --- maven-remote-resources-plugin:1.5:process (default) @ qpid-common ---
[INFO] 
[INFO] --- maven-resources-plugin:2.6:resources (default-resources) @ qpid-common ---
[INFO] Using 'UTF-8' encoding to copy filtered resources.
[INFO] Copying 1 resource
[INFO] Copying 3 resources
[INFO] 
[INFO] --- maven-compiler-plugin:3.1:compile (default-compile) @ qpid-common ---
[INFO] Changes detected - recompiling the module!
[INFO] Compiling 383 source files to <https://builds.apache.org/job/Qpid-Java-Artefact-Release-6.1.x/ws/common/target/classes>
[WARNING] <https://builds.apache.org/job/Qpid-Java-Artefact-Release-6.1.x/ws/common/src/main/java/org/apache/qpid/QpidException.java>:
Some input files use unchecked or unsafe operations.
[WARNING] <https://builds.apache.org/job/Qpid-Java-Artefact-Release-6.1.x/ws/common/src/main/java/org/apache/qpid/QpidException.java>:
Recompile with -Xlint:unchecked for details.
[INFO] 
[INFO] --- maven-resources-plugin:2.6:testResources (default-testResources) @ qpid-common
---
[INFO] Using 'UTF-8' encoding to copy filtered resources.
[INFO] Copying 2 resources
[INFO] skip non existing resourceDirectory <https://builds.apache.org/job/Qpid-Java-Artefact-Release-6.1.x/ws/common/src/test/resources>
[INFO] Copying 6 resources
[INFO] Copying 3 resources
[INFO] 
[INFO] --- maven-compiler-plugin:3.1:testCompile (default-testCompile) @ qpid-common ---
[INFO] Changes detected - recompiling the module!
[INFO] Compiling 31 source files to <https://builds.apache.org/job/Qpid-Java-Artefact-Release-6.1.x/ws/common/target/test-classes>
[INFO] 
[INFO] --- maven-surefire-plugin:2.17:test (default-test) @ qpid-common ---
[INFO] Surefire report directory: <https://builds.apache.org/job/Qpid-Java-Artefact-Release-6.1.x/ws/common/target/surefire-reports/java-mms.0-10>

-------------------------------------------------------
 T E S T S
-------------------------------------------------------
Running org.apache.qpid.framing.AMQShortStringTest
Tests run: 9, Failures: 0, Errors: 0, Skipped: 0, Time elapsed: 0.634 sec - in org.apache.qpid.framing.AMQShortStringTest
Running org.apache.qpid.framing.FieldTableTest
Tests run: 26, Failures: 0, Errors: 0, Skipped: 0, Time elapsed: 0.152 sec - in org.apache.qpid.framing.FieldTableTest
Running org.apache.qpid.framing.BasicContentHeaderPropertiesTest
Tests run: 17, Failures: 0, Errors: 0, Skipped: 0, Time elapsed: 0.076 sec - in org.apache.qpid.framing.BasicContentHeaderPropertiesTest
Running org.apache.qpid.framing.abstraction.MessagePublishInfoImplTest
Tests run: 4, Failures: 0, Errors: 0, Skipped: 0, Time elapsed: 0.01 sec - in org.apache.qpid.framing.abstraction.MessagePublishInfoImplTest
Running org.apache.qpid.streams.CompositeInputStreamTest
Tests run: 5, Failures: 0, Errors: 0, Skipped: 0, Time elapsed: 0.31 sec - in org.apache.qpid.streams.CompositeInputStreamTest
Running org.apache.qpid.thread.ThreadFactoryTest
Tests run: 3, Failures: 0, Errors: 0, Skipped: 0, Time elapsed: 0.009 sec - in org.apache.qpid.thread.ThreadFactoryTest
Running org.apache.qpid.QpidExceptionTest
Tests run: 4, Failures: 0, Errors: 0, Skipped: 0, Time elapsed: 0.012 sec - in org.apache.qpid.QpidExceptionTest
Running org.apache.qpid.ssl.SSLContextFactoryTest
Tests run: 4, Failures: 0, Errors: 0, Skipped: 0, Time elapsed: 0.051 sec - in org.apache.qpid.ssl.SSLContextFactoryTest
Running org.apache.qpid.ssl.TrustManagerTest
Tests run: 4, Failures: 0, Errors: 0, Skipped: 0, Time elapsed: 0.114 sec - in org.apache.qpid.ssl.TrustManagerTest
Running org.apache.qpid.pool.SuppressingInheritedAccessControlContextThreadFactoryTest
Tests run: 1, Failures: 0, Errors: 0, Skipped: 0, Time elapsed: 0.008 sec - in org.apache.qpid.pool.SuppressingInheritedAccessControlContextThreadFactoryTest
Running org.apache.qpid.util.StringsTest
Tests run: 1, Failures: 0, Errors: 0, Skipped: 0, Time elapsed: 0.01 sec - in org.apache.qpid.util.StringsTest
Running org.apache.qpid.util.CommandLineParserTest
Tests run: 22, Failures: 0, Errors: 0, Skipped: 0, Time elapsed: 0.064 sec - in org.apache.qpid.util.CommandLineParserTest
Running org.apache.qpid.util.GZIPUtilsTest
Tests run: 7, Failures: 0, Errors: 0, Skipped: 0, Time elapsed: 0.029 sec - in org.apache.qpid.util.GZIPUtilsTest
Running org.apache.qpid.util.SerialTest
Tests run: 2, Failures: 0, Errors: 0, Skipped: 0, Time elapsed: 0.034 sec - in org.apache.qpid.util.SerialTest
Running org.apache.qpid.util.ByteBufferInputStreamTest
Tests run: 6, Failures: 0, Errors: 0, Skipped: 0, Time elapsed: 0.016 sec - in org.apache.qpid.util.ByteBufferInputStreamTest
Running org.apache.qpid.util.FileUtilsTest
Tests run: 15, Failures: 0, Errors: 0, Skipped: 0, Time elapsed: 0.07 sec - in org.apache.qpid.util.FileUtilsTest
Running org.apache.qpid.bytebuffer.QpidByteBufferOutputStreamTest
Tests run: 4, Failures: 0, Errors: 0, Skipped: 0, Time elapsed: 0.001 sec - in org.apache.qpid.bytebuffer.QpidByteBufferOutputStreamTest
Running org.apache.qpid.bytebuffer.QpidByteBufferTest
Tests run: 28, Failures: 1, Errors: 0, Skipped: 0, Time elapsed: 0.087 sec <<< FAILURE!
- in org.apache.qpid.bytebuffer.QpidByteBufferTest
testDeflateInflateHeap(org.apache.qpid.bytebuffer.QpidByteBufferTest)  Time elapsed: 0.011
sec  <<< FAILURE!
junit.framework.AssertionFailedError: Inflated buf 1 is of wrong type expected:<false>
but was:<true>
	at junit.framework.Assert.fail(Assert.java:57)
	at junit.framework.Assert.failNotEquals(Assert.java:329)
	at junit.framework.Assert.assertEquals(Assert.java:78)
	at junit.framework.Assert.assertEquals(Assert.java:174)
	at junit.framework.TestCase.assertEquals(TestCase.java:333)
	at org.apache.qpid.bytebuffer.QpidByteBufferTest.doDeflateInflate(QpidByteBufferTest.java:900)
	at org.apache.qpid.bytebuffer.QpidByteBufferTest.testDeflateInflateHeap(QpidByteBufferTest.java:817)

Running org.apache.qpid.codec.AMQDecoderTest
Tests run: 6, Failures: 0, Errors: 0, Skipped: 0, Time elapsed: 0.041 sec - in org.apache.qpid.codec.AMQDecoderTest
Running org.apache.qpid.transport.SessionTimeoutTest
Tests run: 2, Failures: 0, Errors: 0, Skipped: 0, Time elapsed: 0.156 sec - in org.apache.qpid.transport.SessionTimeoutTest
Running org.apache.qpid.transport.network.io.IdleTimeoutTickerTest
Tests run: 3, Failures: 0, Errors: 0, Skipped: 0, Time elapsed: 0.008 sec - in org.apache.qpid.transport.network.io.IdleTimeoutTickerTest
Running org.apache.qpid.transport.network.security.ssl.SSLUtilTest
Tests run: 8, Failures: 0, Errors: 0, Skipped: 0, Time elapsed: 7.084 sec - in org.apache.qpid.transport.network.security.ssl.SSLUtilTest
Running org.apache.qpid.transport.GenTest
Tests run: 1, Failures: 0, Errors: 0, Skipped: 0, Time elapsed: 0.002 sec - in org.apache.qpid.transport.GenTest
Running org.apache.qpid.transport.RangeSetTest
Tests run: 23, Failures: 0, Errors: 0, Skipped: 0, Time elapsed: 0.056 sec - in org.apache.qpid.transport.RangeSetTest
Running org.apache.qpid.transport.ConnectionSettingsTest
Tests run: 21, Failures: 0, Errors: 0, Skipped: 0, Time elapsed: 0.064 sec - in org.apache.qpid.transport.ConnectionSettingsTest
Running org.apache.qpid.transport.codec.BBEncoderTest
Tests run: 1, Failures: 0, Errors: 0, Skipped: 0, Time elapsed: 0.018 sec - in org.apache.qpid.transport.codec.BBEncoderTest
Running org.apache.qpid.transport.ConnectionTest
Tests run: 8, Failures: 0, Errors: 0, Skipped: 0, Time elapsed: 9.605 sec - in org.apache.qpid.transport.ConnectionTest
Running org.apache.qpid.configuration.QpidPropertyTest
Tests run: 14, Failures: 0, Errors: 0, Skipped: 0, Time elapsed: 0.046 sec - in org.apache.qpid.configuration.QpidPropertyTest

Results :

Failed tests: 
  QpidByteBufferTest>QpidTestCase.run:166->QpidTestCase.runTest:182->testDeflateInflateHeap:817->doDeflateInflate:900
Inflated buf 1 is of wrong type expected:<false> but was:<true>

Tests run: 249, Failures: 1, Errors: 0, Skipped: 0

[INFO] ------------------------------------------------------------------------
[INFO] Reactor Summary:
[INFO] 
[INFO] Apache Qpid for Java ............................... SUCCESS [  2.352 s]
[INFO] Apache Qpid Broker Code Generation ................. SUCCESS [  1.810 s]
[INFO] Apache Qpid Test Utilities ......................... SUCCESS [  0.479 s]
[INFO] Apache Qpid Common ................................. FAILURE [ 25.300 s]
[INFO] Apache Qpid Broker Core ............................ SKIPPED
[INFO] Apache Qpid LogBack Logging Broker Plug-in ......... SKIPPED
[INFO] Apache Qpid Access Control Broker Plug-in .......... SKIPPED
[INFO] Apache Qpid AMQP 0-8 Protocol Broker Plug-in ....... SKIPPED
[INFO] Apache Qpid AMQP 0-10 Protocol Plug-in ............. SKIPPED
[INFO] Apache Qpid AMQP 1-0 Protocol Broker Plug-in ....... SKIPPED
[INFO] Apache Qpid AMQP 0-8 to 0-10 Message Conversion Broker Plug-in SKIPPED
[INFO] Apache Qpid AMQP 0-8 to 1-0 Message Conversion Broker Plug-in SKIPPED
[INFO] Apache Qpid AMQP 0-10 to 1-0 Message Conversion Broker Plug-in SKIPPED
[INFO] Apache Qpid Derby Message Store Broker Plug-in ..... SKIPPED
[INFO] Apache Qpid JDBC Message Store Connection Pooling Plug-in SKIPPED
[INFO] Apache Qpid JDBC Message Store Broker Plug-in ...... SKIPPED
[INFO] Apache Qpid HTTP Management Broker Plug-in ......... SKIPPED
[INFO] Apache Qpid Memory Message Store Broker Plug-in .... SKIPPED
[INFO] Apache Qpid WebSocket Broker Plug-in ............... SKIPPED
[INFO] Apache Qpid JMS Client for AMQP 0-9-1/0-10 ......... SKIPPED
[INFO] Apache Qpid BDB Message Store Broker Plug-in ....... SKIPPED
[INFO] Apache Qpid Broker for Java ........................ SKIPPED
[INFO] Apache Qpid AMQP Management Protocol Broker Plug-in  SKIPPED
[INFO] Apache Qpid Client for AMQP 0-9-1/0-10 Examples .... SKIPPED
[INFO] Apache Qpid JCA .................................... SKIPPED
[INFO] Apache Qpid Resource Adaptor ....................... SKIPPED
[INFO] Apache Qpid Tools .................................. SKIPPED
[INFO] Apache Qpid System Test Parent ..................... SKIPPED
[INFO] Apache Qpid System Tests ........................... SKIPPED
[INFO] Apache Qpid Performance Tests ...................... SKIPPED
[INFO] Apache Qpid Performance Test System Tests .......... SKIPPED
[INFO] Apache Qpid Performance Tests Visualisation JFC .... SKIPPED
[INFO] Apache Qpid BDB Store System Tests ................. SKIPPED
[INFO] Apache Qpid Joram JMS Tests ........................ SKIPPED
[INFO] Apache Qpid JMX TCK Configuration .................. SKIPPED
[INFO] Apache Qpid for Java Docbook ....................... SKIPPED
[INFO] Apache Qpid Broker for Java Docbook ................ SKIPPED
[INFO] Apache Qpid JMS Client for AMQP 0-8, 0-9 and 0-9-1 Docbook SKIPPED
[INFO] Apache Qpid JMS Client for AMQP 0-10 Docbook ....... SKIPPED
[INFO] Apache Qpid Performance Test Docbook ............... SKIPPED
[INFO] ------------------------------------------------------------------------
[INFO] BUILD FAILURE
[INFO] ------------------------------------------------------------------------
[INFO] Total time: 30.878 s
[INFO] Finished at: 2017-05-03T15:59:57+00:00
[INFO] Final Memory: 39M/1447M
[INFO] ------------------------------------------------------------------------
[ERROR] Failed to execute goal org.apache.maven.plugins:maven-surefire-plugin:2.17:test (default-test)
on project qpid-common: There are test failures.
[ERROR] 
[ERROR] Please refer to <https://builds.apache.org/job/Qpid-Java-Artefact-Release-6.1.x/ws/common/target/surefire-reports/java-mms.0-10>
for the individual test results.
[ERROR] -> [Help 1]
[ERROR] 
[ERROR] To see the full stack trace of the errors, re-run Maven with the -e switch.
[ERROR] Re-run Maven using the -X switch to enable full debug logging.
[ERROR] 
[ERROR] For more information about the errors and possible solutions, please read the following
articles:
[ERROR] [Help 1] http://cwiki.apache.org/confluence/display/MAVEN/MojoFailureException
[ERROR] 
[ERROR] After correcting the problems, you can resume the build with the command
[ERROR]   mvn <goals> -rf :qpid-common
Build step 'Invoke top-level Maven targets' marked build as failure
Archiving artifacts

Mime
View raw message