qpid-notifications mailing list archives

Site index · List index
Message view « Date » · « Thread »
Top « Date » · « Thread »
From Apache Jenkins Server <jenk...@builds.apache.org>
Subject Build failed in Jenkins: Qpid-BrokerForJava-JoramJMSTest » ubuntu,JDK 1.8.0_102,qpid-amqp-1-0-client-jms #1084
Date Thu, 13 Apr 2017 13:40:05 GMT
See <https://builds.apache.org/job/Qpid-BrokerForJava-JoramJMSTest/Ubuntu%20Slaves=ubuntu,jdk=JDK%201.8.0_102,qpid.joramtests=qpid-amqp-1-0-client-jms/1084/display/redirect?page=changes>

Changes:

[lquack] QPID-7468: [Java Broker] Make unit tests log into separate files

------------------------------------------
[...truncated 255.94 KB...]
[INFO] Deleting <https://builds.apache.org/job/Qpid-BrokerForJava-JoramJMSTest/Ubuntu%20Slaves=ubuntu,jdk=JDK%201.8.0_102,qpid.joramtests=qpid-amqp-1-0-client-jms/ws/trunk/doc/target>
[INFO] 
[INFO] --- maven-antrun-plugin:1.8:run (output-test-properties) @ qpid-java-doc ---
[INFO] Executing tasks

main:
     [echo] Qpid Test Profile Properties
     [echo] [profile] java-mms.0-10
     [echo] [profile.broker.language] java
     [echo] [profile.broker.type] internal
     [echo] [profile.broker.command] "<https://builds.apache.org/job/Qpid-BrokerForJava-JoramJMSTest/Ubuntu%20Slaves=ubuntu,jdk=JDK%201.8.0_102,qpid.joramtests=qpid-amqp-1-0-client-jms/ws/trunk/doc/bin/qpid-server">
-sp "@STORE_PATH" -st @STORE_TYPE -prop test.port=@PORT -prop "qpid.work_dir=@QPID_WORK"
     [echo] [profile.specific.excludes] JavaTransientExcludes Java010Excludes
     [echo] [profile.test.excludes] Excludes JavaExcludes java-mms.0-10.excludes JavaTransientExcludes
Java010Excludes
     [echo] [profile.broker.version] v0_10
     [echo] [profile.test.amqp_port_protocols] ["AMQP_0_8","AMQP_0_9","AMQP_0_9_1","AMQP_0_10"]
     [echo] [profile.broker.persistent] false
     [echo] [profile.virtualhostnode.type] Memory
     [echo] [profile.virtualhostnode.context.blueprint] {"type":"ProvidedStore","globalAddressDomains":"${qpid.globalAddressDomains}"}
     [echo] [profile.test_receive_timeout] 1000
[INFO] Executed tasks
[INFO] 
[INFO] --- maven-enforcer-plugin:1.4.1:enforce (enforce-minimum-versions) @ qpid-java-doc
---
[INFO] 
[INFO] --- maven-enforcer-plugin:1.4.1:enforce (enforce-versions-standard-properties) @ qpid-java-doc
---
[INFO] 
[INFO] --- maven-enforcer-plugin:1.4.1:enforce (enforce-enableAmqp10) @ qpid-java-doc ---
[INFO] 
[INFO] --- jacoco-maven-plugin:0.7.5.201505241946:prepare-agent (default-prepare-agent) @
qpid-java-doc ---
[INFO] argLine set to "-javaagent:/home/jenkins/.m2/repository/org/jacoco/org.jacoco.agent/0.7.5.201505241946/org.jacoco.agent-0.7.5.201505241946-runtime.jar=destfile=<https://builds.apache.org/job/Qpid-BrokerForJava-JoramJMSTest/Ubuntu%20Slaves=ubuntu,jdk=JDK%201.8.0_102,qpid.joramtests=qpid-amqp-1-0-client-jms/ws/trunk/doc/target/jacoco.exec">
-Xmx512m
[INFO] 
[INFO] --- maven-remote-resources-plugin:1.5:process (process-resource-bundles) @ qpid-java-doc
---
[INFO] 
[INFO] --- maven-site-plugin:3.5.1:attach-descriptor (attach-descriptor) @ qpid-java-doc ---
[INFO] 
[INFO] --- maven-assembly-plugin:2.6:single (default) @ qpid-java-doc ---
[INFO] Assemblies have been skipped per configuration of the skipAssembly parameter.
[INFO]                                                                         
[INFO] ------------------------------------------------------------------------
[INFO] Building Apache Qpid Broker for Java Docbook 7.0.0-SNAPSHOT
[INFO] ------------------------------------------------------------------------
[INFO] 
[INFO] --- maven-clean-plugin:3.0.0:clean (default-clean) @ qpid-java-doc-broker ---
[INFO] Deleting <https://builds.apache.org/job/Qpid-BrokerForJava-JoramJMSTest/Ubuntu%20Slaves=ubuntu,jdk=JDK%201.8.0_102,qpid.joramtests=qpid-amqp-1-0-client-jms/ws/trunk/doc/java-broker/target>
[INFO] 
[INFO] --- maven-antrun-plugin:1.8:run (output-test-properties) @ qpid-java-doc-broker ---
[INFO] Executing tasks

main:
     [echo] Qpid Test Profile Properties
     [echo] [profile] java-mms.0-10
     [echo] [profile.broker.language] java
     [echo] [profile.broker.type] internal
     [echo] [profile.broker.command] "<https://builds.apache.org/job/Qpid-BrokerForJava-JoramJMSTest/Ubuntu%20Slaves=ubuntu,jdk=JDK%201.8.0_102,qpid.joramtests=qpid-amqp-1-0-client-jms/ws/trunk/doc/java-broker/bin/qpid-server">
-sp "@STORE_PATH" -st @STORE_TYPE -prop test.port=@PORT -prop "qpid.work_dir=@QPID_WORK"
     [echo] [profile.specific.excludes] JavaTransientExcludes Java010Excludes
     [echo] [profile.test.excludes] Excludes JavaExcludes java-mms.0-10.excludes JavaTransientExcludes
Java010Excludes
     [echo] [profile.broker.version] v0_10
     [echo] [profile.test.amqp_port_protocols] ["AMQP_0_8","AMQP_0_9","AMQP_0_9_1","AMQP_0_10"]
     [echo] [profile.broker.persistent] false
     [echo] [profile.virtualhostnode.type] Memory
     [echo] [profile.virtualhostnode.context.blueprint] {"type":"ProvidedStore","globalAddressDomains":"${qpid.globalAddressDomains}"}
     [echo] [profile.test_receive_timeout] 1000
[INFO] Executed tasks
[INFO] 
[INFO] --- maven-enforcer-plugin:1.4.1:enforce (enforce-minimum-versions) @ qpid-java-doc-broker
---
[INFO] 
[INFO] --- maven-enforcer-plugin:1.4.1:enforce (enforce-versions-standard-properties) @ qpid-java-doc-broker
---
[INFO] 
[INFO] --- maven-enforcer-plugin:1.4.1:enforce (enforce-enableAmqp10) @ qpid-java-doc-broker
---
[INFO] 
[INFO] --- jacoco-maven-plugin:0.7.5.201505241946:prepare-agent (default-prepare-agent) @
qpid-java-doc-broker ---
[INFO] argLine set to "-javaagent:/home/jenkins/.m2/repository/org/jacoco/org.jacoco.agent/0.7.5.201505241946/org.jacoco.agent-0.7.5.201505241946-runtime.jar=destfile=<https://builds.apache.org/job/Qpid-BrokerForJava-JoramJMSTest/Ubuntu%20Slaves=ubuntu,jdk=JDK%201.8.0_102,qpid.joramtests=qpid-amqp-1-0-client-jms/ws/trunk/doc/java-broker/target/jacoco.exec">
-Xmx512m
[INFO] 
[INFO] --- maven-resources-plugin:2.7:copy-resources (filter-docbook-sources) @ qpid-java-doc-broker
---
[INFO] Using 'UTF-8' encoding to copy filtered resources.
[INFO] Copying 77 resources
[INFO] 
[INFO] --- maven-remote-resources-plugin:1.5:process (process-resource-bundles) @ qpid-java-doc-broker
---
[INFO] 
[INFO] --- maven-resources-plugin:2.7:resources (default-resources) @ qpid-java-doc-broker
---
[INFO] Using 'UTF-8' encoding to copy filtered resources.
[INFO] Copying 77 resources
[INFO] 
[INFO] --- maven-compiler-plugin:3.5.1:compile (default-compile) @ qpid-java-doc-broker ---
[INFO] No sources to compile
[INFO] 
[INFO] --- maven-resources-plugin:2.7:testResources (default-testResources) @ qpid-java-doc-broker
---
[INFO] Using 'UTF-8' encoding to copy filtered resources.
[INFO] Copying 77 resources
[INFO] 
[INFO] --- maven-compiler-plugin:3.5.1:testCompile (default-testCompile) @ qpid-java-doc-broker
---
[INFO] No sources to compile
[INFO] 
[INFO] --- maven-surefire-plugin:2.19.1:test (default-test) @ qpid-java-doc-broker ---
[INFO] Tests are skipped.
[INFO] 
[INFO] --- maven-jar-plugin:3.0.0:jar (default-jar) @ qpid-java-doc-broker ---
[WARNING] JAR will be empty - no content was marked for inclusion!
[INFO] Building jar: <https://builds.apache.org/job/Qpid-BrokerForJava-JoramJMSTest/Ubuntu%20Slaves=ubuntu,jdk=JDK%201.8.0_102,qpid.joramtests=qpid-amqp-1-0-client-jms/ws/trunk/doc/java-broker/target/qpid-java-doc-broker-7.0.0-SNAPSHOT.jar>
[INFO] 
[INFO] --- maven-site-plugin:3.5.1:attach-descriptor (attach-descriptor) @ qpid-java-doc-broker
---
[INFO] 
[INFO] --- maven-assembly-plugin:2.6:single (default) @ qpid-java-doc-broker ---
[INFO] Assemblies have been skipped per configuration of the skipAssembly parameter.
[INFO]                                                                         
[INFO] ------------------------------------------------------------------------
[INFO] Building Apache Qpid Performance Test Docbook 7.0.0-SNAPSHOT
[INFO] ------------------------------------------------------------------------
[INFO] 
[INFO] --- maven-clean-plugin:3.0.0:clean (default-clean) @ qpid-java-doc-perftests ---
[INFO] Deleting <https://builds.apache.org/job/Qpid-BrokerForJava-JoramJMSTest/Ubuntu%20Slaves=ubuntu,jdk=JDK%201.8.0_102,qpid.joramtests=qpid-amqp-1-0-client-jms/ws/trunk/doc/java-perftests/target>
[INFO] 
[INFO] --- maven-antrun-plugin:1.8:run (output-test-properties) @ qpid-java-doc-perftests
---
[INFO] Executing tasks

main:
     [echo] Qpid Test Profile Properties
     [echo] [profile] java-mms.0-10
     [echo] [profile.broker.language] java
     [echo] [profile.broker.type] internal
     [echo] [profile.broker.command] "<https://builds.apache.org/job/Qpid-BrokerForJava-JoramJMSTest/Ubuntu%20Slaves=ubuntu,jdk=JDK%201.8.0_102,qpid.joramtests=qpid-amqp-1-0-client-jms/ws/trunk/doc/java-perftests/bin/qpid-server">
-sp "@STORE_PATH" -st @STORE_TYPE -prop test.port=@PORT -prop "qpid.work_dir=@QPID_WORK"
     [echo] [profile.specific.excludes] JavaTransientExcludes Java010Excludes
     [echo] [profile.test.excludes] Excludes JavaExcludes java-mms.0-10.excludes JavaTransientExcludes
Java010Excludes
     [echo] [profile.broker.version] v0_10
     [echo] [profile.test.amqp_port_protocols] ["AMQP_0_8","AMQP_0_9","AMQP_0_9_1","AMQP_0_10"]
     [echo] [profile.broker.persistent] false
     [echo] [profile.virtualhostnode.type] Memory
     [echo] [profile.virtualhostnode.context.blueprint] {"type":"ProvidedStore","globalAddressDomains":"${qpid.globalAddressDomains}"}
     [echo] [profile.test_receive_timeout] 1000
[INFO] Executed tasks
[INFO] 
[INFO] --- maven-enforcer-plugin:1.4.1:enforce (enforce-minimum-versions) @ qpid-java-doc-perftests
---
[INFO] 
[INFO] --- maven-enforcer-plugin:1.4.1:enforce (enforce-versions-standard-properties) @ qpid-java-doc-perftests
---
[INFO] 
[INFO] --- maven-enforcer-plugin:1.4.1:enforce (enforce-enableAmqp10) @ qpid-java-doc-perftests
---
[INFO] 
[INFO] --- jacoco-maven-plugin:0.7.5.201505241946:prepare-agent (default-prepare-agent) @
qpid-java-doc-perftests ---
[INFO] argLine set to "-javaagent:/home/jenkins/.m2/repository/org/jacoco/org.jacoco.agent/0.7.5.201505241946/org.jacoco.agent-0.7.5.201505241946-runtime.jar=destfile=<https://builds.apache.org/job/Qpid-BrokerForJava-JoramJMSTest/Ubuntu%20Slaves=ubuntu,jdk=JDK%201.8.0_102,qpid.joramtests=qpid-amqp-1-0-client-jms/ws/trunk/doc/java-perftests/target/jacoco.exec">
-Xmx512m
[INFO] 
[INFO] --- maven-resources-plugin:2.7:copy-resources (filter-docbook-sources) @ qpid-java-doc-perftests
---
[INFO] Using 'UTF-8' encoding to copy filtered resources.
[INFO] Copying 1 resource
[INFO] 
[INFO] --- maven-remote-resources-plugin:1.5:process (process-resource-bundles) @ qpid-java-doc-perftests
---
[INFO] 
[INFO] --- maven-resources-plugin:2.7:resources (default-resources) @ qpid-java-doc-perftests
---
[INFO] Using 'UTF-8' encoding to copy filtered resources.
[INFO] Copying 1 resource
[INFO] 
[INFO] --- maven-compiler-plugin:3.5.1:compile (default-compile) @ qpid-java-doc-perftests
---
[INFO] No sources to compile
[INFO] 
[INFO] --- maven-resources-plugin:2.7:testResources (default-testResources) @ qpid-java-doc-perftests
---
[INFO] Using 'UTF-8' encoding to copy filtered resources.
[INFO] Copying 1 resource
[INFO] 
[INFO] --- maven-compiler-plugin:3.5.1:testCompile (default-testCompile) @ qpid-java-doc-perftests
---
[INFO] No sources to compile
[INFO] 
[INFO] --- maven-surefire-plugin:2.19.1:test (default-test) @ qpid-java-doc-perftests ---
[INFO] Tests are skipped.
[INFO] 
[INFO] --- maven-jar-plugin:3.0.0:jar (default-jar) @ qpid-java-doc-perftests ---
[WARNING] JAR will be empty - no content was marked for inclusion!
[INFO] Building jar: <https://builds.apache.org/job/Qpid-BrokerForJava-JoramJMSTest/Ubuntu%20Slaves=ubuntu,jdk=JDK%201.8.0_102,qpid.joramtests=qpid-amqp-1-0-client-jms/ws/trunk/doc/java-perftests/target/qpid-java-doc-perftests-7.0.0-SNAPSHOT.jar>
[INFO] 
[INFO] --- maven-site-plugin:3.5.1:attach-descriptor (attach-descriptor) @ qpid-java-doc-perftests
---
[INFO] 
[INFO] --- maven-assembly-plugin:2.6:single (default) @ qpid-java-doc-perftests ---
[INFO] Assemblies have been skipped per configuration of the skipAssembly parameter.
[INFO] ------------------------------------------------------------------------
[INFO] Reactor Summary:
[INFO] 
[INFO] Apache Qpid Broker for Java ........................ SUCCESS [  2.073 s]
[INFO] Apache Qpid Broker Code Generation ................. SUCCESS [  1.909 s]
[INFO] Apache Qpid Test Utilities ......................... SUCCESS [  0.761 s]
[INFO] Apache Qpid Broker Core ............................ SUCCESS [ 12.951 s]
[INFO] Apache Qpid LogBack Logging Broker Plug-in ......... SUCCESS [  1.061 s]
[INFO] Apache Qpid Access Control Broker Plug-in .......... SUCCESS [  0.882 s]
[INFO] Apache Qpid AMQP 0-8 Protocol Broker Plug-in ....... SUCCESS [  1.122 s]
[INFO] Apache Qpid AMQP 0-10 Protocol Plug-in ............. SUCCESS [  1.653 s]
[INFO] Apache Qpid AMQP 1-0 Protocol Broker Plug-in ....... SUCCESS [  1.497 s]
[INFO] Apache Qpid AMQP 0-8 to 0-10 Message Conversion Broker Plug-in SUCCESS [  0.232 s]
[INFO] Apache Qpid AMQP 0-8 to 1-0 Message Conversion Broker Plug-in SUCCESS [  0.203 s]
[INFO] Apache Qpid AMQP 0-10 to 1-0 Message Conversion Broker Plug-in SUCCESS [  0.209 s]
[INFO] Apache Qpid JDBC Message Store Broker Plug-in ...... SUCCESS [  0.940 s]
[INFO] Apache Qpid Derby Message Store Broker Plug-in ..... SUCCESS [  0.554 s]
[INFO] Apache Qpid JDBC Message Store Connection Pooling Plug-in SUCCESS [  0.218 s]
[INFO] Apache Qpid AMQP 1.0 JDBC Link Store Plug-in ....... SUCCESS [  0.515 s]
[INFO] Apache Qpid HTTP Management Broker Plug-in ......... SUCCESS [  1.646 s]
[INFO] Apache Qpid AMQP Management Protocol Broker Plug-in  SUCCESS [  0.483 s]
[INFO] Apache Qpid Memory Message Store Broker Plug-in .... SUCCESS [  0.256 s]
[INFO] Apache Qpid WebSocket Broker Plug-in ............... FAILURE [  0.237 s]
[INFO] Apache Qpid BDB Message Store Broker Plug-in ....... SUCCESS [  1.500 s]
[INFO] Apache Qpid AMQP 1.0 BDB Link Store Plug-in ........ SUCCESS [  0.275 s]
[INFO] Apache Qpid Broker for Java ........................ SKIPPED
[INFO] Apache Qpid Tools .................................. SUCCESS [  0.376 s]
[INFO] Apache Qpid System Test Parent ..................... SUCCESS [  1.018 s]
[INFO] Apache Qpid System Tests ........................... SKIPPED
[INFO] Apache Qpid JMS 2.0 System Tests ................... SKIPPED
[INFO] Apache Qpid Protocol Tests for AMQP 1.0 ............ SKIPPED
[INFO] Apache Qpid Performance Tests ...................... SUCCESS [  2.193 s]
[INFO] Apache Qpid Performance Test System Tests .......... SKIPPED
[INFO] Apache Qpid Performance Tests Visualisation JFC .... SUCCESS [  1.269 s]
[INFO] Apache Qpid BDB Store System Tests ................. SKIPPED
[INFO] Apache Qpid Joram JMS Tests ........................ SUCCESS [  0.274 s]
[INFO] Apache Qpid JMS TCK Configuration .................. SUCCESS [  0.229 s]
[INFO] Apache Qpid for Java Docbook ....................... SUCCESS [  0.035 s]
[INFO] Apache Qpid Broker for Java Docbook ................ SUCCESS [  0.435 s]
[INFO] Apache Qpid Performance Test Docbook ............... SUCCESS [  0.070 s]
[INFO] ------------------------------------------------------------------------
[INFO] BUILD FAILURE
[INFO] ------------------------------------------------------------------------
[INFO] Total time: 37.915 s
[INFO] Finished at: 2017-04-13T13:40:00+00:00
[INFO] Final Memory: 126M/5364M
[INFO] ------------------------------------------------------------------------
[ERROR] Failed to execute goal org.apache.maven.plugins:maven-compiler-plugin:3.5.1:compile
(default-compile) on project qpid-broker-plugins-websocket: Compilation failure
[ERROR] <https://builds.apache.org/job/Qpid-BrokerForJava-JoramJMSTest/Ubuntu%20Slaves=ubuntu,jdk=JDK%201.8.0_102,qpid.joramtests=qpid-amqp-1-0-client-jms/ws/trunk/broker-plugins/websocket/src/main/java/org/apache/qpid/server/transport/websocket/WebSocketProvider.java>:[356,13]
org.apache.qpid.server.transport.websocket.WebSocketProvider.ConnectionWrapper is not abstract
and does not override abstract method getSelectedHost() in org.apache.qpid.server.transport.ServerNetworkConnection
[ERROR] -> [Help 1]
[ERROR] 
[ERROR] To see the full stack trace of the errors, re-run Maven with the -e switch.
[ERROR] Re-run Maven using the -X switch to enable full debug logging.
[ERROR] 
[ERROR] For more information about the errors and possible solutions, please read the following
articles:
[ERROR] [Help 1] http://cwiki.apache.org/confluence/display/MAVEN/MojoFailureException
[ERROR] 
[ERROR] After correcting the problems, you can resume the build with the command
[ERROR]   mvn <goals> -rf :qpid-broker-plugins-websocket
Build step 'Invoke top-level Maven targets' marked build as failure
Performing Post build task...
Match found for : : True
Logical operation result is TRUE
Running script  : #!/bin/bash -x

if [[ "${BROKER_PID}" ]]
then
  echo Killing broker "${BROKER_PID}"
  kill -15 "${BROKER_PID}"
fi
[qpid-amqp-1-0-client-jms] $ /bin/bash -x /tmp/hudson2152029178941424548.sh
+ [[ -n '' ]]
POST BUILD TASK : SUCCESS
END OF POST BUILD TASK : 0
Archiving artifacts
Compressed 524.37 KB of artifacts by 97.6% relative to #1082
Recording test results
ERROR: Step ?Publish JUnit test result report? failed: No test report files were found. Configuration
error?


Mime
View raw message