qpid-notifications mailing list archives

Site index · List index
Message view « Date » · « Thread »
Top « Date » · « Thread »
From Apache Jenkins Server <jenk...@builds.apache.org>
Subject Build failed in Jenkins: Qpid-BrokerForJava-Test-JDK1.9 #1
Date Mon, 20 Mar 2017 10:18:16 GMT
See <https://builds.apache.org/job/Qpid-BrokerForJava-Test-JDK1.9/1/display/redirect>

------------------------------------------
[...truncated 604.66 KB...]

main:
     [echo] Qpid Test Profile Properties
     [echo] [profile] java-mms.0-10
     [echo] [profile.broker.language] java
     [echo] [profile.broker.type] internal
     [echo] [profile.broker.command] "<https://builds.apache.org/job/Qpid-BrokerForJava-Test-JDK1.9/ws/doc/bin/qpid-server">
-sp "@STORE_PATH" -st @STORE_TYPE -prop test.port=@PORT -prop "qpid.work_dir=@QPID_WORK"
     [echo] [profile.specific.excludes] JavaTransientExcludes Java010Excludes
     [echo] [profile.test.excludes] Excludes JavaExcludes java-mms.0-10.excludes JavaTransientExcludes
Java010Excludes
     [echo] [profile.broker.version] v0_10
     [echo] [profile.test.amqp_port_protocols] ["AMQP_0_8","AMQP_0_9","AMQP_0_9_1","AMQP_0_10"]
     [echo] [profile.broker.persistent] false
     [echo] [profile.virtualhostnode.type] Memory
     [echo] [profile.virtualhostnode.context.blueprint] {"type":"ProvidedStore","globalAddressDomains":"${qpid.globalAddressDomains}"}
     [echo] [profile.test_receive_timeout] 1000
[INFO] Executed tasks
[INFO] 
[INFO] --- maven-enforcer-plugin:1.4.1:enforce (enforce-minimum-versions) @ qpid-java-doc
---
[INFO] 
[INFO] --- maven-enforcer-plugin:1.4.1:enforce (enforce-versions-standard-properties) @ qpid-java-doc
---
[INFO] 
[INFO] --- maven-enforcer-plugin:1.4.1:enforce (enforce-enableAmqp10) @ qpid-java-doc ---
[INFO] 
[INFO] --- jacoco-maven-plugin:0.7.5.201505241946:prepare-agent (default-prepare-agent) @
qpid-java-doc ---
[INFO] argLine set to -javaagent:/home/jenkins/.m2/repository/org/jacoco/org.jacoco.agent/0.7.5.201505241946/org.jacoco.agent-0.7.5.201505241946-runtime.jar=destfile=<https://builds.apache.org/job/Qpid-BrokerForJava-Test-JDK1.9/ws/doc/target/jacoco.exec>
-Xmx512m
[INFO] 
[INFO] --- maven-remote-resources-plugin:1.5:process (process-resource-bundles) @ qpid-java-doc
---
[INFO] 
[INFO] --- maven-site-plugin:3.5.1:attach-descriptor (attach-descriptor) @ qpid-java-doc ---
[INFO] 
[INFO] --- maven-assembly-plugin:2.6:single (default) @ qpid-java-doc ---
[INFO] Assemblies have been skipped per configuration of the skipAssembly parameter.
[INFO]                                                                         
[INFO] ------------------------------------------------------------------------
[INFO] Building Apache Qpid Broker for Java Docbook 7.0.0-SNAPSHOT
[INFO] ------------------------------------------------------------------------
[INFO] 
[INFO] --- maven-clean-plugin:3.0.0:clean (default-clean) @ qpid-java-doc-broker ---
[INFO] 
[INFO] --- maven-antrun-plugin:1.8:run (output-test-properties) @ qpid-java-doc-broker ---
[INFO] Executing tasks

main:
     [echo] Qpid Test Profile Properties
     [echo] [profile] java-mms.0-10
     [echo] [profile.broker.language] java
     [echo] [profile.broker.type] internal
     [echo] [profile.broker.command] "<https://builds.apache.org/job/Qpid-BrokerForJava-Test-JDK1.9/ws/doc/java-broker/bin/qpid-server">
-sp "@STORE_PATH" -st @STORE_TYPE -prop test.port=@PORT -prop "qpid.work_dir=@QPID_WORK"
     [echo] [profile.specific.excludes] JavaTransientExcludes Java010Excludes
     [echo] [profile.test.excludes] Excludes JavaExcludes java-mms.0-10.excludes JavaTransientExcludes
Java010Excludes
     [echo] [profile.broker.version] v0_10
     [echo] [profile.test.amqp_port_protocols] ["AMQP_0_8","AMQP_0_9","AMQP_0_9_1","AMQP_0_10"]
     [echo] [profile.broker.persistent] false
     [echo] [profile.virtualhostnode.type] Memory
     [echo] [profile.virtualhostnode.context.blueprint] {"type":"ProvidedStore","globalAddressDomains":"${qpid.globalAddressDomains}"}
     [echo] [profile.test_receive_timeout] 1000
[INFO] Executed tasks
[INFO] 
[INFO] --- maven-enforcer-plugin:1.4.1:enforce (enforce-minimum-versions) @ qpid-java-doc-broker
---
[INFO] 
[INFO] --- maven-enforcer-plugin:1.4.1:enforce (enforce-versions-standard-properties) @ qpid-java-doc-broker
---
[INFO] 
[INFO] --- maven-enforcer-plugin:1.4.1:enforce (enforce-enableAmqp10) @ qpid-java-doc-broker
---
[INFO] 
[INFO] --- jacoco-maven-plugin:0.7.5.201505241946:prepare-agent (default-prepare-agent) @
qpid-java-doc-broker ---
[INFO] argLine set to -javaagent:/home/jenkins/.m2/repository/org/jacoco/org.jacoco.agent/0.7.5.201505241946/org.jacoco.agent-0.7.5.201505241946-runtime.jar=destfile=<https://builds.apache.org/job/Qpid-BrokerForJava-Test-JDK1.9/ws/doc/java-broker/target/jacoco.exec>
-Xmx512m
[INFO] 
[INFO] --- maven-resources-plugin:2.7:copy-resources (filter-docbook-sources) @ qpid-java-doc-broker
---
[INFO] Using 'UTF-8' encoding to copy filtered resources.
[INFO] Copying 77 resources
[INFO] 
[INFO] --- maven-remote-resources-plugin:1.5:process (process-resource-bundles) @ qpid-java-doc-broker
---
[INFO] 
[INFO] --- maven-resources-plugin:2.7:resources (default-resources) @ qpid-java-doc-broker
---
[INFO] Using 'UTF-8' encoding to copy filtered resources.
[INFO] Copying 77 resources
[INFO] 
[INFO] --- maven-compiler-plugin:3.5.1:compile (default-compile) @ qpid-java-doc-broker ---
[INFO] No sources to compile
[INFO] 
[INFO] --- maven-resources-plugin:2.7:testResources (default-testResources) @ qpid-java-doc-broker
---
[INFO] Using 'UTF-8' encoding to copy filtered resources.
[INFO] Copying 77 resources
[INFO] 
[INFO] --- maven-compiler-plugin:3.5.1:testCompile (default-testCompile) @ qpid-java-doc-broker
---
[INFO] No sources to compile
[INFO] 
[INFO] --- maven-surefire-plugin:2.19.1:test (default-test) @ qpid-java-doc-broker ---
[INFO] No tests to run.
[INFO] 
[INFO] --- maven-jar-plugin:3.0.0:jar (default-jar) @ qpid-java-doc-broker ---
[WARNING] JAR will be empty - no content was marked for inclusion!
[INFO] Building jar: <https://builds.apache.org/job/Qpid-BrokerForJava-Test-JDK1.9/ws/doc/java-broker/target/qpid-java-doc-broker-7.0.0-SNAPSHOT.jar>
[INFO] 
[INFO] --- maven-site-plugin:3.5.1:attach-descriptor (attach-descriptor) @ qpid-java-doc-broker
---
[INFO] 
[INFO] --- maven-assembly-plugin:2.6:single (default) @ qpid-java-doc-broker ---
[INFO] Assemblies have been skipped per configuration of the skipAssembly parameter.
[INFO]                                                                         
[INFO] ------------------------------------------------------------------------
[INFO] Building Apache Qpid Performance Test Docbook 7.0.0-SNAPSHOT
[INFO] ------------------------------------------------------------------------
[INFO] 
[INFO] --- maven-clean-plugin:3.0.0:clean (default-clean) @ qpid-java-doc-perftests ---
[INFO] 
[INFO] --- maven-antrun-plugin:1.8:run (output-test-properties) @ qpid-java-doc-perftests
---
[INFO] Executing tasks

main:
     [echo] Qpid Test Profile Properties
     [echo] [profile] java-mms.0-10
     [echo] [profile.broker.language] java
     [echo] [profile.broker.type] internal
     [echo] [profile.broker.command] "<https://builds.apache.org/job/Qpid-BrokerForJava-Test-JDK1.9/ws/doc/java-perftests/bin/qpid-server">
-sp "@STORE_PATH" -st @STORE_TYPE -prop test.port=@PORT -prop "qpid.work_dir=@QPID_WORK"
     [echo] [profile.specific.excludes] JavaTransientExcludes Java010Excludes
     [echo] [profile.test.excludes] Excludes JavaExcludes java-mms.0-10.excludes JavaTransientExcludes
Java010Excludes
     [echo] [profile.broker.version] v0_10
     [echo] [profile.test.amqp_port_protocols] ["AMQP_0_8","AMQP_0_9","AMQP_0_9_1","AMQP_0_10"]
     [echo] [profile.broker.persistent] false
     [echo] [profile.virtualhostnode.type] Memory
     [echo] [profile.virtualhostnode.context.blueprint] {"type":"ProvidedStore","globalAddressDomains":"${qpid.globalAddressDomains}"}
     [echo] [profile.test_receive_timeout] 1000
[INFO] Executed tasks
[INFO] 
[INFO] --- maven-enforcer-plugin:1.4.1:enforce (enforce-minimum-versions) @ qpid-java-doc-perftests
---
[INFO] 
[INFO] --- maven-enforcer-plugin:1.4.1:enforce (enforce-versions-standard-properties) @ qpid-java-doc-perftests
---
[INFO] 
[INFO] --- maven-enforcer-plugin:1.4.1:enforce (enforce-enableAmqp10) @ qpid-java-doc-perftests
---
[INFO] 
[INFO] --- jacoco-maven-plugin:0.7.5.201505241946:prepare-agent (default-prepare-agent) @
qpid-java-doc-perftests ---
[INFO] argLine set to -javaagent:/home/jenkins/.m2/repository/org/jacoco/org.jacoco.agent/0.7.5.201505241946/org.jacoco.agent-0.7.5.201505241946-runtime.jar=destfile=<https://builds.apache.org/job/Qpid-BrokerForJava-Test-JDK1.9/ws/doc/java-perftests/target/jacoco.exec>
-Xmx512m
[INFO] 
[INFO] --- maven-resources-plugin:2.7:copy-resources (filter-docbook-sources) @ qpid-java-doc-perftests
---
[INFO] Using 'UTF-8' encoding to copy filtered resources.
[INFO] Copying 1 resource
[INFO] 
[INFO] --- maven-remote-resources-plugin:1.5:process (process-resource-bundles) @ qpid-java-doc-perftests
---
[INFO] 
[INFO] --- maven-resources-plugin:2.7:resources (default-resources) @ qpid-java-doc-perftests
---
[INFO] Using 'UTF-8' encoding to copy filtered resources.
[INFO] Copying 1 resource
[INFO] 
[INFO] --- maven-compiler-plugin:3.5.1:compile (default-compile) @ qpid-java-doc-perftests
---
[INFO] No sources to compile
[INFO] 
[INFO] --- maven-resources-plugin:2.7:testResources (default-testResources) @ qpid-java-doc-perftests
---
[INFO] Using 'UTF-8' encoding to copy filtered resources.
[INFO] Copying 1 resource
[INFO] 
[INFO] --- maven-compiler-plugin:3.5.1:testCompile (default-testCompile) @ qpid-java-doc-perftests
---
[INFO] No sources to compile
[INFO] 
[INFO] --- maven-surefire-plugin:2.19.1:test (default-test) @ qpid-java-doc-perftests ---
[INFO] No tests to run.
[INFO] 
[INFO] --- maven-jar-plugin:3.0.0:jar (default-jar) @ qpid-java-doc-perftests ---
[WARNING] JAR will be empty - no content was marked for inclusion!
[INFO] Building jar: <https://builds.apache.org/job/Qpid-BrokerForJava-Test-JDK1.9/ws/doc/java-perftests/target/qpid-java-doc-perftests-7.0.0-SNAPSHOT.jar>
[INFO] 
[INFO] --- maven-site-plugin:3.5.1:attach-descriptor (attach-descriptor) @ qpid-java-doc-perftests
---
[INFO] 
[INFO] --- maven-assembly-plugin:2.6:single (default) @ qpid-java-doc-perftests ---
[INFO] Assemblies have been skipped per configuration of the skipAssembly parameter.
[INFO] ------------------------------------------------------------------------
[INFO] Reactor Summary:
[INFO] 
[INFO] Apache Qpid for Java ............................... SUCCESS [  2.237 s]
[INFO] Apache Qpid Broker Code Generation ................. SUCCESS [  1.880 s]
[INFO] Apache Qpid Test Utilities ......................... SUCCESS [  0.587 s]
[INFO] Apache Qpid Broker Core ............................ FAILURE [  7.964 s]
[INFO] Apache Qpid LogBack Logging Broker Plug-in ......... SKIPPED
[INFO] Apache Qpid Access Control Broker Plug-in .......... SKIPPED
[INFO] Apache Qpid AMQP 0-8 Protocol Broker Plug-in ....... SKIPPED
[INFO] Apache Qpid AMQP 0-10 Protocol Plug-in ............. SKIPPED
[INFO] Apache Qpid AMQP 1-0 Protocol Broker Plug-in ....... SKIPPED
[INFO] Apache Qpid AMQP 0-8 to 0-10 Message Conversion Broker Plug-in SKIPPED
[INFO] Apache Qpid AMQP 0-8 to 1-0 Message Conversion Broker Plug-in SKIPPED
[INFO] Apache Qpid AMQP 0-10 to 1-0 Message Conversion Broker Plug-in SKIPPED
[INFO] Apache Qpid Derby Message Store Broker Plug-in ..... SKIPPED
[INFO] Apache Qpid JDBC Message Store Connection Pooling Plug-in SKIPPED
[INFO] Apache Qpid JDBC Message Store Broker Plug-in ...... SKIPPED
[INFO] Apache Qpid HTTP Management Broker Plug-in ......... SKIPPED
[INFO] Apache Qpid AMQP Management Protocol Broker Plug-in  SKIPPED
[INFO] Apache Qpid Memory Message Store Broker Plug-in .... SKIPPED
[INFO] Apache Qpid WebSocket Broker Plug-in ............... SKIPPED
[INFO] Apache Qpid BDB Message Store Broker Plug-in ....... SKIPPED
[INFO] Apache Qpid Broker for Java ........................ SKIPPED
[INFO] Apache Qpid Tools .................................. SUCCESS [  2.770 s]
[INFO] Apache Qpid System Test Parent ..................... SUCCESS [  3.801 s]
[INFO] Apache Qpid System Tests ........................... SKIPPED
[INFO] qpid-systests-jms_2.0 .............................. SKIPPED
[INFO] Apache Qpid Performance Tests ...................... FAILURE [  1.837 s]
[INFO] Apache Qpid Performance Test System Tests .......... SKIPPED
[INFO] Apache Qpid Performance Tests Visualisation JFC .... SKIPPED
[INFO] Apache Qpid BDB Store System Tests ................. SKIPPED
[INFO] Apache Qpid Joram JMS Tests ........................ SUCCESS [  0.348 s]
[INFO] Apache Qpid JMS TCK Configuration .................. SUCCESS [  0.267 s]
[INFO] Apache Qpid for Java Docbook ....................... SUCCESS [  0.222 s]
[INFO] Apache Qpid Broker for Java Docbook ................ SUCCESS [  0.603 s]
[INFO] Apache Qpid Performance Test Docbook ............... SUCCESS [  0.078 s]
[INFO] ------------------------------------------------------------------------
[INFO] BUILD FAILURE
[INFO] ------------------------------------------------------------------------
[INFO] Total time: 23.426 s
[INFO] Finished at: 2017-03-20T10:18:16+00:00
[INFO] Final Memory: 49M/160M
[INFO] ------------------------------------------------------------------------
[ERROR] Failed to execute goal org.apache.maven.plugins:maven-compiler-plugin:3.5.1:compile
(default-compile) on project qpid-broker-core: Compilation failure: Compilation failure:
[ERROR] Error loading existing services file: META-INF/services/org.apache.qpid.server.plugin.MessageMetaDataType
- <https://builds.apache.org/job/Qpid-BrokerForJava-Test-JDK1.9/ws/broker-core/target/classes/META-INF/services/org.apache.qpid.server.plugin.MessageMetaDataType>
[ERROR] Error loading existing services file: META-INF/services/org.apache.qpid.server.plugin.ConfiguredObjectRegistration
- <https://builds.apache.org/job/Qpid-BrokerForJava-Test-JDK1.9/ws/broker-core/target/classes/META-INF/services/org.apache.qpid.server.plugin.ConfiguredObjectRegistration>
[ERROR] Error loading existing services file: META-INF/services/org.apache.qpid.server.message.mimecontentconverter.ObjectToMimeContentConverter
- <https://builds.apache.org/job/Qpid-BrokerForJava-Test-JDK1.9/ws/broker-core/target/classes/META-INF/services/org.apache.qpid.server.message.mimecontentconverter.ObjectToMimeContentConverter>
[ERROR] Error loading existing services file: META-INF/services/org.apache.qpid.server.message.mimecontentconverter.MimeContentToObjectConverter
- <https://builds.apache.org/job/Qpid-BrokerForJava-Test-JDK1.9/ws/broker-core/target/classes/META-INF/services/org.apache.qpid.server.message.mimecontentconverter.MimeContentToObjectConverter>
[ERROR] Error loading existing services file: META-INF/services/org.apache.qpid.server.plugin.ConnectionValidator
- <https://builds.apache.org/job/Qpid-BrokerForJava-Test-JDK1.9/ws/broker-core/target/classes/META-INF/services/org.apache.qpid.server.plugin.ConnectionValidator>
[ERROR] Error loading existing services file: META-INF/services/org.apache.qpid.server.security.auth.manager.oauth2.OAuth2IdentityResolverService
- <https://builds.apache.org/job/Qpid-BrokerForJava-Test-JDK1.9/ws/broker-core/target/classes/META-INF/services/org.apache.qpid.server.security.auth.manager.oauth2.OAuth2IdentityResolverService>
[ERROR] Error loading existing services file: META-INF/services/org.apache.qpid.server.plugin.ConfiguredObjectAttributeInjector
- <https://builds.apache.org/job/Qpid-BrokerForJava-Test-JDK1.9/ws/broker-core/target/classes/META-INF/services/org.apache.qpid.server.plugin.ConfiguredObjectAttributeInjector>
[ERROR] Error loading existing services file: META-INF/services/org.apache.qpid.server.plugin.TransportProviderFactory
- <https://builds.apache.org/job/Qpid-BrokerForJava-Test-JDK1.9/ws/broker-core/target/classes/META-INF/services/org.apache.qpid.server.plugin.TransportProviderFactory>
[ERROR] Error loading existing services file: META-INF/services/org.apache.qpid.server.plugin.ConditionallyAvailable
- <https://builds.apache.org/job/Qpid-BrokerForJava-Test-JDK1.9/ws/broker-core/target/classes/META-INF/services/org.apache.qpid.server.plugin.ConditionallyAvailable>
[ERROR] Error loading existing services file: META-INF/services/org.apache.qpid.server.store.serializer.MessageStoreSerializer
- <https://builds.apache.org/job/Qpid-BrokerForJava-Test-JDK1.9/ws/broker-core/target/classes/META-INF/services/org.apache.qpid.server.store.serializer.MessageStoreSerializer>
[ERROR] Error loading existing services file: META-INF/services/org.apache.qpid.server.plugin.MessageFilterFactory
- <https://builds.apache.org/job/Qpid-BrokerForJava-Test-JDK1.9/ws/broker-core/target/classes/META-INF/services/org.apache.qpid.server.plugin.MessageFilterFactory>
[ERROR] Error loading existing services file: META-INF/services/org.apache.qpid.server.plugin.ConfigurationSecretEncrypterFactory
- <https://builds.apache.org/job/Qpid-BrokerForJava-Test-JDK1.9/ws/broker-core/target/classes/META-INF/services/org.apache.qpid.server.plugin.ConfigurationSecretEncrypterFactory>
[ERROR] Error loading existing services file: META-INF/services/org.apache.qpid.server.plugin.ConfiguredObjectTypeFactory
- <https://builds.apache.org/job/Qpid-BrokerForJava-Test-JDK1.9/ws/broker-core/target/classes/META-INF/services/org.apache.qpid.server.plugin.ConfiguredObjectTypeFactory>
[ERROR] Error loading existing services file: META-INF/services/org.apache.qpid.server.model.preferences.PreferenceValueFactoryService
- <https://builds.apache.org/job/Qpid-BrokerForJava-Test-JDK1.9/ws/broker-core/target/classes/META-INF/services/org.apache.qpid.server.model.preferences.PreferenceValueFactoryService>
[ERROR] Error loading existing services file: META-INF/services/org.apache.qpid.server.queue.OverflowPolicyHandlerFactory
- <https://builds.apache.org/job/Qpid-BrokerForJava-Test-JDK1.9/ws/broker-core/target/classes/META-INF/services/org.apache.qpid.server.queue.OverflowPolicyHandlerFactory>
[ERROR] Error loading existing services file: META-INF/services/org.apache.qpid.server.plugin.SystemConfigFactory
- <https://builds.apache.org/job/Qpid-BrokerForJava-Test-JDK1.9/ws/broker-core/target/classes/META-INF/services/org.apache.qpid.server.plugin.SystemConfigFactory>
[ERROR] Error loading existing services file: META-INF/services/org.apache.qpid.server.model.ContainerType
- <https://builds.apache.org/job/Qpid-BrokerForJava-Test-JDK1.9/ws/broker-core/target/classes/META-INF/services/org.apache.qpid.server.model.ContainerType>
[ERROR] Error loading existing services file: META-INF/services/org.apache.qpid.server.plugin.SystemNodeCreator
- <https://builds.apache.org/job/Qpid-BrokerForJava-Test-JDK1.9/ws/broker-core/target/classes/META-INF/services/org.apache.qpid.server.plugin.SystemNodeCreator>
[ERROR] Error loading existing services file: META-INF/services/org.apache.qpid.server.store.preferences.PreferenceStoreFactoryService
- <https://builds.apache.org/job/Qpid-BrokerForJava-Test-JDK1.9/ws/broker-core/target/classes/META-INF/services/org.apache.qpid.server.store.preferences.PreferenceStoreFactoryService>
[ERROR] -> [Help 1]
[ERROR] Failed to execute goal org.apache.maven.plugins:maven-surefire-plugin:2.19.1:test
(default-test) on project qpid-perftests: Execution default-test of goal org.apache.maven.plugins:maven-surefire-plugin:2.19.1:test
failed: The forked VM terminated without properly saying goodbye. VM crash or System.exit
called?
[ERROR] Command was /bin/sh -c cd <https://builds.apache.org/job/Qpid-BrokerForJava-Test-JDK1.9/ws/perftests>
&& /usr/local/asfpackages/java/jdk-9-ea-b128/bin/java -javaagent:/home/jenkins/.m2/repository/org/jacoco/org.jacoco.agent/0.7.5.201505241946/org.jacoco.agent-0.7.5.201505241946-runtime.jar=destfile=<https://builds.apache.org/job/Qpid-BrokerForJava-Test-JDK1.9/ws/perftests/target/jacoco.exec>
-Xmx512m -jar <https://builds.apache.org/job/Qpid-BrokerForJava-Test-JDK1.9/1/artifact/perftests/target/surefire-reports/surefire/surefirebooter6304228946262860770.jar>
<https://builds.apache.org/job/Qpid-BrokerForJava-Test-JDK1.9/1/artifact/perftests/target/surefire-reports/surefire/surefire5926411827641929183tmp>
<https://builds.apache.org/job/Qpid-BrokerForJava-Test-JDK1.9/1/artifact/perftests/target/surefire-reports/surefire/surefire_04129751596212182029tmp>
[ERROR] -> [Help 2]
[ERROR] 
[ERROR] To see the full stack trace of the errors, re-run Maven with the -e switch.
[ERROR] Re-run Maven using the -X switch to enable full debug logging.
[ERROR] 
[ERROR] For more information about the errors and possible solutions, please read the following
articles:
[ERROR] [Help 1] http://cwiki.apache.org/confluence/display/MAVEN/MojoFailureException
[ERROR] [Help 2] http://cwiki.apache.org/confluence/display/MAVEN/PluginExecutionException
[ERROR] 
[ERROR] After correcting the problems, you can resume the build with the command
[ERROR]   mvn <goals> -rf :qpid-broker-core
Build step 'Invoke top-level Maven targets' marked build as failure
[locks-and-latches] Releasing all the locks
[locks-and-latches] All the locks released
Archiving artifacts
Recording test results
ERROR: Step ?Publish JUnit test result report? failed: No test report files were found. Configuration
error?


Mime
View raw message