qpid-notifications mailing list archives

Site index · List index
Message view « Date » · « Thread »
Top « Date » · « Thread »
From Apache Jenkins Server <jenk...@builds.apache.org>
Subject Build failed in Jenkins: Qpid-Java-Java-Test-JDK1.8 #1958
Date Mon, 09 Jan 2017 20:57:30 GMT
See <https://builds.apache.org/job/Qpid-Java-Java-Test-JDK1.8/1958/changes>

Changes:

[rgodfrey] QPID-7612 : [Java Broker] Where there is only one possibly type for a configured
object, do not require it to be provided

------------------------------------------
[...truncated 2813 lines...]
[INFO] argLine set to -javaagent:/home/jenkins/.m2/repository/org/jacoco/org.jacoco.agent/0.7.5.201505241946/org.jacoco.agent-0.7.5.201505241946-runtime.jar=destfile=<https://builds.apache.org/job/Qpid-Java-Java-Test-JDK1.8/ws/trunk/doc/jms-client-0-8/target/jacoco.exec>
-Xmx512m
[INFO] 
[INFO] --- maven-resources-plugin:2.7:copy-resources (filter-docbook-sources) @ qpid-java-doc-jms-client-0-8
---
[INFO] Using 'UTF-8' encoding to copy filtered resources.
[INFO] Copying 17 resources
[INFO] 
[INFO] --- maven-remote-resources-plugin:1.5:process (default) @ qpid-java-doc-jms-client-0-8
---
[INFO] 
[INFO] --- maven-resources-plugin:2.7:resources (default-resources) @ qpid-java-doc-jms-client-0-8
---
[INFO] Using 'UTF-8' encoding to copy filtered resources.
[INFO] Copying 17 resources
[INFO] 
[INFO] --- maven-compiler-plugin:3.2:compile (default-compile) @ qpid-java-doc-jms-client-0-8
---
[INFO] No sources to compile
[INFO] 
[INFO] --- maven-resources-plugin:2.7:testResources (default-testResources) @ qpid-java-doc-jms-client-0-8
---
[INFO] Using 'UTF-8' encoding to copy filtered resources.
[INFO] Copying 17 resources
[INFO] 
[INFO] --- maven-compiler-plugin:3.2:testCompile (default-testCompile) @ qpid-java-doc-jms-client-0-8
---
[INFO] No sources to compile
[INFO] 
[INFO] --- maven-surefire-plugin:2.18.1:test (default-test) @ qpid-java-doc-jms-client-0-8
---
[INFO] No tests to run.
[INFO] 
[INFO] --- maven-jar-plugin:2.5:jar (default-jar) @ qpid-java-doc-jms-client-0-8 ---
[INFO] Skipping packaging of the jar
[INFO] 
[INFO] --- maven-site-plugin:3.4:attach-descriptor (attach-descriptor) @ qpid-java-doc-jms-client-0-8
---
[INFO] 
[INFO] --- maven-assembly-plugin:2.4.1:single (default) @ qpid-java-doc-jms-client-0-8 ---
[INFO] Assemblies have been skipped per configuration of the skipAssembly parameter.
[INFO]                                                                         
[INFO] ------------------------------------------------------------------------
[INFO] Building Apache Qpid JMS Client for AMQP 0-10 Docbook 7.0.0-SNAPSHOT
[INFO] ------------------------------------------------------------------------
[INFO] 
[INFO] --- maven-clean-plugin:2.5:clean (default-clean) @ qpid-java-doc-jms-client-0-10 ---
[INFO] Deleting <https://builds.apache.org/job/Qpid-Java-Java-Test-JDK1.8/ws/trunk/doc/jms-client-0-10/target>
[INFO] 
[INFO] --- maven-antrun-plugin:1.7:run (output-test-properties) @ qpid-java-doc-jms-client-0-10
---
[INFO] Executing tasks

main:
     [echo] Qpid Test Profile Properties
     [echo] [profile] java-mms.0-10
     [echo] [profile.broker.language] java
     [echo] [profile.broker.type] internal
     [echo] [profile.broker.command] "<https://builds.apache.org/job/Qpid-Java-Java-Test-JDK1.8/ws/trunk/doc/jms-client-0-10/bin/qpid-server">
-sp "@STORE_PATH" -st @STORE_TYPE -prop test.port=@PORT -prop "qpid.work_dir=@QPID_WORK"
     [echo] [profile.specific.excludes] JavaTransientExcludes Java010Excludes
     [echo] [profile.test.excludes] Excludes JavaExcludes java-mms.0-10.excludes JavaTransientExcludes
Java010Excludes
     [echo] [profile.broker.version] v0_10
     [echo] [profile.test.amqp_port_protocols] ["AMQP_0_8","AMQP_0_9","AMQP_0_9_1","AMQP_0_10"]
     [echo] [profile.broker.persistent] false
     [echo] [profile.virtualhostnode.type] Memory
     [echo] [profile.virtualhostnode.context.blueprint] {"type":"ProvidedStore","globalAddressDomains":"${qpid.globalAddressDomains}"}
     [echo] [profile.test_receive_timeout] 1000
[INFO] Executed tasks
[INFO] 
[INFO] --- maven-enforcer-plugin:1.3.1:enforce (enforce-minimum-versions) @ qpid-java-doc-jms-client-0-10
---
[INFO] 
[INFO] --- maven-enforcer-plugin:1.3.1:enforce (enforce-versions-standard-properties) @ qpid-java-doc-jms-client-0-10
---
[INFO] 
[INFO] --- jacoco-maven-plugin:0.7.5.201505241946:prepare-agent (default-prepare-agent) @
qpid-java-doc-jms-client-0-10 ---
[INFO] argLine set to -javaagent:/home/jenkins/.m2/repository/org/jacoco/org.jacoco.agent/0.7.5.201505241946/org.jacoco.agent-0.7.5.201505241946-runtime.jar=destfile=<https://builds.apache.org/job/Qpid-Java-Java-Test-JDK1.8/ws/trunk/doc/jms-client-0-10/target/jacoco.exec>
-Xmx512m
[INFO] 
[INFO] --- maven-resources-plugin:2.7:copy-resources (filter-docbook-sources) @ qpid-java-doc-jms-client-0-10
---
[INFO] Using 'UTF-8' encoding to copy filtered resources.
[INFO] Copying 1 resource
[INFO] 
[INFO] --- maven-remote-resources-plugin:1.5:process (default) @ qpid-java-doc-jms-client-0-10
---
[INFO] 
[INFO] --- maven-resources-plugin:2.7:resources (default-resources) @ qpid-java-doc-jms-client-0-10
---
[INFO] Using 'UTF-8' encoding to copy filtered resources.
[INFO] Copying 1 resource
[INFO] 
[INFO] --- maven-compiler-plugin:3.2:compile (default-compile) @ qpid-java-doc-jms-client-0-10
---
[INFO] No sources to compile
[INFO] 
[INFO] --- maven-resources-plugin:2.7:testResources (default-testResources) @ qpid-java-doc-jms-client-0-10
---
[INFO] Using 'UTF-8' encoding to copy filtered resources.
[INFO] Copying 1 resource
[INFO] 
[INFO] --- maven-compiler-plugin:3.2:testCompile (default-testCompile) @ qpid-java-doc-jms-client-0-10
---
[INFO] No sources to compile
[INFO] 
[INFO] --- maven-surefire-plugin:2.18.1:test (default-test) @ qpid-java-doc-jms-client-0-10
---
[INFO] No tests to run.
[INFO] 
[INFO] --- maven-jar-plugin:2.5:jar (default-jar) @ qpid-java-doc-jms-client-0-10 ---
[INFO] Skipping packaging of the jar
[INFO] 
[INFO] --- maven-site-plugin:3.4:attach-descriptor (attach-descriptor) @ qpid-java-doc-jms-client-0-10
---
[INFO] 
[INFO] --- maven-assembly-plugin:2.4.1:single (default) @ qpid-java-doc-jms-client-0-10 ---
[INFO] Assemblies have been skipped per configuration of the skipAssembly parameter.
[INFO]                                                                         
[INFO] ------------------------------------------------------------------------
[INFO] Building Apache Qpid Performance Test Docbook 7.0.0-SNAPSHOT
[INFO] ------------------------------------------------------------------------
[INFO] 
[INFO] --- maven-clean-plugin:2.5:clean (default-clean) @ qpid-java-doc-perftests ---
[INFO] Deleting <https://builds.apache.org/job/Qpid-Java-Java-Test-JDK1.8/ws/trunk/doc/java-perftests/target>
[INFO] 
[INFO] --- maven-antrun-plugin:1.7:run (output-test-properties) @ qpid-java-doc-perftests
---
[INFO] Executing tasks

main:
     [echo] Qpid Test Profile Properties
     [echo] [profile] java-mms.0-10
     [echo] [profile.broker.language] java
     [echo] [profile.broker.type] internal
     [echo] [profile.broker.command] "<https://builds.apache.org/job/Qpid-Java-Java-Test-JDK1.8/ws/trunk/doc/java-perftests/bin/qpid-server">
-sp "@STORE_PATH" -st @STORE_TYPE -prop test.port=@PORT -prop "qpid.work_dir=@QPID_WORK"
     [echo] [profile.specific.excludes] JavaTransientExcludes Java010Excludes
     [echo] [profile.test.excludes] Excludes JavaExcludes java-mms.0-10.excludes JavaTransientExcludes
Java010Excludes
     [echo] [profile.broker.version] v0_10
     [echo] [profile.test.amqp_port_protocols] ["AMQP_0_8","AMQP_0_9","AMQP_0_9_1","AMQP_0_10"]
     [echo] [profile.broker.persistent] false
     [echo] [profile.virtualhostnode.type] Memory
     [echo] [profile.virtualhostnode.context.blueprint] {"type":"ProvidedStore","globalAddressDomains":"${qpid.globalAddressDomains}"}
     [echo] [profile.test_receive_timeout] 1000
[INFO] Executed tasks
[INFO] 
[INFO] --- maven-enforcer-plugin:1.3.1:enforce (enforce-minimum-versions) @ qpid-java-doc-perftests
---
[INFO] 
[INFO] --- maven-enforcer-plugin:1.3.1:enforce (enforce-versions-standard-properties) @ qpid-java-doc-perftests
---
[INFO] 
[INFO] --- jacoco-maven-plugin:0.7.5.201505241946:prepare-agent (default-prepare-agent) @
qpid-java-doc-perftests ---
[INFO] argLine set to -javaagent:/home/jenkins/.m2/repository/org/jacoco/org.jacoco.agent/0.7.5.201505241946/org.jacoco.agent-0.7.5.201505241946-runtime.jar=destfile=<https://builds.apache.org/job/Qpid-Java-Java-Test-JDK1.8/ws/trunk/doc/java-perftests/target/jacoco.exec>
-Xmx512m
[INFO] 
[INFO] --- maven-resources-plugin:2.7:copy-resources (filter-docbook-sources) @ qpid-java-doc-perftests
---
[INFO] Using 'UTF-8' encoding to copy filtered resources.
[INFO] Copying 1 resource
[INFO] 
[INFO] --- maven-remote-resources-plugin:1.5:process (default) @ qpid-java-doc-perftests ---
[INFO] 
[INFO] --- maven-resources-plugin:2.7:resources (default-resources) @ qpid-java-doc-perftests
---
[INFO] Using 'UTF-8' encoding to copy filtered resources.
[INFO] Copying 1 resource
[INFO] 
[INFO] --- maven-compiler-plugin:3.2:compile (default-compile) @ qpid-java-doc-perftests ---
[INFO] No sources to compile
[INFO] 
[INFO] --- maven-resources-plugin:2.7:testResources (default-testResources) @ qpid-java-doc-perftests
---
[INFO] Using 'UTF-8' encoding to copy filtered resources.
[INFO] Copying 1 resource
[INFO] 
[INFO] --- maven-compiler-plugin:3.2:testCompile (default-testCompile) @ qpid-java-doc-perftests
---
[INFO] No sources to compile
[INFO] 
[INFO] --- maven-surefire-plugin:2.18.1:test (default-test) @ qpid-java-doc-perftests ---
[INFO] No tests to run.
[INFO] 
[INFO] --- maven-jar-plugin:2.5:jar (default-jar) @ qpid-java-doc-perftests ---
[INFO] Skipping packaging of the jar
[INFO] 
[INFO] --- maven-site-plugin:3.4:attach-descriptor (attach-descriptor) @ qpid-java-doc-perftests
---
[INFO] 
[INFO] --- maven-assembly-plugin:2.4.1:single (default) @ qpid-java-doc-perftests ---
[INFO] Assemblies have been skipped per configuration of the skipAssembly parameter.
[INFO] ------------------------------------------------------------------------
[INFO] Reactor Summary:
[INFO] 
[INFO] Apache Qpid for Java ............................... SUCCESS [  6.588 s]
[INFO] Apache Qpid Broker Code Generation ................. SUCCESS [  1.812 s]
[INFO] Apache Qpid Test Utilities ......................... SUCCESS [  0.735 s]
[INFO] Apache Qpid Common ................................. SUCCESS [ 28.275 s]
[INFO] Apache Qpid Broker Core ............................ FAILURE [ 55.922 s]
[INFO] Apache Qpid LogBack Logging Broker Plug-in ......... SKIPPED
[INFO] Apache Qpid Access Control Broker Plug-in .......... SKIPPED
[INFO] Apache Qpid AMQP 0-8 Protocol Broker Plug-in ....... SKIPPED
[INFO] Apache Qpid AMQP 0-10 Protocol Plug-in ............. SKIPPED
[INFO] Apache Qpid AMQP 1-0 Protocol Broker Plug-in ....... SKIPPED
[INFO] Apache Qpid AMQP 0-8 to 0-10 Message Conversion Broker Plug-in SKIPPED
[INFO] Apache Qpid AMQP 0-8 to 1-0 Message Conversion Broker Plug-in SKIPPED
[INFO] Apache Qpid AMQP 0-10 to 1-0 Message Conversion Broker Plug-in SKIPPED
[INFO] Apache Qpid Derby Message Store Broker Plug-in ..... SKIPPED
[INFO] Apache Qpid JDBC Message Store Connection Pooling Plug-in SKIPPED
[INFO] Apache Qpid JDBC Message Store Broker Plug-in ...... SKIPPED
[INFO] Apache Qpid HTTP Management Broker Plug-in ......... SKIPPED
[INFO] Apache Qpid AMQP Management Protocol Broker Plug-in  SKIPPED
[INFO] Apache Qpid Memory Message Store Broker Plug-in .... SKIPPED
[INFO] Apache Qpid WebSocket Broker Plug-in ............... SKIPPED
[INFO] Apache Qpid JMS Client for AMQP 0-9-1/0-10 ......... SUCCESS [ 13.055 s]
[INFO] Apache Qpid BDB Message Store Broker Plug-in ....... SKIPPED
[INFO] Apache Qpid Broker for Java ........................ SKIPPED
[INFO] Apache Qpid Client for AMQP 0-9-1/0-10 Examples .... SUCCESS [  0.152 s]
[INFO] Apache Qpid JCA .................................... SUCCESS [  2.124 s]
[INFO] Apache Qpid Resource Adaptor ....................... SUCCESS [  0.470 s]
[INFO] Apache Qpid Tools .................................. SUCCESS [  0.370 s]
[INFO] Apache Qpid System Test Parent ..................... FAILURE [  1.731 s]
[INFO] Apache Qpid System Tests ........................... SKIPPED
[INFO] qpid-systests-jms_2.0 .............................. SKIPPED
[INFO] Apache Qpid Performance Tests ...................... SUCCESS [ 16.169 s]
[INFO] Apache Qpid Performance Test System Tests .......... SKIPPED
[INFO] Apache Qpid Performance Tests Visualisation JFC .... SUCCESS [  6.802 s]
[INFO] Apache Qpid BDB Store System Tests ................. SKIPPED
[INFO] Apache Qpid Joram JMS Tests ........................ SUCCESS [  0.354 s]
[INFO] Apache Qpid JMS TCK Configuration .................. SUCCESS [  0.235 s]
[INFO] Apache Qpid for Java Docbook ....................... SUCCESS [  0.074 s]
[INFO] Apache Qpid Broker for Java Docbook ................ SUCCESS [  0.949 s]
[INFO] Apache Qpid JMS Client for AMQP 0-8, 0-9 and 0-9-1 Docbook SUCCESS [  0.361 s]
[INFO] Apache Qpid JMS Client for AMQP 0-10 Docbook ....... SUCCESS [  0.299 s]
[INFO] Apache Qpid Performance Test Docbook ............... SUCCESS [  0.081 s]
[INFO] ------------------------------------------------------------------------
[INFO] BUILD FAILURE
[INFO] ------------------------------------------------------------------------
[INFO] Total time: 02:17 min
[INFO] Finished at: 2017-01-09T20:56:08+00:00
[INFO] Final Memory: 79M/1497M
[INFO] ------------------------------------------------------------------------
[ERROR] Failed to execute goal org.apache.maven.plugins:maven-surefire-plugin:2.18.1:test
(default-test) on project qpid-broker-core: There are test failures.
[ERROR] 
[ERROR] Please refer to <https://builds.apache.org/job/Qpid-Java-Java-Test-JDK1.8/1958/artifact/trunk/broker-core/target/surefire-reports/java-mms.0-10>
for the individual test results.
[ERROR] -> [Help 1]
[ERROR] Failed to execute goal org.apache.maven.plugins:maven-dependency-plugin:2.8:unpack
(extract-broker-distribution) on project qpid-systests-parent: Unable to find artifact. Could
not find artifact org.apache.qpid:qpid-broker:tar.gz:bin:7.0.0-SNAPSHOT in Nexus (http://repository.apache.org/snapshots)
[ERROR] 
[ERROR] Try downloading the file manually from the project website.
[ERROR] 
[ERROR] Then, install it using the command:
[ERROR] mvn install:install-file -DgroupId=org.apache.qpid -DartifactId=qpid-broker -Dversion=7.0.0-SNAPSHOT
-Dclassifier=bin -Dpackaging=tar.gz -Dfile=/path/to/file
[ERROR] 
[ERROR] Alternatively, if you host your own repository you can deploy the file there:
[ERROR] mvn deploy:deploy-file -DgroupId=org.apache.qpid -DartifactId=qpid-broker -Dversion=7.0.0-SNAPSHOT
-Dclassifier=bin -Dpackaging=tar.gz -Dfile=/path/to/file -Durl=[url] -DrepositoryId=[id]
[ERROR] 
[ERROR] 
[ERROR] org.apache.qpid:qpid-broker:tar.gz:7.0.0-SNAPSHOT
[ERROR] 
[ERROR] from the specified remote repositories:
[ERROR] oracle.releases (http://download.oracle.com/maven, releases=true, snapshots=false),
[ERROR] Nexus (http://repository.apache.org/snapshots, releases=false, snapshots=true),
[ERROR] central (https://repo.maven.apache.org/maven2, releases=true, snapshots=false)
[ERROR] -> [Help 2]
[ERROR] 
[ERROR] To see the full stack trace of the errors, re-run Maven with the -e switch.
[ERROR] Re-run Maven using the -X switch to enable full debug logging.
[ERROR] 
[ERROR] For more information about the errors and possible solutions, please read the following
articles:
[ERROR] [Help 1] http://cwiki.apache.org/confluence/display/MAVEN/MojoFailureException
[ERROR] [Help 2] http://cwiki.apache.org/confluence/display/MAVEN/MojoExecutionException
[ERROR] 
[ERROR] After correcting the problems, you can resume the build with the command
[ERROR]   mvn <goals> -rf :qpid-broker-core
Build step 'Invoke top-level Maven targets' marked build as failure
[locks-and-latches] Releasing all the locks
[locks-and-latches] All the locks released
Archiving artifacts
Compressed 426.98 MB of artifacts by 97.6% relative to #1957
Recording test results

Mime
View raw message