qpid-notifications mailing list archives

Site index · List index
Message view « Date » · « Thread »
Top « Date » · « Thread »
From Apache Jenkins Server <jenk...@builds.apache.org>
Subject Build failed in Jenkins: Qpid-Java-Java-Test-IBMJDK1.8 #1950
Date Wed, 25 Jan 2017 10:02:34 GMT
See <https://builds.apache.org/job/Qpid-Java-Java-Test-IBMJDK1.8/1950/changes>

Changes:

[orudyy] QPID-7638: Add ability to run JMS 2.0 TCK

[kwall] QPID-7546: [System Tests] Reclassify some excluded failures

[kwall] QPID-7633: Remove interface AMQSessionModel

------------------------------------------
Started by an SCM change
Started by an SCM change
[EnvInject] - Loading node environment variables.
Building remotely on H13 (ubuntu) in workspace <https://builds.apache.org/job/Qpid-Java-Java-Test-IBMJDK1.8/ws/>
Updating http://svn.apache.org/repos/asf/qpid/java/trunk at revision '2017-01-25T10:01:13.062
+0000'
U         test-profiles/Java10BrokenTestsExcludes
U         test-profiles/Java10UninvestigatedTestsExcludes
U         test-profiles/Java10Excludes
U         systests/src/test/java/org/apache/qpid/server/store/VirtualHostMessageStoreTest.java
U         broker-plugins/amqp-0-8-protocol/src/main/java/org/apache/qpid/server/protocol/v0_8/AMQPConnection_0_8Impl.java
U         broker-plugins/amqp-0-8-protocol/src/main/java/org/apache/qpid/server/protocol/v0_8/AMQChannel.java
U         broker-plugins/amqp-0-10-protocol/src/main/java/org/apache/qpid/server/protocol/v0_10/AMQPConnection_0_10Impl.java
U         broker-plugins/amqp-0-10-protocol/src/main/java/org/apache/qpid/server/protocol/v0_10/ServerConnection.java
U         broker-plugins/amqp-0-10-protocol/src/main/java/org/apache/qpid/server/protocol/v0_10/Session_0_10.java
U         broker-plugins/amqp-1-0-protocol/src/main/java/org/apache/qpid/server/protocol/v1_0/AMQPConnection_1_0Impl.java
U         broker-plugins/amqp-1-0-protocol/src/main/java/org/apache/qpid/server/protocol/v1_0/Session_1_0.java
U         broker-plugins/management-amqp/src/main/java/org/apache/qpid/server/management/amqp/ManagementNode.java
U         broker-plugins/management-amqp/src/main/java/org/apache/qpid/server/management/amqp/ProxyMessageSource.java
U         broker-plugins/management-amqp/src/main/java/org/apache/qpid/server/management/amqp/ManagementAddressSpace.java
U         broker-plugins/management-amqp/src/main/java/org/apache/qpid/server/management/amqp/ManagementNodeConsumer.java
U         broker-core/src/test/java/org/apache/qpid/server/consumer/TestConsumerTarget.java
U         broker-core/src/test/java/org/apache/qpid/server/model/BrokerTestHelper.java
U         broker-core/src/test/java/org/apache/qpid/server/queue/AbstractQueueTestBase.java
U         broker-core/src/test/java/org/apache/qpid/server/logging/subjects/ChannelLogSubjectTest.java
U         broker-core/src/main/java/org/apache/qpid/server/txn/DtxBranch.java
U         broker-core/src/main/java/org/apache/qpid/server/txn/DistributedTransaction.java
U         broker-core/src/main/java/org/apache/qpid/server/txn/DtxRegistry.java
U         broker-core/src/main/java/org/apache/qpid/server/session/AMQPSession.java
U         broker-core/src/main/java/org/apache/qpid/server/virtualhost/AbstractSystemMessageSource.java
U         broker-core/src/main/java/org/apache/qpid/server/message/MessageSource.java
U         broker-core/src/main/java/org/apache/qpid/server/queue/QueueConsumerImpl.java
U         broker-core/src/main/java/org/apache/qpid/server/queue/AbstractQueue.java
U         broker-core/src/main/java/org/apache/qpid/server/logging/AbstractMessageLogger.java
U         broker-core/src/main/java/org/apache/qpid/server/logging/LogSubject.java
U         broker-core/src/main/java/org/apache/qpid/server/logging/subjects/ChannelLogSubject.java
U         broker-core/src/main/java/org/apache/qpid/server/consumer/ConsumerTarget.java
U         broker-core/src/main/java/org/apache/qpid/server/consumer/AbstractConsumerTarget.java
U         broker-core/src/main/java/org/apache/qpid/server/transport/AMQPConnection.java
U         broker-core/src/main/java/org/apache/qpid/server/connection/SessionPrincipal.java
U         broker-core/src/main/java/org/apache/qpid/server/model/Consumer.java
D         broker-core/src/main/java/org/apache/qpid/server/protocol/AMQSessionModel.java
U         broker-core/src/main/java/org/apache/qpid/server/protocol/CapacityChecker.java
A         tck/src/test/resources/qpid-jms20-client
A         tck/src/test/resources/qpid-jms20-client/ts.jtx
A         tck/src/test/resources/qpid-jms20-client/jndi.properties
U         tck/src/test/resources/resources.json
U         tck/src/test/resources/ts.jte
U         tck/pom.xml
At revision 1780160

[locks-and-latches] Checking to see if we really have the locks
[locks-and-latches] Have all the locks, build can start
[Qpid-Java-Java-Test-IBMJDK1.8] $ /home/jenkins/tools/maven/latest3/bin/mvn -f ./pom.xml "-Dprofile.specific.excludes=JavaTransientExcludes
Java010Excludes IBMJDKExcludes" -Dtest.overridden.properties=<https://builds.apache.org/job/Qpid-Java-Java-Test-IBMJDK1.8/ws/test-profiles/apache-ci.test.overridden.properties>
clean verify -Pjava-mms.0-10 -fae
[INFO] Scanning for projects...
[ERROR] [ERROR] Some problems were encountered while processing the POMs:
[ERROR] 'dependencies.dependency.systemPath' for oracle-jms-tck:parser:jar must specify an
absolute path but is ${tck.directory}/lib/parser.jar @ org.apache.qpid:qpid-tck:[unknown-version],
<https://builds.apache.org/job/Qpid-Java-Java-Test-IBMJDK1.8/ws/tck/pom.xml,> line 268,
column 33
 @ 
[ERROR] The build could not read 1 project -> [Help 1]
[ERROR]   
[ERROR]   The project org.apache.qpid:qpid-tck:7.0.0-SNAPSHOT (<https://builds.apache.org/job/Qpid-Java-Java-Test-IBMJDK1.8/ws/tck/pom.xml)>
has 1 error
[ERROR]     'dependencies.dependency.systemPath' for oracle-jms-tck:parser:jar must specify
an absolute path but is ${tck.directory}/lib/parser.jar @ org.apache.qpid:qpid-tck:[unknown-version],
<https://builds.apache.org/job/Qpid-Java-Java-Test-IBMJDK1.8/ws/tck/pom.xml,> line 268,
column 33
[ERROR] 
[ERROR] To see the full stack trace of the errors, re-run Maven with the -e switch.
[ERROR] Re-run Maven using the -X switch to enable full debug logging.
[ERROR] 
[ERROR] For more information about the errors and possible solutions, please read the following
articles:
[ERROR] [Help 1] http://cwiki.apache.org/confluence/display/MAVEN/ProjectBuildingException
Build step 'Invoke top-level Maven targets' marked build as failure
[locks-and-latches] Releasing all the locks
[locks-and-latches] All the locks released
Archiving artifacts
Compressed 459.47 MB of artifacts by 100.0% relative to #1949
Recording test results
ERROR: Step ?Publish JUnit test result report? failed: Test reports were found but none of
them are new. Did tests run? 
For example, <https://builds.apache.org/job/Qpid-Java-Java-Test-IBMJDK1.8/1950/artifact/bdbstore/systests/target/surefire-reports/java-mms.0-10/TEST-org.apache.qpid.server.store.berkeleydb.BDBBackupTest.xml>
is 18 hr old



Mime
View raw message