qpid-notifications mailing list archives

Site index · List index
Message view « Date » · « Thread »
Top « Date » · « Thread »
From Apache Jenkins Server <jenk...@builds.apache.org>
Subject Build failed in Jenkins: Qpid-proton-c #1265
Date Thu, 19 Jan 2017 00:38:58 GMT
See <https://builds.apache.org/job/Qpid-proton-c/1265/changes>

Changes:

[astitcher] PROTON-1391: Fix passing NULL as a var_arg not working on Solaris

------------------------------------------
[...truncated 157 lines...]
[ 30%] Building C object proton-c/CMakeFiles/qpid-proton-core.dir/src/core/object/iterator.c.o
[ 30%] Building C object proton-c/CMakeFiles/qpid-proton-core.dir/src/core/object/record.c.o
[ 31%] Building C object proton-c/CMakeFiles/qpid-proton-core.dir/src/core/log.c.o
[ 31%] Building C object proton-c/CMakeFiles/qpid-proton-core.dir/src/core/util.c.o
[ 32%] Building C object proton-c/CMakeFiles/qpid-proton-core.dir/src/core/error.c.o
[ 32%] Building C object proton-c/CMakeFiles/qpid-proton-core.dir/src/core/buffer.c.o
[ 33%] Building C object proton-c/CMakeFiles/qpid-proton-core.dir/src/core/types.c.o
[ 34%] Building C object proton-c/CMakeFiles/qpid-proton-core.dir/src/core/framing.c.o
[ 34%] Building C object proton-c/CMakeFiles/qpid-proton-core.dir/src/core/codec.c.o
[ 35%] Building C object proton-c/CMakeFiles/qpid-proton-core.dir/src/core/decoder.c.o
[ 35%] Building C object proton-c/CMakeFiles/qpid-proton-core.dir/src/core/encoder.c.o
[ 36%] Building C object proton-c/CMakeFiles/qpid-proton-core.dir/src/core/dispatcher.c.o
[ 36%] Building C object proton-c/CMakeFiles/qpid-proton-core.dir/src/core/connection_driver.c.o
[ 37%] Building C object proton-c/CMakeFiles/qpid-proton-core.dir/src/core/engine.c.o
[ 37%] Building C object proton-c/CMakeFiles/qpid-proton-core.dir/src/core/event.c.o
[ 38%] Building C object proton-c/CMakeFiles/qpid-proton-core.dir/src/core/autodetect.c.o
[ 38%] Building C object proton-c/CMakeFiles/qpid-proton-core.dir/src/core/transport.c.o
[ 39%] Building C object proton-c/CMakeFiles/qpid-proton-core.dir/src/core/message.c.o
[ 39%] Building C object proton-c/CMakeFiles/qpid-proton-core.dir/src/sasl/sasl.c.o
[ 40%] Building C object proton-c/CMakeFiles/qpid-proton-core.dir/src/sasl/cyrus_sasl.c.o
[ 41%] Building C object proton-c/CMakeFiles/qpid-proton-core.dir/src/ssl/openssl.c.o
Linking C shared library libqpid-proton-core.so
[ 42%] Built target qpid-proton-core
Scanning dependencies of target msgr-recv
[ 42%] Building C object tests/tools/apps/c/CMakeFiles/msgr-recv.dir/msgr-recv.c.o
[ 43%] Building C object tests/tools/apps/c/CMakeFiles/msgr-recv.dir/msgr-common.c.o
Linking C executable msgr-recv
[ 43%] Built target msgr-recv
Scanning dependencies of target msgr-send
[ 43%] Building C object tests/tools/apps/c/CMakeFiles/msgr-send.dir/msgr-send.c.o
[ 44%] Building C object tests/tools/apps/c/CMakeFiles/msgr-send.dir/msgr-common.c.o
Linking C executable msgr-send
[ 44%] Built target msgr-send
Scanning dependencies of target reactor-recv
[ 45%] Building C object tests/tools/apps/c/CMakeFiles/reactor-recv.dir/reactor-recv.c.o
[ 46%] Building C object tests/tools/apps/c/CMakeFiles/reactor-recv.dir/msgr-common.c.o
Linking C executable reactor-recv
[ 46%] Built target reactor-recv
Scanning dependencies of target reactor-send
[ 46%] Building C object tests/tools/apps/c/CMakeFiles/reactor-send.dir/reactor-send.c.o
[ 47%] Building C object tests/tools/apps/c/CMakeFiles/reactor-send.dir/msgr-common.c.o
Linking C executable reactor-send
[ 47%] Built target reactor-send
Scanning dependencies of target qpid-proton-cpp
[ 47%] Building CXX object proton-c/bindings/cpp/CMakeFiles/qpid-proton-cpp.dir/src/binary.cpp.o
[ 48%] Building CXX object proton-c/bindings/cpp/CMakeFiles/qpid-proton-cpp.dir/src/byte_array.cpp.o
[ 48%] Building CXX object proton-c/bindings/cpp/CMakeFiles/qpid-proton-cpp.dir/src/cached_map.cpp.o
[ 49%] Building CXX object proton-c/bindings/cpp/CMakeFiles/qpid-proton-cpp.dir/src/connection.cpp.o
[ 49%] Building CXX object proton-c/bindings/cpp/CMakeFiles/qpid-proton-cpp.dir/src/connection_options.cpp.o
[ 50%] Building CXX object proton-c/bindings/cpp/CMakeFiles/qpid-proton-cpp.dir/src/connector.cpp.o
[ 50%] Building CXX object proton-c/bindings/cpp/CMakeFiles/qpid-proton-cpp.dir/src/container.cpp.o
[ 51%] Building CXX object proton-c/bindings/cpp/CMakeFiles/qpid-proton-cpp.dir/src/container_impl.cpp.o
[ 51%] Building CXX object proton-c/bindings/cpp/CMakeFiles/qpid-proton-cpp.dir/src/contexts.cpp.o
[ 52%] Building CXX object proton-c/bindings/cpp/CMakeFiles/qpid-proton-cpp.dir/src/data.cpp.o
[ 53%] Building CXX object proton-c/bindings/cpp/CMakeFiles/qpid-proton-cpp.dir/src/decimal.cpp.o
[ 53%] Building CXX object proton-c/bindings/cpp/CMakeFiles/qpid-proton-cpp.dir/src/decoder.cpp.o
[ 54%] Building CXX object proton-c/bindings/cpp/CMakeFiles/qpid-proton-cpp.dir/src/delivery.cpp.o
[ 54%] Building CXX object proton-c/bindings/cpp/CMakeFiles/qpid-proton-cpp.dir/src/duration.cpp.o
[ 55%] Building CXX object proton-c/bindings/cpp/CMakeFiles/qpid-proton-cpp.dir/src/encoder.cpp.o
[ 55%] Building CXX object proton-c/bindings/cpp/CMakeFiles/qpid-proton-cpp.dir/src/endpoint.cpp.o
[ 56%] Building CXX object proton-c/bindings/cpp/CMakeFiles/qpid-proton-cpp.dir/src/error.cpp.o
[ 56%] Building CXX object proton-c/bindings/cpp/CMakeFiles/qpid-proton-cpp.dir/src/error_condition.cpp.o
[ 57%] Building CXX object proton-c/bindings/cpp/CMakeFiles/qpid-proton-cpp.dir/src/event_loop.cpp.o
[ 57%] Building CXX object proton-c/bindings/cpp/CMakeFiles/qpid-proton-cpp.dir/src/handler.cpp.o
[ 58%] Building CXX object proton-c/bindings/cpp/CMakeFiles/qpid-proton-cpp.dir/src/io/connection_driver.cpp.o
[ 59%] Building CXX object proton-c/bindings/cpp/CMakeFiles/qpid-proton-cpp.dir/src/io/link_namer.cpp.o
[ 59%] Building CXX object proton-c/bindings/cpp/CMakeFiles/qpid-proton-cpp.dir/src/link.cpp.o
[ 60%] Building CXX object proton-c/bindings/cpp/CMakeFiles/qpid-proton-cpp.dir/src/listener.cpp.o
[ 60%] Building CXX object proton-c/bindings/cpp/CMakeFiles/qpid-proton-cpp.dir/src/message.cpp.o
[ 61%] Building CXX object proton-c/bindings/cpp/CMakeFiles/qpid-proton-cpp.dir/src/messaging_adapter.cpp.o
[ 61%] Building CXX object proton-c/bindings/cpp/CMakeFiles/qpid-proton-cpp.dir/src/node_options.cpp.o
[ 62%] Building CXX object proton-c/bindings/cpp/CMakeFiles/qpid-proton-cpp.dir/src/object.cpp.o
[ 62%] Building CXX object proton-c/bindings/cpp/CMakeFiles/qpid-proton-cpp.dir/src/proton_bits.cpp.o
[ 63%] Building CXX object proton-c/bindings/cpp/CMakeFiles/qpid-proton-cpp.dir/src/proton_event.cpp.o
[ 63%] Building CXX object proton-c/bindings/cpp/CMakeFiles/qpid-proton-cpp.dir/src/proton_handler.cpp.o
[ 64%] Building CXX object proton-c/bindings/cpp/CMakeFiles/qpid-proton-cpp.dir/src/reactor.cpp.o
[ 65%] Building CXX object proton-c/bindings/cpp/CMakeFiles/qpid-proton-cpp.dir/src/receiver.cpp.o
[ 65%] Building CXX object proton-c/bindings/cpp/CMakeFiles/qpid-proton-cpp.dir/src/receiver_options.cpp.o
[ 66%] Building CXX object proton-c/bindings/cpp/CMakeFiles/qpid-proton-cpp.dir/src/reconnect_timer.cpp.o
[ 66%] Building CXX object proton-c/bindings/cpp/CMakeFiles/qpid-proton-cpp.dir/src/sasl.cpp.o
[ 67%] Building CXX object proton-c/bindings/cpp/CMakeFiles/qpid-proton-cpp.dir/src/scalar_base.cpp.o
[ 67%] Building CXX object proton-c/bindings/cpp/CMakeFiles/qpid-proton-cpp.dir/src/sender.cpp.o
[ 68%] Building CXX object proton-c/bindings/cpp/CMakeFiles/qpid-proton-cpp.dir/src/sender_options.cpp.o
[ 68%] Building CXX object proton-c/bindings/cpp/CMakeFiles/qpid-proton-cpp.dir/src/session.cpp.o
[ 69%] Building CXX object proton-c/bindings/cpp/CMakeFiles/qpid-proton-cpp.dir/src/session_options.cpp.o
[ 69%] Building CXX object proton-c/bindings/cpp/CMakeFiles/qpid-proton-cpp.dir/src/source.cpp.o
[ 70%] Building CXX object proton-c/bindings/cpp/CMakeFiles/qpid-proton-cpp.dir/src/ssl.cpp.o
[ 70%] Building CXX object proton-c/bindings/cpp/CMakeFiles/qpid-proton-cpp.dir/src/ssl_domain.cpp.o
[ 71%] Building CXX object proton-c/bindings/cpp/CMakeFiles/qpid-proton-cpp.dir/src/target.cpp.o
[ 72%] Building CXX object proton-c/bindings/cpp/CMakeFiles/qpid-proton-cpp.dir/src/terminus.cpp.o
[ 72%] Building CXX object proton-c/bindings/cpp/CMakeFiles/qpid-proton-cpp.dir/src/timestamp.cpp.o
[ 73%] Building CXX object proton-c/bindings/cpp/CMakeFiles/qpid-proton-cpp.dir/src/tracker.cpp.o
[ 73%] Building CXX object proton-c/bindings/cpp/CMakeFiles/qpid-proton-cpp.dir/src/transfer.cpp.o
[ 74%] Building CXX object proton-c/bindings/cpp/CMakeFiles/qpid-proton-cpp.dir/src/transport.cpp.o
[ 74%] Building CXX object proton-c/bindings/cpp/CMakeFiles/qpid-proton-cpp.dir/src/type_id.cpp.o
[ 75%] Building CXX object proton-c/bindings/cpp/CMakeFiles/qpid-proton-cpp.dir/src/url.cpp.o
[ 75%] Building CXX object proton-c/bindings/cpp/CMakeFiles/qpid-proton-cpp.dir/src/uuid.cpp.o
[ 76%] Building CXX object proton-c/bindings/cpp/CMakeFiles/qpid-proton-cpp.dir/src/value.cpp.o
Linking CXX shared library libqpid-proton-cpp.so
[ 76%] Built target qpid-proton-cpp
Scanning dependencies of target codec_test
[ 76%] Building CXX object proton-c/bindings/cpp/CMakeFiles/codec_test.dir/src/codec_test.cpp.o
Linking CXX executable codec_test
[ 76%] Built target codec_test
Scanning dependencies of target container_test
[ 76%] Building CXX object proton-c/bindings/cpp/CMakeFiles/container_test.dir/src/container_test.cpp.o
Linking CXX executable container_test
[ 76%] Built target container_test
Scanning dependencies of target interop_test
[ 76%] Building CXX object proton-c/bindings/cpp/CMakeFiles/interop_test.dir/src/interop_test.cpp.o
Linking CXX executable interop_test
[ 76%] Built target interop_test
Scanning dependencies of target message_test
[ 77%] Building CXX object proton-c/bindings/cpp/CMakeFiles/message_test.dir/src/message_test.cpp.o
Linking CXX executable message_test
[ 77%] Built target message_test
Scanning dependencies of target scalar_test
[ 77%] Building CXX object proton-c/bindings/cpp/CMakeFiles/scalar_test.dir/src/scalar_test.cpp.o
Linking CXX executable scalar_test
[ 77%] Built target scalar_test
Scanning dependencies of target thread_safe_test
[ 77%] Building CXX object proton-c/bindings/cpp/CMakeFiles/thread_safe_test.dir/src/thread_safe_test.cpp.o
Linking CXX executable thread_safe_test
[ 77%] Built target thread_safe_test
Scanning dependencies of target url_test
[ 78%] Building CXX object proton-c/bindings/cpp/CMakeFiles/url_test.dir/src/url_test.cpp.o
Linking CXX executable url_test
[ 78%] Built target url_test
Scanning dependencies of target value_test
[ 79%] Building CXX object proton-c/bindings/cpp/CMakeFiles/value_test.dir/src/value_test.cpp.o
Linking CXX executable value_test
[ 79%] Built target value_test
Scanning dependencies of target reactor_send_cpp
[ 79%] Building CXX object tests/tools/apps/cpp/CMakeFiles/reactor_send_cpp.dir/reactor_send.cpp.o
Linking CXX executable reactor_send_cpp
[ 79%] Built target reactor_send_cpp
Scanning dependencies of target go-build
[ 79%] Built target go-build
[ 79%] Swig source
Scanning dependencies of target _cproton
[ 80%] Building C object proton-c/bindings/python/CMakeFiles/_cproton.dir/cprotonPYTHON_wrap.c.o
Linking C shared module _cproton.so
[ 80%] Built target _cproton
Scanning dependencies of target py_src_dist
[ 80%] Built target py_src_dist
[ 81%] Swig source
Scanning dependencies of target cproton_perl
[ 81%] Building C object proton-c/bindings/perl/CMakeFiles/cproton_perl.dir/perlPERL_wrap.c.o
Linking C shared module libcproton_perl.so
[ 81%] Built target cproton_perl
Scanning dependencies of target c-condition-tests
[ 82%] Building C object proton-c/src/tests/CMakeFiles/c-condition-tests.dir/condition.c.o
Linking C executable c-condition-tests
[ 82%] Built target c-condition-tests
Scanning dependencies of target c-data-tests
[ 82%] Building C object proton-c/src/tests/CMakeFiles/c-data-tests.dir/data.c.o
Linking C executable c-data-tests
[ 82%] Built target c-data-tests
Scanning dependencies of target c-engine-tests
[ 83%] Building C object proton-c/src/tests/CMakeFiles/c-engine-tests.dir/engine.c.o
Linking C executable c-engine-tests
[ 83%] Built target c-engine-tests
Scanning dependencies of target c-event-tests
[ 83%] Building C object proton-c/src/tests/CMakeFiles/c-event-tests.dir/event.c.o
Linking C executable c-event-tests
[ 83%] Built target c-event-tests
Scanning dependencies of target c-message-tests
[ 84%] Building C object proton-c/src/tests/CMakeFiles/c-message-tests.dir/message.c.o
Linking C executable c-message-tests
[ 84%] Built target c-message-tests
Scanning dependencies of target c-object-tests
[ 84%] Building C object proton-c/src/tests/CMakeFiles/c-object-tests.dir/object.c.o
Linking C executable c-object-tests
[ 84%] Built target c-object-tests
Scanning dependencies of target c-parse-url-tests
[ 85%] Building C object proton-c/src/tests/CMakeFiles/c-parse-url-tests.dir/parse-url.c.o
Linking C executable c-parse-url-tests
[ 85%] Built target c-parse-url-tests
Scanning dependencies of target c-reactor-tests
[ 85%] Building C object proton-c/src/tests/CMakeFiles/c-reactor-tests.dir/reactor.c.o
Linking C executable c-reactor-tests
[ 85%] Built target c-reactor-tests
Scanning dependencies of target c-refcount-tests
[ 86%] Building C object proton-c/src/tests/CMakeFiles/c-refcount-tests.dir/refcount.c.o
Linking C executable c-refcount-tests
[ 86%] Built target c-refcount-tests
Scanning dependencies of target recv
[ 86%] Building C object examples/c/messenger/CMakeFiles/recv.dir/recv.c.o
Linking C executable recv
[ 86%] Built target recv
Scanning dependencies of target recv-async
[ 87%] Building C object examples/c/messenger/CMakeFiles/recv-async.dir/recv-async.c.o
Linking C executable recv-async
[ 87%] Built target recv-async
Scanning dependencies of target send
[ 88%] Building C object examples/c/messenger/CMakeFiles/send.dir/send.c.o
Linking C executable send
[ 88%] Built target send
Scanning dependencies of target send-async
[ 89%] Building C object examples/c/messenger/CMakeFiles/send-async.dir/send-async.c.o
Linking C executable send-async
[ 89%] Built target send-async
Scanning dependencies of target receiver
[ 90%] Building C object examples/c/reactor/CMakeFiles/receiver.dir/receiver.c.o
Linking C executable receiver
[ 90%] Built target receiver
Scanning dependencies of target sender
[ 90%] Building C object examples/c/reactor/CMakeFiles/sender.dir/sender.c.o
Linking C executable sender
[ 90%] Built target sender
Scanning dependencies of target go_example_electron_broker
[ 90%] Built target go_example_electron_broker
Scanning dependencies of target go_example_electron_receive
[ 90%] Built target go_example_electron_receive
Scanning dependencies of target go_example_electron_send
[ 90%] Built target go_example_electron_send
Scanning dependencies of target go_example_proton_broker
[ 90%] Built target go_example_proton_broker
Scanning dependencies of target go_example_test
# testmain
runtime.raceinit: __tsan_init: not defined
runtime.raceinit: __tsan_map_shadow: not defined
runtime.racefini: __tsan_fini: not defined
runtime.racemapshadow: __tsan_map_shadow: not defined
runtime.racemalloc: __tsan_malloc: not defined
runtime.racegostart: __tsan_go_start: not defined
runtime.racegoend: __tsan_go_end: not defined
runtime.raceacquireg: __tsan_acquire: not defined
runtime.racereleaseg: __tsan_release: not defined
runtime.racereleasemergeg: __tsan_release_merge: not defined
runtime.racefingo: __tsan_finalizer_goroutine: not defined
runtime.RaceDisable: __tsan_go_ignore_sync_begin: not defined
runtime.RaceEnable: __tsan_go_ignore_sync_end: not defined
runtime.raceread: __tsan_read: not defined
runtime.racereadpc: __tsan_read_pc: not defined
runtime.racewrite: __tsan_write: not defined
runtime.racewritepc: __tsan_write_pc: not defined
runtime.racereadrange: __tsan_read_range: not defined
runtime.racereadrangepc1: __tsan_read_range: not defined
runtime.racewriterange: __tsan_write_range: not defined
runtime.racewriterangepc1: __tsan_write_range: not defined
/usr/lib/go/pkg/tool/linux_amd64/link: too many errors
make[2]: *** [examples/go/CMakeFiles/go_example_test] Error 2
make[1]: *** [examples/go/CMakeFiles/go_example_test.dir/all] Error 2
make: *** [all] Error 2
Build step 'Execute shell' marked build as failure
Recording test results
ERROR: Step ?Publish JUnit test result report? failed: No test report files were found. Configuration
error?


Mime
View raw message