qpid-notifications mailing list archives

Site index · List index
Message view « Date » · « Thread »
Top « Date » · « Thread »
From Apache Jenkins Server <jenk...@builds.apache.org>
Subject Build failed in Jenkins: Qpid-Java-JoramJMSTest » JDK 1.7 (latest),qpid-jms-client #928
Date Fri, 23 Dec 2016 11:24:49 GMT
See <https://builds.apache.org/job/Qpid-Java-JoramJMSTest/jdk=JDK%201.7%20(latest),qpid.joramtests=qpid-jms-client/928/>

------------------------------------------
Started by upstream project "Qpid-Java-JoramJMSTest" build number 928
originally caused by:
 Started by an SCM change
[EnvInject] - Loading node environment variables.
Building remotely on beam1 (beam) in workspace <https://builds.apache.org/job/Qpid-Java-JoramJMSTest/jdk=JDK%201.7%20(latest),qpid.joramtests=qpid-jms-client/ws/>
Checking out a fresh workspace because <https://builds.apache.org/job/Qpid-Java-JoramJMSTest/jdk=JDK%201.7%20(latest),qpid.joramtests=qpid-jms-client/ws/trunk>
doesn't exist
Cleaning local Directory trunk
Checking out http://svn.apache.org/repos/asf/qpid/java/trunk at revision '2016-12-23T11:24:16.742
+0000'
java.io.IOException: remote file operation failed: <https://builds.apache.org/job/Qpid-Java-JoramJMSTest/jdk=JDK%201.7%20(latest),qpid.joramtests=qpid-jms-client/ws/>
at hudson.remoting.Channel@7de23f37:beam1: java.io.IOException: Remote call on beam1 failed
	at hudson.FilePath.act(FilePath.java:1014)
	at hudson.FilePath.act(FilePath.java:996)
	at hudson.scm.SubversionSCM.checkout(SubversionSCM.java:897)
	at hudson.scm.SubversionSCM.checkout(SubversionSCM.java:833)
	at hudson.scm.SCM.checkout(SCM.java:485)
	at hudson.model.AbstractProject.checkout(AbstractProject.java:1269)
	at hudson.model.AbstractBuild$AbstractBuildExecution.defaultCheckout(AbstractBuild.java:604)
	at jenkins.scm.SCMCheckoutStrategy.checkout(SCMCheckoutStrategy.java:86)
	at hudson.model.AbstractBuild$AbstractBuildExecution.run(AbstractBuild.java:529)
	at hudson.model.Run.execute(Run.java:1741)
	at hudson.matrix.MatrixRun.run(MatrixRun.java:146)
	at hudson.model.ResourceController.execute(ResourceController.java:98)
	at hudson.model.Executor.run(Executor.java:410)
Caused by: java.io.IOException: Remote call on beam1 failed
	at hudson.remoting.Channel.call(Channel.java:789)
	at hudson.FilePath.act(FilePath.java:1007)
	... 12 more
Caused by: java.lang.NoClassDefFoundError: Could not initialize class org.tmatesoft.svn.core.internal.db.SVNSqlJetDb
	at org.tmatesoft.svn.core.internal.wc17.db.SVNWCDb.openDb(SVNWCDb.java:4857)
	at org.tmatesoft.svn.core.internal.wc17.db.SVNWCDb.parseDir(SVNWCDb.java:1930)
	at org.tmatesoft.svn.core.wc2.SvnOperationFactory.isVersionedDirectory(SvnOperationFactory.java:1486)
	at org.tmatesoft.svn.core.wc2.SvnOperationFactory.isVersionedDirectory(SvnOperationFactory.java:1464)
	at org.tmatesoft.svn.core.wc.SVNWCUtil.isVersionedDirectory(SVNWCUtil.java:296)
	at org.tmatesoft.svn.core.wc2.SvnOperationFactory.getImplementation(SvnOperationFactory.java:1302)
	at org.tmatesoft.svn.core.wc2.SvnOperationFactory.run(SvnOperationFactory.java:1224)
	at org.tmatesoft.svn.core.wc2.SvnOperation.run(SvnOperation.java:294)
	at hudson.scm.subversion.CheckoutUpdater$1.perform(CheckoutUpdater.java:119)
	at hudson.scm.subversion.WorkspaceUpdater$UpdateTask.delegateTo(WorkspaceUpdater.java:162)
	at hudson.scm.subversion.WorkspaceUpdater$UpdateTask.delegateTo(WorkspaceUpdater.java:170)
	at hudson.scm.subversion.UpdateUpdater$TaskImpl.perform(UpdateUpdater.java:134)
	at hudson.scm.subversion.WorkspaceUpdater$UpdateTask.delegateTo(WorkspaceUpdater.java:162)
	at hudson.scm.SubversionSCM$CheckOutTask.perform(SubversionSCM.java:996)
	at hudson.scm.SubversionSCM$CheckOutTask.invoke(SubversionSCM.java:972)
	at hudson.scm.SubversionSCM$CheckOutTask.invoke(SubversionSCM.java:948)
	at hudson.FilePath$FileCallableWrapper.call(FilePath.java:2772)
	at hudson.remoting.UserRequest.perform(UserRequest.java:153)
	at hudson.remoting.UserRequest.perform(UserRequest.java:50)
	at hudson.remoting.Request$2.run(Request.java:332)
	at hudson.remoting.InterceptingExecutorService$1.call(InterceptingExecutorService.java:68)
	at java.util.concurrent.FutureTask.run(FutureTask.java:262)
	at java.util.concurrent.ThreadPoolExecutor.runWorker(ThreadPoolExecutor.java:1145)
	at java.util.concurrent.ThreadPoolExecutor$Worker.run(ThreadPoolExecutor.java:615)
	at java.lang.Thread.run(Thread.java:745)
	at ......remote call to beam1(Native Method)
	at hudson.remoting.Channel.attachCallSiteStackTrace(Channel.java:1416)
	at hudson.remoting.UserResponse.retrieve(UserRequest.java:253)
	at hudson.remoting.Channel.call(Channel.java:781)
	... 13 more
Retrying after 10 seconds
Checking out a fresh workspace because <https://builds.apache.org/job/Qpid-Java-JoramJMSTest/jdk=JDK%201.7%20(latest),qpid.joramtests=qpid-jms-client/ws/trunk>
doesn't exist
Cleaning local Directory trunk
Checking out http://svn.apache.org/repos/asf/qpid/java/trunk at revision '2016-12-23T11:24:16.742
+0000'
java.io.IOException: remote file operation failed: <https://builds.apache.org/job/Qpid-Java-JoramJMSTest/jdk=JDK%201.7%20(latest),qpid.joramtests=qpid-jms-client/ws/>
at hudson.remoting.Channel@7de23f37:beam1: java.io.IOException: Remote call on beam1 failed
	at hudson.FilePath.act(FilePath.java:1014)
	at hudson.FilePath.act(FilePath.java:996)
	at hudson.scm.SubversionSCM.checkout(SubversionSCM.java:897)
	at hudson.scm.SubversionSCM.checkout(SubversionSCM.java:833)
	at hudson.scm.SCM.checkout(SCM.java:485)
	at hudson.model.AbstractProject.checkout(AbstractProject.java:1269)
	at hudson.model.AbstractBuild$AbstractBuildExecution.defaultCheckout(AbstractBuild.java:604)
	at jenkins.scm.SCMCheckoutStrategy.checkout(SCMCheckoutStrategy.java:86)
	at hudson.model.AbstractBuild$AbstractBuildExecution.run(AbstractBuild.java:529)
	at hudson.model.Run.execute(Run.java:1741)
	at hudson.matrix.MatrixRun.run(MatrixRun.java:146)
	at hudson.model.ResourceController.execute(ResourceController.java:98)
	at hudson.model.Executor.run(Executor.java:410)
Caused by: java.io.IOException: Remote call on beam1 failed
	at hudson.remoting.Channel.call(Channel.java:789)
	at hudson.FilePath.act(FilePath.java:1007)
	... 12 more
Caused by: java.lang.NoClassDefFoundError: Could not initialize class org.tmatesoft.svn.core.internal.db.SVNSqlJetDb
	at org.tmatesoft.svn.core.internal.wc17.db.SVNWCDb.openDb(SVNWCDb.java:4857)
	at org.tmatesoft.svn.core.internal.wc17.db.SVNWCDb.parseDir(SVNWCDb.java:1930)
	at org.tmatesoft.svn.core.wc2.SvnOperationFactory.isVersionedDirectory(SvnOperationFactory.java:1486)
	at org.tmatesoft.svn.core.wc2.SvnOperationFactory.isVersionedDirectory(SvnOperationFactory.java:1464)
	at org.tmatesoft.svn.core.wc.SVNWCUtil.isVersionedDirectory(SVNWCUtil.java:296)
	at org.tmatesoft.svn.core.wc2.SvnOperationFactory.getImplementation(SvnOperationFactory.java:1302)
	at org.tmatesoft.svn.core.wc2.SvnOperationFactory.run(SvnOperationFactory.java:1224)
	at org.tmatesoft.svn.core.wc2.SvnOperation.run(SvnOperation.java:294)
	at hudson.scm.subversion.CheckoutUpdater$1.perform(CheckoutUpdater.java:119)
	at hudson.scm.subversion.WorkspaceUpdater$UpdateTask.delegateTo(WorkspaceUpdater.java:162)
	at hudson.scm.subversion.WorkspaceUpdater$UpdateTask.delegateTo(WorkspaceUpdater.java:170)
	at hudson.scm.subversion.UpdateUpdater$TaskImpl.perform(UpdateUpdater.java:134)
	at hudson.scm.subversion.WorkspaceUpdater$UpdateTask.delegateTo(WorkspaceUpdater.java:162)
	at hudson.scm.SubversionSCM$CheckOutTask.perform(SubversionSCM.java:996)
	at hudson.scm.SubversionSCM$CheckOutTask.invoke(SubversionSCM.java:972)
	at hudson.scm.SubversionSCM$CheckOutTask.invoke(SubversionSCM.java:948)
	at hudson.FilePath$FileCallableWrapper.call(FilePath.java:2772)
	at hudson.remoting.UserRequest.perform(UserRequest.java:153)
	at hudson.remoting.UserRequest.perform(UserRequest.java:50)
	at hudson.remoting.Request$2.run(Request.java:332)
	at hudson.remoting.InterceptingExecutorService$1.call(InterceptingExecutorService.java:68)
	at java.util.concurrent.FutureTask.run(FutureTask.java:262)
	at java.util.concurrent.ThreadPoolExecutor.runWorker(ThreadPoolExecutor.java:1145)
	at java.util.concurrent.ThreadPoolExecutor$Worker.run(ThreadPoolExecutor.java:615)
	at java.lang.Thread.run(Thread.java:745)
	at ......remote call to beam1(Native Method)
	at hudson.remoting.Channel.attachCallSiteStackTrace(Channel.java:1416)
	at hudson.remoting.UserResponse.retrieve(UserRequest.java:253)
	at hudson.remoting.Channel.call(Channel.java:781)
	... 13 more
Retrying after 10 seconds
Checking out a fresh workspace because <https://builds.apache.org/job/Qpid-Java-JoramJMSTest/jdk=JDK%201.7%20(latest),qpid.joramtests=qpid-jms-client/ws/trunk>
doesn't exist
Cleaning local Directory trunk
Checking out http://svn.apache.org/repos/asf/qpid/java/trunk at revision '2016-12-23T11:24:16.742
+0000'
java.io.IOException: remote file operation failed: <https://builds.apache.org/job/Qpid-Java-JoramJMSTest/jdk=JDK%201.7%20(latest),qpid.joramtests=qpid-jms-client/ws/>
at hudson.remoting.Channel@7de23f37:beam1: java.io.IOException: Remote call on beam1 failed
	at hudson.FilePath.act(FilePath.java:1014)
	at hudson.FilePath.act(FilePath.java:996)
	at hudson.scm.SubversionSCM.checkout(SubversionSCM.java:897)
	at hudson.scm.SubversionSCM.checkout(SubversionSCM.java:833)
	at hudson.scm.SCM.checkout(SCM.java:485)
	at hudson.model.AbstractProject.checkout(AbstractProject.java:1269)
	at hudson.model.AbstractBuild$AbstractBuildExecution.defaultCheckout(AbstractBuild.java:604)
	at jenkins.scm.SCMCheckoutStrategy.checkout(SCMCheckoutStrategy.java:86)
	at hudson.model.AbstractBuild$AbstractBuildExecution.run(AbstractBuild.java:529)
	at hudson.model.Run.execute(Run.java:1741)
	at hudson.matrix.MatrixRun.run(MatrixRun.java:146)
	at hudson.model.ResourceController.execute(ResourceController.java:98)
	at hudson.model.Executor.run(Executor.java:410)
Caused by: java.io.IOException: Remote call on beam1 failed
	at hudson.remoting.Channel.call(Channel.java:789)
	at hudson.FilePath.act(FilePath.java:1007)
	... 12 more
Caused by: java.lang.NoClassDefFoundError: Could not initialize class org.tmatesoft.svn.core.internal.db.SVNSqlJetDb
	at org.tmatesoft.svn.core.internal.wc17.db.SVNWCDb.openDb(SVNWCDb.java:4857)
	at org.tmatesoft.svn.core.internal.wc17.db.SVNWCDb.parseDir(SVNWCDb.java:1930)
	at org.tmatesoft.svn.core.wc2.SvnOperationFactory.isVersionedDirectory(SvnOperationFactory.java:1486)
	at org.tmatesoft.svn.core.wc2.SvnOperationFactory.isVersionedDirectory(SvnOperationFactory.java:1464)
	at org.tmatesoft.svn.core.wc.SVNWCUtil.isVersionedDirectory(SVNWCUtil.java:296)
	at org.tmatesoft.svn.core.wc2.SvnOperationFactory.getImplementation(SvnOperationFactory.java:1302)
	at org.tmatesoft.svn.core.wc2.SvnOperationFactory.run(SvnOperationFactory.java:1224)
	at org.tmatesoft.svn.core.wc2.SvnOperation.run(SvnOperation.java:294)
	at hudson.scm.subversion.CheckoutUpdater$1.perform(CheckoutUpdater.java:119)
	at hudson.scm.subversion.WorkspaceUpdater$UpdateTask.delegateTo(WorkspaceUpdater.java:162)
	at hudson.scm.subversion.WorkspaceUpdater$UpdateTask.delegateTo(WorkspaceUpdater.java:170)
	at hudson.scm.subversion.UpdateUpdater$TaskImpl.perform(UpdateUpdater.java:134)
	at hudson.scm.subversion.WorkspaceUpdater$UpdateTask.delegateTo(WorkspaceUpdater.java:162)
	at hudson.scm.SubversionSCM$CheckOutTask.perform(SubversionSCM.java:996)
	at hudson.scm.SubversionSCM$CheckOutTask.invoke(SubversionSCM.java:972)
	at hudson.scm.SubversionSCM$CheckOutTask.invoke(SubversionSCM.java:948)
	at hudson.FilePath$FileCallableWrapper.call(FilePath.java:2772)
	at hudson.remoting.UserRequest.perform(UserRequest.java:153)
	at hudson.remoting.UserRequest.perform(UserRequest.java:50)
	at hudson.remoting.Request$2.run(Request.java:332)
	at hudson.remoting.InterceptingExecutorService$1.call(InterceptingExecutorService.java:68)
	at java.util.concurrent.FutureTask.run(FutureTask.java:262)
	at java.util.concurrent.ThreadPoolExecutor.runWorker(ThreadPoolExecutor.java:1145)
	at java.util.concurrent.ThreadPoolExecutor$Worker.run(ThreadPoolExecutor.java:615)
	at java.lang.Thread.run(Thread.java:745)
	at ......remote call to beam1(Native Method)
	at hudson.remoting.Channel.attachCallSiteStackTrace(Channel.java:1416)
	at hudson.remoting.UserResponse.retrieve(UserRequest.java:253)
	at hudson.remoting.Channel.call(Channel.java:781)
	... 13 more
Performing Post build task...
Match found for : : True
Logical operation result is TRUE
Running script  : #!/bin/bash -x

if [[ "${BROKER_PID}" ]]
then
  echo Killing broker "${BROKER_PID}"
  kill -15 "${BROKER_PID}"
fi
[qpid-jms-client] $ /bin/bash -x /tmp/hudson7264353355526497844.sh
+ [[ -n '' ]]
POST BUILD TASK : SUCCESS
END OF POST BUILD TASK : 0
Archiving artifacts
Recording test results
ERROR: Step ‘Publish JUnit test result report’ failed: No test report files were found.
Configuration error?


Mime
View raw message