qpid-notifications mailing list archives

Site index · List index
Message view « Date » · « Thread »
Top « Date » · « Thread »
From Apache Jenkins Server <jenk...@builds.apache.org>
Subject Build failed in Jenkins: Qpid-JMS-Checks #183
Date Tue, 13 Dec 2016 02:56:10 GMT
See <https://builds.apache.org/job/Qpid-JMS-Checks/183/changes>

Changes:

[tabish121] QPIDJMS-233 Update ActiveMQ dependency to 5.14.2

[tabish121] QPIDJMS-232 Perform authentication on transport connect

[robbie] QPIDJMS-234: set supported outcomes on transaction coordinator links,

[robbie] QPIDJMS-236: also advertise released and modified as supported outcomes

[tabish121] QPIDJMS-237 Close down connection resource more reliably on failure

[tabish121] QPIDJMS-237 Remove commented out block left in from last commit.

------------------------------------------
[...truncated 1150 lines...]
	at hudson.remoting.UserRequest.perform(UserRequest.java:153)
	at hudson.remoting.UserRequest.perform(UserRequest.java:50)
	at hudson.remoting.Request$2.run(Request.java:332)
	at hudson.remoting.InterceptingExecutorService$1.call(InterceptingExecutorService.java:68)
	at java.util.concurrent.FutureTask.run(FutureTask.java:266)
	at java.util.concurrent.ThreadPoolExecutor.runWorker(ThreadPoolExecutor.java:1142)
	at java.util.concurrent.ThreadPoolExecutor$Worker.run(ThreadPoolExecutor.java:617)
	at java.lang.Thread.run(Thread.java:745)
Caused by: org.apache.maven.plugin.MojoExecutionException: MavenReportException: Error while
creating archive: 
Exit code: 1 - <https://builds.apache.org/job/Qpid-JMS-Checks/ws/qpid-jms-client/src/main/java/org/apache/qpid/jms/JmsConnection.java>:256:
warning: no @throws for javax.jms.JMSException
    protected void shutdown() throws JMSException {
                   ^
<https://builds.apache.org/job/Qpid-JMS-Checks/ws/qpid-jms-client/src/main/java/org/apache/qpid/jms/JmsConnection.java>:263:
warning: no @param for cause
    protected void shutdown(Exception cause) throws JMSException {
                   ^
<https://builds.apache.org/job/Qpid-JMS-Checks/ws/qpid-jms-client/src/main/java/org/apache/qpid/jms/JmsConnection.java>:263:
warning: no @throws for javax.jms.JMSException
    protected void shutdown(Exception cause) throws JMSException {
                   ^
<https://builds.apache.org/job/Qpid-JMS-Checks/ws/qpid-jms-client/src/main/java/org/apache/qpid/jms/JmsConnection.java>:512:
warning: no @throws for javax.jms.JMSException
    protected TemporaryQueue createTemporaryQueue() throws JMSException {
                             ^
<https://builds.apache.org/job/Qpid-JMS-Checks/ws/qpid-jms-client/src/main/java/org/apache/qpid/jms/JmsConnection.java>:524:
warning: no @throws for javax.jms.JMSException
    protected TemporaryTopic createTemporaryTopic() throws JMSException {
                             ^
<https://builds.apache.org/job/Qpid-JMS-Checks/ws/qpid-jms-client/src/main/java/org/apache/qpid/jms/JmsMessageConsumer.java>:240:
warning: no @param for <T>
    public <T> T receiveBody(Class<T> desired, long timeout) throws JMSException
{
                 ^
<https://builds.apache.org/job/Qpid-JMS-Checks/ws/qpid-jms-client/src/main/java/org/apache/qpid/jms/JmsMessageConsumer.java>:702:
warning: no @throws for javax.jms.JMSException
    protected boolean performPullIfRequired(long timeout, boolean treatAsPullConsumer) throws
JMSException {
                      ^
<https://builds.apache.org/job/Qpid-JMS-Checks/ws/qpid-jms-client/src/main/java/org/apache/qpid/jms/JmsQueueBrowser.java>:36:
warning: empty <p> tag
 * <p>
   ^
<https://builds.apache.org/job/Qpid-JMS-Checks/ws/qpid-jms-client/src/main/java/org/apache/qpid/jms/JmsQueueBrowser.java>:42:
warning: empty <p> tag
 * <p>
   ^
<https://builds.apache.org/job/Qpid-JMS-Checks/ws/qpid-jms-client/src/main/java/org/apache/qpid/jms/JmsQueueBrowser.java>:47:
warning: empty <p> tag
 * <p>
   ^
<https://builds.apache.org/job/Qpid-JMS-Checks/ws/qpid-jms-client/src/main/java/org/apache/qpid/jms/jndi/JmsInitialContextFactory.java>:261:
warning: no @param for name
    protected Queue createQueue(String name) {
                    ^
<https://builds.apache.org/job/Qpid-JMS-Checks/ws/qpid-jms-client/src/main/java/org/apache/qpid/jms/jndi/JmsInitialContextFactory.java>:261:
warning: no @return
    protected Queue createQueue(String name) {
                    ^
<https://builds.apache.org/job/Qpid-JMS-Checks/ws/qpid-jms-client/src/main/java/org/apache/qpid/jms/jndi/JmsInitialContextFactory.java>:268:
warning: no @param for name
    protected Topic createTopic(String name) {
                    ^
<https://builds.apache.org/job/Qpid-JMS-Checks/ws/qpid-jms-client/src/main/java/org/apache/qpid/jms/jndi/JmsInitialContextFactory.java>:268:
warning: no @return
    protected Topic createTopic(String name) {
                    ^
<https://builds.apache.org/job/Qpid-JMS-Checks/ws/qpid-jms-client/src/main/java/org/apache/qpid/jms/jndi/JmsInitialContextFactory.java>:275:
warning: no @param for properties
    protected JmsConnectionFactory createConnectionFactory(Map<String, String> properties)
{
                                   ^
<https://builds.apache.org/job/Qpid-JMS-Checks/ws/qpid-jms-client/src/main/java/org/apache/qpid/jms/jndi/JmsInitialContextFactory.java>:275:
warning: no @return
    protected JmsConnectionFactory createConnectionFactory(Map<String, String> properties)
{
                                   ^
<https://builds.apache.org/job/Qpid-JMS-Checks/ws/qpid-jms-client/src/main/java/org/apache/qpid/jms/provider/amqp/AmqpSaslAuthenticator.java>:84:
error: @param name not found
     * @param authenticationRequest
              ^
<https://builds.apache.org/job/Qpid-JMS-Checks/ws/qpid-jms-client/src/main/java/org/apache/qpid/jms/provider/amqp/AmqpSaslAuthenticator.java>:89:
warning: no @throws for javax.jms.JMSSecurityException
    public boolean authenticate() throws JMSSecurityException {
                   ^
<https://builds.apache.org/job/Qpid-JMS-Checks/ws/qpid-jms-client/src/main/java/org/apache/qpid/jms/provider/amqp/AmqpSaslAuthenticator.java>:57:
warning: no @param for request
    public AmqpSaslAuthenticator(AsyncResult request, Sasl sasl, JmsConnectionInfo info, Principal
localPrincipal, String[] mechanismsRestriction) {
           ^
<https://builds.apache.org/job/Qpid-JMS-Checks/ws/qpid-jms-client/src/main/java/org/apache/qpid/jms/provider/amqp/builders/AmqpResourceBuilder.java>:206:
warning: no @param for resourceInfo
    protected abstract ENDPOINT createEndpoint(INFO resourceInfo);
                                ^
<https://builds.apache.org/job/Qpid-JMS-Checks/ws/qpid-jms-client/src/main/java/org/apache/qpid/jms/selector/filter/BooleanExpression.java>:26:
warning: no description for @param
     * @param message
       ^
<https://builds.apache.org/job/Qpid-JMS-Checks/ws/qpid-jms-client/src/main/java/org/apache/qpid/jms/selector/filter/BooleanExpression.java>:28:
warning: no description for @throws
     * @throws FilterException
       ^
<https://builds.apache.org/job/Qpid-JMS-Checks/ws/qpid-jms-client/src/main/java/org/apache/qpid/jms/selector/filter/Filterable.java>:29:
warning: no description for @param
     * @param <T>
       ^
<https://builds.apache.org/job/Qpid-JMS-Checks/ws/qpid-jms-client/src/main/java/org/apache/qpid/jms/selector/filter/Filterable.java>:30:
warning: no description for @param
     * @param type
       ^
<https://builds.apache.org/job/Qpid-JMS-Checks/ws/qpid-jms-client/src/main/java/org/apache/qpid/jms/selector/filter/Filterable.java>:32:
warning: no description for @throws
     * @throws FilterException
       ^
<https://builds.apache.org/job/Qpid-JMS-Checks/ws/qpid-jms-client/src/main/java/org/apache/qpid/jms/selector/filter/Filterable.java>:39:
warning: no description for @param
     * @param name
       ^
<https://builds.apache.org/job/Qpid-JMS-Checks/ws/qpid-jms-client/src/main/java/org/apache/qpid/jms/selector/parser/TokenMgrError.java>:62:
warning: no @param for str
    protected static final String addEscapes(String str) {
                                  ^
<https://builds.apache.org/job/Qpid-JMS-Checks/ws/qpid-jms-client/src/main/java/org/apache/qpid/jms/selector/parser/TokenMgrError.java>:62:
warning: no @return
    protected static final String addEscapes(String str) {
                                  ^
<https://builds.apache.org/job/Qpid-JMS-Checks/ws/qpid-jms-client/src/main/java/org/apache/qpid/jms/selector/parser/TokenMgrError.java>:112:
warning: no @param for EOFSeen
    protected static String LexicalError(boolean EOFSeen, int lexState, int errorLine, int
errorColumn, String errorAfter, char curChar) {
                            ^
<https://builds.apache.org/job/Qpid-JMS-Checks/ws/qpid-jms-client/src/main/java/org/apache/qpid/jms/selector/parser/TokenMgrError.java>:112:
warning: no @param for lexState
    protected static String LexicalError(boolean EOFSeen, int lexState, int errorLine, int
errorColumn, String errorAfter, char curChar) {
                            ^
<https://builds.apache.org/job/Qpid-JMS-Checks/ws/qpid-jms-client/src/main/java/org/apache/qpid/jms/selector/parser/TokenMgrError.java>:112:
warning: no @param for errorLine
    protected static String LexicalError(boolean EOFSeen, int lexState, int errorLine, int
errorColumn, String errorAfter, char curChar) {
                            ^
<https://builds.apache.org/job/Qpid-JMS-Checks/ws/qpid-jms-client/src/main/java/org/apache/qpid/jms/selector/parser/TokenMgrError.java>:112:
warning: no @param for errorColumn
    protected static String LexicalError(boolean EOFSeen, int lexState, int errorLine, int
errorColumn, String errorAfter, char curChar) {
                            ^
<https://builds.apache.org/job/Qpid-JMS-Checks/ws/qpid-jms-client/src/main/java/org/apache/qpid/jms/selector/parser/TokenMgrError.java>:112:
warning: no @param for errorAfter
    protected static String LexicalError(boolean EOFSeen, int lexState, int errorLine, int
errorColumn, String errorAfter, char curChar) {
                            ^
<https://builds.apache.org/job/Qpid-JMS-Checks/ws/qpid-jms-client/src/main/java/org/apache/qpid/jms/selector/parser/TokenMgrError.java>:112:
warning: no @param for curChar
    protected static String LexicalError(boolean EOFSeen, int lexState, int errorLine, int
errorColumn, String errorAfter, char curChar) {
                            ^
<https://builds.apache.org/job/Qpid-JMS-Checks/ws/qpid-jms-client/src/main/java/org/apache/qpid/jms/selector/parser/TokenMgrError.java>:112:
warning: no @return
    protected static String LexicalError(boolean EOFSeen, int lexState, int errorLine, int
errorColumn, String errorAfter, char curChar) {
                            ^

Command line was: /usr/local/asfpackages/java/jdk1.8.0_102/jre/../bin/javadoc @options @packages

Refer to the generated Javadoc files in '<https://builds.apache.org/job/Qpid-JMS-Checks/ws/qpid-jms-client/target/apidocs'>
dir.

	at org.apache.maven.plugin.javadoc.AbstractJavadocMojo.failOnError(AbstractJavadocMojo.java:5913)
	at org.apache.maven.plugin.javadoc.JavadocJar.execute(JavadocJar.java:209)
	at org.apache.maven.plugin.DefaultBuildPluginManager.executeMojo(DefaultBuildPluginManager.java:134)
	at org.apache.maven.lifecycle.internal.MojoExecutor.execute(MojoExecutor.java:207)
	... 31 more
Caused by: org.apache.maven.reporting.MavenReportException: 
Exit code: 1 - <https://builds.apache.org/job/Qpid-JMS-Checks/ws/qpid-jms-client/src/main/java/org/apache/qpid/jms/JmsConnection.java>:256:
warning: no @throws for javax.jms.JMSException
    protected void shutdown() throws JMSException {
                   ^
<https://builds.apache.org/job/Qpid-JMS-Checks/ws/qpid-jms-client/src/main/java/org/apache/qpid/jms/JmsConnection.java>:263:
warning: no @param for cause
    protected void shutdown(Exception cause) throws JMSException {
                   ^
<https://builds.apache.org/job/Qpid-JMS-Checks/ws/qpid-jms-client/src/main/java/org/apache/qpid/jms/JmsConnection.java>:263:
warning: no @throws for javax.jms.JMSException
    protected void shutdown(Exception cause) throws JMSException {
                   ^
<https://builds.apache.org/job/Qpid-JMS-Checks/ws/qpid-jms-client/src/main/java/org/apache/qpid/jms/JmsConnection.java>:512:
warning: no @throws for javax.jms.JMSException
    protected TemporaryQueue createTemporaryQueue() throws JMSException {
                             ^
<https://builds.apache.org/job/Qpid-JMS-Checks/ws/qpid-jms-client/src/main/java/org/apache/qpid/jms/JmsConnection.java>:524:
warning: no @throws for javax.jms.JMSException
    protected TemporaryTopic createTemporaryTopic() throws JMSException {
                             ^
<https://builds.apache.org/job/Qpid-JMS-Checks/ws/qpid-jms-client/src/main/java/org/apache/qpid/jms/JmsMessageConsumer.java>:240:
warning: no @param for <T>
    public <T> T receiveBody(Class<T> desired, long timeout) throws JMSException
{
                 ^
<https://builds.apache.org/job/Qpid-JMS-Checks/ws/qpid-jms-client/src/main/java/org/apache/qpid/jms/JmsMessageConsumer.java>:702:
warning: no @throws for javax.jms.JMSException
    protected boolean performPullIfRequired(long timeout, boolean treatAsPullConsumer) throws
JMSException {
                      ^
<https://builds.apache.org/job/Qpid-JMS-Checks/ws/qpid-jms-client/src/main/java/org/apache/qpid/jms/JmsQueueBrowser.java>:36:
warning: empty <p> tag
 * <p>
   ^
<https://builds.apache.org/job/Qpid-JMS-Checks/ws/qpid-jms-client/src/main/java/org/apache/qpid/jms/JmsQueueBrowser.java>:42:
warning: empty <p> tag
 * <p>
   ^
<https://builds.apache.org/job/Qpid-JMS-Checks/ws/qpid-jms-client/src/main/java/org/apache/qpid/jms/JmsQueueBrowser.java>:47:
warning: empty <p> tag
 * <p>
   ^
<https://builds.apache.org/job/Qpid-JMS-Checks/ws/qpid-jms-client/src/main/java/org/apache/qpid/jms/jndi/JmsInitialContextFactory.java>:261:
warning: no @param for name
    protected Queue createQueue(String name) {
                    ^
<https://builds.apache.org/job/Qpid-JMS-Checks/ws/qpid-jms-client/src/main/java/org/apache/qpid/jms/jndi/JmsInitialContextFactory.java>:261:
warning: no @return
    protected Queue createQueue(String name) {
                    ^
<https://builds.apache.org/job/Qpid-JMS-Checks/ws/qpid-jms-client/src/main/java/org/apache/qpid/jms/jndi/JmsInitialContextFactory.java>:268:
warning: no @param for name
    protected Topic createTopic(String name) {
                    ^
<https://builds.apache.org/job/Qpid-JMS-Checks/ws/qpid-jms-client/src/main/java/org/apache/qpid/jms/jndi/JmsInitialContextFactory.java>:268:
warning: no @return
    protected Topic createTopic(String name) {
                    ^
<https://builds.apache.org/job/Qpid-JMS-Checks/ws/qpid-jms-client/src/main/java/org/apache/qpid/jms/jndi/JmsInitialContextFactory.java>:275:
warning: no @param for properties
    protected JmsConnectionFactory createConnectionFactory(Map<String, String> properties)
{
                                   ^
<https://builds.apache.org/job/Qpid-JMS-Checks/ws/qpid-jms-client/src/main/java/org/apache/qpid/jms/jndi/JmsInitialContextFactory.java>:275:
warning: no @return
    protected JmsConnectionFactory createConnectionFactory(Map<String, String> properties)
{
                                   ^
<https://builds.apache.org/job/Qpid-JMS-Checks/ws/qpid-jms-client/src/main/java/org/apache/qpid/jms/provider/amqp/AmqpSaslAuthenticator.java>:84:
error: @param name not found
     * @param authenticationRequest
              ^
<https://builds.apache.org/job/Qpid-JMS-Checks/ws/qpid-jms-client/src/main/java/org/apache/qpid/jms/provider/amqp/AmqpSaslAuthenticator.java>:89:
warning: no @throws for javax.jms.JMSSecurityException
    public boolean authenticate() throws JMSSecurityException {
                   ^
<https://builds.apache.org/job/Qpid-JMS-Checks/ws/qpid-jms-client/src/main/java/org/apache/qpid/jms/provider/amqp/AmqpSaslAuthenticator.java>:57:
warning: no @param for request
    public AmqpSaslAuthenticator(AsyncResult request, Sasl sasl, JmsConnectionInfo info, Principal
localPrincipal, String[] mechanismsRestriction) {
           ^
<https://builds.apache.org/job/Qpid-JMS-Checks/ws/qpid-jms-client/src/main/java/org/apache/qpid/jms/provider/amqp/builders/AmqpResourceBuilder.java>:206:
warning: no @param for resourceInfo
    protected abstract ENDPOINT createEndpoint(INFO resourceInfo);
                                ^
<https://builds.apache.org/job/Qpid-JMS-Checks/ws/qpid-jms-client/src/main/java/org/apache/qpid/jms/selector/filter/BooleanExpression.java>:26:
warning: no description for @param
     * @param message
       ^
<https://builds.apache.org/job/Qpid-JMS-Checks/ws/qpid-jms-client/src/main/java/org/apache/qpid/jms/selector/filter/BooleanExpression.java>:28:
warning: no description for @throws
     * @throws FilterException
       ^
<https://builds.apache.org/job/Qpid-JMS-Checks/ws/qpid-jms-client/src/main/java/org/apache/qpid/jms/selector/filter/Filterable.java>:29:
warning: no description for @param
     * @param <T>
       ^
<https://builds.apache.org/job/Qpid-JMS-Checks/ws/qpid-jms-client/src/main/java/org/apache/qpid/jms/selector/filter/Filterable.java>:30:
warning: no description for @param
     * @param type
       ^
<https://builds.apache.org/job/Qpid-JMS-Checks/ws/qpid-jms-client/src/main/java/org/apache/qpid/jms/selector/filter/Filterable.java>:32:
warning: no description for @throws
     * @throws FilterException
       ^
<https://builds.apache.org/job/Qpid-JMS-Checks/ws/qpid-jms-client/src/main/java/org/apache/qpid/jms/selector/filter/Filterable.java>:39:
warning: no description for @param
     * @param name
       ^
<https://builds.apache.org/job/Qpid-JMS-Checks/ws/qpid-jms-client/src/main/java/org/apache/qpid/jms/selector/parser/TokenMgrError.java>:62:
warning: no @param for str
    protected static final String addEscapes(String str) {
                                  ^
<https://builds.apache.org/job/Qpid-JMS-Checks/ws/qpid-jms-client/src/main/java/org/apache/qpid/jms/selector/parser/TokenMgrError.java>:62:
warning: no @return
    protected static final String addEscapes(String str) {
                                  ^
<https://builds.apache.org/job/Qpid-JMS-Checks/ws/qpid-jms-client/src/main/java/org/apache/qpid/jms/selector/parser/TokenMgrError.java>:112:
warning: no @param for EOFSeen
    protected static String LexicalError(boolean EOFSeen, int lexState, int errorLine, int
errorColumn, String errorAfter, char curChar) {
                            ^
<https://builds.apache.org/job/Qpid-JMS-Checks/ws/qpid-jms-client/src/main/java/org/apache/qpid/jms/selector/parser/TokenMgrError.java>:112:
warning: no @param for lexState
    protected static String LexicalError(boolean EOFSeen, int lexState, int errorLine, int
errorColumn, String errorAfter, char curChar) {
                            ^
<https://builds.apache.org/job/Qpid-JMS-Checks/ws/qpid-jms-client/src/main/java/org/apache/qpid/jms/selector/parser/TokenMgrError.java>:112:
warning: no @param for errorLine
    protected static String LexicalError(boolean EOFSeen, int lexState, int errorLine, int
errorColumn, String errorAfter, char curChar) {
                            ^
<https://builds.apache.org/job/Qpid-JMS-Checks/ws/qpid-jms-client/src/main/java/org/apache/qpid/jms/selector/parser/TokenMgrError.java>:112:
warning: no @param for errorColumn
    protected static String LexicalError(boolean EOFSeen, int lexState, int errorLine, int
errorColumn, String errorAfter, char curChar) {
                            ^
<https://builds.apache.org/job/Qpid-JMS-Checks/ws/qpid-jms-client/src/main/java/org/apache/qpid/jms/selector/parser/TokenMgrError.java>:112:
warning: no @param for errorAfter
    protected static String LexicalError(boolean EOFSeen, int lexState, int errorLine, int
errorColumn, String errorAfter, char curChar) {
                            ^
<https://builds.apache.org/job/Qpid-JMS-Checks/ws/qpid-jms-client/src/main/java/org/apache/qpid/jms/selector/parser/TokenMgrError.java>:112:
warning: no @param for curChar
    protected static String LexicalError(boolean EOFSeen, int lexState, int errorLine, int
errorColumn, String errorAfter, char curChar) {
                            ^
<https://builds.apache.org/job/Qpid-JMS-Checks/ws/qpid-jms-client/src/main/java/org/apache/qpid/jms/selector/parser/TokenMgrError.java>:112:
warning: no @return
    protected static String LexicalError(boolean EOFSeen, int lexState, int errorLine, int
errorColumn, String errorAfter, char curChar) {
                            ^

Command line was: /usr/local/asfpackages/java/jdk1.8.0_102/jre/../bin/javadoc @options @packages

Refer to the generated Javadoc files in '<https://builds.apache.org/job/Qpid-JMS-Checks/ws/qpid-jms-client/target/apidocs'>
dir.

	at org.apache.maven.plugin.javadoc.AbstractJavadocMojo.executeJavadocCommandLine(AbstractJavadocMojo.java:5074)
	at org.apache.maven.plugin.javadoc.AbstractJavadocMojo.executeReport(AbstractJavadocMojo.java:1999)
	at org.apache.maven.plugin.javadoc.JavadocJar.execute(JavadocJar.java:181)
	... 33 more
[ERROR] 
[ERROR] Re-run Maven using the -X switch to enable full debug logging.
[ERROR] 
[ERROR] For more information about the errors and possible solutions, please read the following
articles:
[ERROR] [Help 1] http://cwiki.apache.org/confluence/display/MAVEN/MojoExecutionException
[ERROR] 
[ERROR] After correcting the problems, you can resume the build with the command
[ERROR]   mvn <goals> -rf :qpid-jms-client
channel stopped
Archiving artifacts

Mime
View raw message