qpid-notifications mailing list archives

Site index · List index
Message view « Date » · « Thread »
Top « Date » · « Thread »
From Apache Jenkins Server <jenk...@builds.apache.org>
Subject Build failed in Jenkins: Qpid-Java-Checks #183
Date Fri, 30 Dec 2016 10:34:20 GMT
See <https://builds.apache.org/job/Qpid-Java-Checks/183/>

------------------------------------------
[...truncated 10749 lines...]
[INFO] Apache Qpid BDB Message Store Broker Plug-in ....... SUCCESS [ 12.563 s]
[INFO] Apache Qpid Broker for Java ........................ FAILURE [  7.072 s]
[INFO] Apache Qpid Client for AMQP 0-9-1/0-10 Examples .... SUCCESS [  5.447 s]
[INFO] Apache Qpid JCA .................................... SUCCESS [  7.591 s]
[INFO] Apache Qpid Resource Adaptor ....................... SUCCESS [  5.470 s]
[INFO] Apache Qpid Tools .................................. SUCCESS [  6.501 s]
[INFO] Apache Qpid System Test Parent ..................... FAILURE [  5.238 s]
[INFO] Apache Qpid System Tests ........................... SKIPPED
[INFO] Apache Qpid Performance Tests ...................... FAILURE [  3.850 s]
[INFO] Apache Qpid Performance Test System Tests .......... SKIPPED
[INFO] Apache Qpid Performance Tests Visualisation JFC .... SKIPPED
[INFO] Apache Qpid BDB Store System Tests ................. SKIPPED
[INFO] Apache Qpid Joram JMS Tests ........................ SUCCESS [  5.984 s]
[INFO] Apache Qpid JMS TCK Configuration .................. SUCCESS [  9.619 s]
[INFO] Apache Qpid for Java Docbook ....................... SUCCESS [  3.357 s]
[INFO] Apache Qpid Broker for Java Docbook ................ SUCCESS [  4.971 s]
[INFO] Apache Qpid JMS Client for AMQP 0-8, 0-9 and 0-9-1 Docbook SUCCESS [  4.299 s]
[INFO] Apache Qpid JMS Client for AMQP 0-10 Docbook ....... SUCCESS [  4.187 s]
[INFO] Apache Qpid Performance Test Docbook ............... SUCCESS [  4.427 s]
[INFO] ------------------------------------------------------------------------
[INFO] BUILD FAILURE
[INFO] ------------------------------------------------------------------------
[INFO] Total time: 07:07 min
[INFO] Finished at: 2016-12-30T10:34:08+00:00
[INFO] Final Memory: 137M/1335M
[INFO] ------------------------------------------------------------------------
[ERROR] Failed to execute goal org.apache.maven.plugins:maven-antrun-plugin:1.7:run (dependency-change-verification)
on project qpid-broker: An Ant BuildException has occured: Generated dependency info does
not match the reference. Ensure LICENCE and NOTICE files are correct and then update the reference
by running again with -Dupdate-dependency-reference. Generated file: '<https://builds.apache.org/job/Qpid-Java-Checks/ws/broker/target/dependency-change-verification/PROCESSED_DEPENDENCIES_INFO'.>
Reference file: '<https://builds.apache.org/job/Qpid-Java-Checks/ws/broker/src/main/assembly/dependency-verification/DEPENDENCIES_REFERENCE'.>
[ERROR] around Ant part ...<fail message="Generated dependency info does not match the
reference. Ensure LICENCE and NOTICE files are correct and then update the reference by running
again with -Dupdate-dependency-reference. Generated file: &apos;${dependency-verification-output-file}&apos;.
Reference file: &apos;<https://builds.apache.org/job/Qpid-Java-Checks/ws/broker/src/main/assembly/dependency-verification/DEPENDENCIES_REFERENCE&apos;.">...>
@ 48:426 in <https://builds.apache.org/job/Qpid-Java-Checks/ws/broker/target/antrun/build-main.xml>
[ERROR] -> [Help 1]
org.apache.maven.lifecycle.LifecycleExecutionException: Failed to execute goal org.apache.maven.plugins:maven-antrun-plugin:1.7:run
(dependency-change-verification) on project qpid-broker: An Ant BuildException has occured:
Generated dependency info does not match the reference. Ensure LICENCE and NOTICE files are
correct and then update the reference by running again with -Dupdate-dependency-reference.
Generated file: '<https://builds.apache.org/job/Qpid-Java-Checks/ws/broker/target/dependency-change-verification/PROCESSED_DEPENDENCIES_INFO'.>
Reference file: '<https://builds.apache.org/job/Qpid-Java-Checks/ws/broker/src/main/assembly/dependency-verification/DEPENDENCIES_REFERENCE'.>
around Ant part ...<fail message="Generated dependency info does not match the reference.
Ensure LICENCE and NOTICE files are correct and then update the reference by running again
with -Dupdate-dependency-reference. Generated file: &apos;${dependency-verification-output-file}&apos;.
Reference file: &apos;<https://builds.apache.org/job/Qpid-Java-Checks/ws/broker/src/main/assembly/dependency-verification/DEPENDENCIES_REFERENCE&apos;.">...>
@ 48:426 in <https://builds.apache.org/job/Qpid-Java-Checks/ws/broker/target/antrun/build-main.xml>
	at org.apache.maven.lifecycle.internal.MojoExecutor.execute(MojoExecutor.java:212)
	at org.apache.maven.lifecycle.internal.MojoExecutor.execute(MojoExecutor.java:153)
	at org.apache.maven.lifecycle.internal.MojoExecutor.execute(MojoExecutor.java:145)
	at org.apache.maven.lifecycle.internal.LifecycleModuleBuilder.buildProject(LifecycleModuleBuilder.java:116)
	at org.apache.maven.lifecycle.internal.LifecycleModuleBuilder.buildProject(LifecycleModuleBuilder.java:80)
	at org.apache.maven.lifecycle.internal.builder.singlethreaded.SingleThreadedBuilder.build(SingleThreadedBuilder.java:51)
	at org.apache.maven.lifecycle.internal.LifecycleStarter.execute(LifecycleStarter.java:128)
	at org.apache.maven.DefaultMaven.doExecute(DefaultMaven.java:307)
	at org.apache.maven.DefaultMaven.doExecute(DefaultMaven.java:193)
	at org.apache.maven.DefaultMaven.execute(DefaultMaven.java:106)
	at org.jvnet.hudson.maven3.launcher.Maven32Launcher.main(Maven32Launcher.java:132)
	at sun.reflect.NativeMethodAccessorImpl.invoke0(Native Method)
	at sun.reflect.NativeMethodAccessorImpl.invoke(NativeMethodAccessorImpl.java:62)
	at sun.reflect.DelegatingMethodAccessorImpl.invoke(DelegatingMethodAccessorImpl.java:43)
	at java.lang.reflect.Method.invoke(Method.java:498)
	at org.codehaus.plexus.classworlds.launcher.Launcher.launchStandard(Launcher.java:330)
	at org.codehaus.plexus.classworlds.launcher.Launcher.launch(Launcher.java:238)
	at jenkins.maven3.agent.Maven32Main.launch(Maven32Main.java:186)
	at sun.reflect.NativeMethodAccessorImpl.invoke0(Native Method)
	at sun.reflect.NativeMethodAccessorImpl.invoke(NativeMethodAccessorImpl.java:62)
	at sun.reflect.DelegatingMethodAccessorImpl.invoke(DelegatingMethodAccessorImpl.java:43)
	at java.lang.reflect.Method.invoke(Method.java:498)
	at hudson.maven.Maven3Builder.call(Maven3Builder.java:136)
	at hudson.maven.Maven3Builder.call(Maven3Builder.java:71)
	at hudson.remoting.UserRequest.perform(UserRequest.java:153)
	at hudson.remoting.UserRequest.perform(UserRequest.java:50)
	at hudson.remoting.Request$2.run(Request.java:332)
	at hudson.remoting.InterceptingExecutorService$1.call(InterceptingExecutorService.java:68)
	at java.util.concurrent.FutureTask.run(FutureTask.java:266)
	at java.util.concurrent.ThreadPoolExecutor.runWorker(ThreadPoolExecutor.java:1142)
	at java.util.concurrent.ThreadPoolExecutor$Worker.run(ThreadPoolExecutor.java:617)
	at java.lang.Thread.run(Thread.java:745)
Caused by: org.apache.maven.plugin.MojoExecutionException: An Ant BuildException has occured:
Generated dependency info does not match the reference. Ensure LICENCE and NOTICE files are
correct and then update the reference by running again with -Dupdate-dependency-reference.
Generated file: '<https://builds.apache.org/job/Qpid-Java-Checks/ws/broker/target/dependency-change-verification/PROCESSED_DEPENDENCIES_INFO'.>
Reference file: '<https://builds.apache.org/job/Qpid-Java-Checks/ws/broker/src/main/assembly/dependency-verification/DEPENDENCIES_REFERENCE'.>
around Ant part ...<fail message="Generated dependency info does not match the reference.
Ensure LICENCE and NOTICE files are correct and then update the reference by running again
with -Dupdate-dependency-reference. Generated file: &apos;${dependency-verification-output-file}&apos;.
Reference file: &apos;<https://builds.apache.org/job/Qpid-Java-Checks/ws/broker/src/main/assembly/dependency-verification/DEPENDENCIES_REFERENCE&apos;.">...>
@ 48:426 in <https://builds.apache.org/job/Qpid-Java-Checks/ws/broker/target/antrun/build-main.xml>
	at org.apache.maven.plugin.antrun.AntRunMojo.execute(AntRunMojo.java:355)
	at org.apache.maven.plugin.DefaultBuildPluginManager.executeMojo(DefaultBuildPluginManager.java:134)
	at org.apache.maven.lifecycle.internal.MojoExecutor.execute(MojoExecutor.java:207)
	... 31 more
Caused by: <https://builds.apache.org/job/Qpid-Java-Checks/ws/broker/target/antrun/build-main.xml>:48:
Generated dependency info does not match the reference. Ensure LICENCE and NOTICE files are
correct and then update the reference by running again with -Dupdate-dependency-reference.
Generated file: '<https://builds.apache.org/job/Qpid-Java-Checks/ws/broker/target/dependency-change-verification/PROCESSED_DEPENDENCIES_INFO'.>
Reference file: '<https://builds.apache.org/job/Qpid-Java-Checks/ws/broker/src/main/assembly/dependency-verification/DEPENDENCIES_REFERENCE'.>
	at org.apache.tools.ant.taskdefs.Exit.execute(Exit.java:164)
	at org.apache.tools.ant.UnknownElement.execute(UnknownElement.java:291)
	at sun.reflect.GeneratedMethodAccessor34.invoke(Unknown Source)
	at sun.reflect.DelegatingMethodAccessorImpl.invoke(DelegatingMethodAccessorImpl.java:43)
	at java.lang.reflect.Method.invoke(Method.java:498)
	at org.apache.tools.ant.dispatch.DispatchUtils.execute(DispatchUtils.java:106)
	at org.apache.tools.ant.Task.perform(Task.java:348)
	at org.apache.tools.ant.Target.execute(Target.java:390)
	at org.apache.tools.ant.Target.performTasks(Target.java:411)
	at org.apache.tools.ant.Project.executeSortedTargets(Project.java:1399)
	at org.apache.tools.ant.Project.executeTarget(Project.java:1368)
	at org.apache.maven.plugin.antrun.AntRunMojo.execute(AntRunMojo.java:327)
	... 33 more
[ERROR] Failed to execute goal org.apache.maven.plugins:maven-dependency-plugin:2.8:unpack
(extract-broker-distribution) on project qpid-systests-parent: Unable to find artifact. Could
not find artifact org.apache.qpid:qpid-broker:tar.gz:bin:7.0.0-SNAPSHOT in Nexus (http://repository.apache.org/snapshots)
[ERROR] 
[ERROR] Try downloading the file manually from the project website.
[ERROR] 
[ERROR] Then, install it using the command:
[ERROR] mvn install:install-file -DgroupId=org.apache.qpid -DartifactId=qpid-broker -Dversion=7.0.0-SNAPSHOT
-Dclassifier=bin -Dpackaging=tar.gz -Dfile=/path/to/file
[ERROR] 
[ERROR] Alternatively, if you host your own repository you can deploy the file there:
[ERROR] mvn deploy:deploy-file -DgroupId=org.apache.qpid -DartifactId=qpid-broker -Dversion=7.0.0-SNAPSHOT
-Dclassifier=bin -Dpackaging=tar.gz -Dfile=/path/to/file -Durl=[url] -DrepositoryId=[id]
[ERROR] 
[ERROR] 
[ERROR] org.apache.qpid:qpid-broker:tar.gz:7.0.0-SNAPSHOT
[ERROR] 
[ERROR] from the specified remote repositories:
[ERROR] oracle.releases (http://download.oracle.com/maven, releases=true, snapshots=false),
[ERROR] Nexus (http://repository.apache.org/snapshots, releases=false, snapshots=true),
[ERROR] central (https://repo.maven.apache.org/maven2, releases=true, snapshots=false)
[ERROR] -> [Help 1]
org.apache.maven.lifecycle.LifecycleExecutionException: Failed to execute goal org.apache.maven.plugins:maven-dependency-plugin:2.8:unpack
(extract-broker-distribution) on project qpid-systests-parent: Unable to find artifact.
	at org.apache.maven.lifecycle.internal.MojoExecutor.execute(MojoExecutor.java:212)
	at org.apache.maven.lifecycle.internal.MojoExecutor.execute(MojoExecutor.java:153)
	at org.apache.maven.lifecycle.internal.MojoExecutor.execute(MojoExecutor.java:145)
	at org.apache.maven.lifecycle.internal.LifecycleModuleBuilder.buildProject(LifecycleModuleBuilder.java:116)
	at org.apache.maven.lifecycle.internal.LifecycleModuleBuilder.buildProject(LifecycleModuleBuilder.java:80)
	at org.apache.maven.lifecycle.internal.builder.singlethreaded.SingleThreadedBuilder.build(SingleThreadedBuilder.java:51)
	at org.apache.maven.lifecycle.internal.LifecycleStarter.execute(LifecycleStarter.java:128)
	at org.apache.maven.DefaultMaven.doExecute(DefaultMaven.java:307)
	at org.apache.maven.DefaultMaven.doExecute(DefaultMaven.java:193)
	at org.apache.maven.DefaultMaven.execute(DefaultMaven.java:106)
	at org.jvnet.hudson.maven3.launcher.Maven32Launcher.main(Maven32Launcher.java:132)
	at sun.reflect.NativeMethodAccessorImpl.invoke0(Native Method)
	at sun.reflect.NativeMethodAccessorImpl.invoke(NativeMethodAccessorImpl.java:62)
	at sun.reflect.DelegatingMethodAccessorImpl.invoke(DelegatingMethodAccessorImpl.java:43)
	at java.lang.reflect.Method.invoke(Method.java:498)
	at org.codehaus.plexus.classworlds.launcher.Launcher.launchStandard(Launcher.java:330)
	at org.codehaus.plexus.classworlds.launcher.Launcher.launch(Launcher.java:238)
	at jenkins.maven3.agent.Maven32Main.launch(Maven32Main.java:186)
	at sun.reflect.NativeMethodAccessorImpl.invoke0(Native Method)
	at sun.reflect.NativeMethodAccessorImpl.invoke(NativeMethodAccessorImpl.java:62)
	at sun.reflect.DelegatingMethodAccessorImpl.invoke(DelegatingMethodAccessorImpl.java:43)
	at java.lang.reflect.Method.invoke(Method.java:498)
	at hudson.maven.Maven3Builder.call(Maven3Builder.java:136)
	at hudson.maven.Maven3Builder.call(Maven3Builder.java:71)
	at hudson.remoting.UserRequest.perform(UserRequest.java:153)
	at hudson.remoting.UserRequest.perform(UserRequest.java:50)
	at hudson.remoting.Request$2.run(Request.java:332)
	at hudson.remoting.InterceptingExecutorService$1.call(InterceptingExecutorService.java:68)
	at java.util.concurrent.FutureTask.run(FutureTask.java:266)
	at java.util.concurrent.ThreadPoolExecutor.runWorker(ThreadPoolExecutor.java:1142)
	at java.util.concurrent.ThreadPoolExecutor$Worker.run(ThreadPoolExecutor.java:617)
	at java.lang.Thread.run(Thread.java:745)
Caused by: org.apache.maven.plugin.MojoExecutionException: Unable to find artifact.
	at org.apache.maven.plugin.dependency.fromConfiguration.AbstractFromConfigurationMojo.getArtifact(AbstractFromConfigurationMojo.java:265)
	at org.apache.maven.plugin.dependency.fromConfiguration.AbstractFromConfigurationMojo.getProcessedArtifactItems(AbstractFromConfigurationMojo.java:171)
	at org.apache.maven.plugin.dependency.fromConfiguration.UnpackMojo.getProcessedArtifactItems(UnpackMojo.java:144)
	at org.apache.maven.plugin.dependency.fromConfiguration.UnpackMojo.doExecute(UnpackMojo.java:101)
	at org.apache.maven.plugin.dependency.AbstractDependencyMojo.execute(AbstractDependencyMojo.java:167)
	at org.apache.maven.plugin.DefaultBuildPluginManager.executeMojo(DefaultBuildPluginManager.java:134)
	at org.apache.maven.lifecycle.internal.MojoExecutor.execute(MojoExecutor.java:207)
	... 31 more
Caused by: org.apache.maven.artifact.resolver.ArtifactNotFoundException: Could not find artifact
org.apache.qpid:qpid-broker:tar.gz:bin:7.0.0-SNAPSHOT in Nexus (http://repository.apache.org/snapshots)

Try downloading the file manually from the project website.

Then, install it using the command: 
    mvn install:install-file -DgroupId=org.apache.qpid -DartifactId=qpid-broker -Dversion=7.0.0-SNAPSHOT
-Dclassifier=bin -Dpackaging=tar.gz -Dfile=/path/to/file

Alternatively, if you host your own repository you can deploy the file there: 
    mvn deploy:deploy-file -DgroupId=org.apache.qpid -DartifactId=qpid-broker -Dversion=7.0.0-SNAPSHOT
-Dclassifier=bin -Dpackaging=tar.gz -Dfile=/path/to/file -Durl=[url] -DrepositoryId=[id]


  org.apache.qpid:qpid-broker:tar.gz:7.0.0-SNAPSHOT

from the specified remote repositories:
  oracle.releases (http://download.oracle.com/maven, releases=true, snapshots=false),
  Nexus (http://repository.apache.org/snapshots, releases=false, snapshots=true),
  central (https://repo.maven.apache.org/maven2, releases=true, snapshots=false)

	at org.apache.maven.artifact.resolver.DefaultArtifactResolver.resolve(DefaultArtifactResolver.java:221)
	at org.apache.maven.artifact.resolver.DefaultArtifactResolver.resolve(DefaultArtifactResolver.java:154)
	at org.apache.maven.artifact.resolver.DefaultArtifactResolver.resolve(DefaultArtifactResolver.java:555)
	at org.apache.maven.plugin.dependency.fromConfiguration.AbstractFromConfigurationMojo.getArtifact(AbstractFromConfigurationMojo.java:257)
	... 37 more
Caused by: org.eclipse.aether.resolution.ArtifactResolutionException: Could not find artifact
org.apache.qpid:qpid-broker:tar.gz:bin:7.0.0-SNAPSHOT in Nexus (http://repository.apache.org/snapshots)
	at org.eclipse.aether.internal.impl.DefaultArtifactResolver.resolve(DefaultArtifactResolver.java:444)
	at org.eclipse.aether.internal.impl.DefaultArtifactResolver.resolveArtifacts(DefaultArtifactResolver.java:246)
	at org.eclipse.aether.internal.impl.DefaultArtifactResolver.resolveArtifact(DefaultArtifactResolver.java:223)
	at org.eclipse.aether.internal.impl.DefaultRepositorySystem.resolveArtifact(DefaultRepositorySystem.java:294)
	at org.apache.maven.artifact.resolver.DefaultArtifactResolver.resolve(DefaultArtifactResolver.java:215)
	... 40 more
Caused by: org.eclipse.aether.transfer.ArtifactNotFoundException: Could not find artifact
org.apache.qpid:qpid-broker:tar.gz:bin:7.0.0-SNAPSHOT in Nexus (http://repository.apache.org/snapshots)
	at org.eclipse.aether.connector.basic.ArtifactTransportListener.transferFailed(ArtifactTransportListener.java:39)
	at org.eclipse.aether.connector.basic.BasicRepositoryConnector$TaskRunner.run(BasicRepositoryConnector.java:355)
	at org.eclipse.aether.util.concurrency.RunnableErrorForwarder$1.run(RunnableErrorForwarder.java:67)
	at org.eclipse.aether.connector.basic.BasicRepositoryConnector$DirectExecutor.execute(BasicRepositoryConnector.java:581)
	at org.eclipse.aether.connector.basic.BasicRepositoryConnector.get(BasicRepositoryConnector.java:249)
	at org.eclipse.aether.internal.impl.DefaultArtifactResolver.performDownloads(DefaultArtifactResolver.java:520)
	at org.eclipse.aether.internal.impl.DefaultArtifactResolver.resolve(DefaultArtifactResolver.java:421)
	... 44 more
[ERROR] Failed to execute goal org.apache.maven.plugins:maven-antrun-plugin:1.7:run (dependency-change-verification)
on project qpid-perftests: An Ant BuildException has occured: Generated dependency info does
not match the reference. Ensure LICENCE and NOTICE files are correct and then update the reference
by running again with -Dupdate-dependency-reference. Generated file: '<https://builds.apache.org/job/Qpid-Java-Checks/ws/perftests/target/dependency-change-verification/PROCESSED_DEPENDENCIES_INFO'.>
Reference file: '<https://builds.apache.org/job/Qpid-Java-Checks/ws/perftests/src/main/assembly/dependency-verification/DEPENDENCIES_REFERENCE'.>
[ERROR] around Ant part ...<fail message="Generated dependency info does not match the
reference. Ensure LICENCE and NOTICE files are correct and then update the reference by running
again with -Dupdate-dependency-reference. Generated file: &apos;${dependency-verification-output-file}&apos;.
Reference file: &apos;<https://builds.apache.org/job/Qpid-Java-Checks/ws/perftests/src/main/assembly/dependency-verification/DEPENDENCIES_REFERENCE&apos;.">...>
@ 48:429 in <https://builds.apache.org/job/Qpid-Java-Checks/ws/perftests/target/antrun/build-main.xml>
[ERROR] -> [Help 1]
org.apache.maven.lifecycle.LifecycleExecutionException: Failed to execute goal org.apache.maven.plugins:maven-antrun-plugin:1.7:run
(dependency-change-verification) on project qpid-perftests: An Ant BuildException has occured:
Generated dependency info does not match the reference. Ensure LICENCE and NOTICE files are
correct and then update the reference by running again with -Dupdate-dependency-reference.
Generated file: '<https://builds.apache.org/job/Qpid-Java-Checks/ws/perftests/target/dependency-change-verification/PROCESSED_DEPENDENCIES_INFO'.>
Reference file: '<https://builds.apache.org/job/Qpid-Java-Checks/ws/perftests/src/main/assembly/dependency-verification/DEPENDENCIES_REFERENCE'.>
around Ant part ...<fail message="Generated dependency info does not match the reference.
Ensure LICENCE and NOTICE files are correct and then update the reference by running again
with -Dupdate-dependency-reference. Generated file: &apos;${dependency-verification-output-file}&apos;.
Reference file: &apos;<https://builds.apache.org/job/Qpid-Java-Checks/ws/perftests/src/main/assembly/dependency-verification/DEPENDENCIES_REFERENCE&apos;.">...>
@ 48:429 in <https://builds.apache.org/job/Qpid-Java-Checks/ws/perftests/target/antrun/build-main.xml>
	at org.apache.maven.lifecycle.internal.MojoExecutor.execute(MojoExecutor.java:212)
	at org.apache.maven.lifecycle.internal.MojoExecutor.execute(MojoExecutor.java:153)
	at org.apache.maven.lifecycle.internal.MojoExecutor.execute(MojoExecutor.java:145)
	at org.apache.maven.lifecycle.internal.LifecycleModuleBuilder.buildProject(LifecycleModuleBuilder.java:116)
	at org.apache.maven.lifecycle.internal.LifecycleModuleBuilder.buildProject(LifecycleModuleBuilder.java:80)
	at org.apache.maven.lifecycle.internal.builder.singlethreaded.SingleThreadedBuilder.build(SingleThreadedBuilder.java:51)
	at org.apache.maven.lifecycle.internal.LifecycleStarter.execute(LifecycleStarter.java:128)
	at org.apache.maven.DefaultMaven.doExecute(DefaultMaven.java:307)
	at org.apache.maven.DefaultMaven.doExecute(DefaultMaven.java:193)
	at org.apache.maven.DefaultMaven.execute(DefaultMaven.java:106)
	at org.jvnet.hudson.maven3.launcher.Maven32Launcher.main(Maven32Launcher.java:132)
	at sun.reflect.NativeMethodAccessorImpl.invoke0(Native Method)
	at sun.reflect.NativeMethodAccessorImpl.invoke(NativeMethodAccessorImpl.java:62)
	at sun.reflect.DelegatingMethodAccessorImpl.invoke(DelegatingMethodAccessorImpl.java:43)
	at java.lang.reflect.Method.invoke(Method.java:498)
	at org.codehaus.plexus.classworlds.launcher.Launcher.launchStandard(Launcher.java:330)
	at org.codehaus.plexus.classworlds.launcher.Launcher.launch(Launcher.java:238)
	at jenkins.maven3.agent.Maven32Main.launch(Maven32Main.java:186)
	at sun.reflect.NativeMethodAccessorImpl.invoke0(Native Method)
	at sun.reflect.NativeMethodAccessorImpl.invoke(NativeMethodAccessorImpl.java:62)
	at sun.reflect.DelegatingMethodAccessorImpl.invoke(DelegatingMethodAccessorImpl.java:43)
	at java.lang.reflect.Method.invoke(Method.java:498)
	at hudson.maven.Maven3Builder.call(Maven3Builder.java:136)
	at hudson.maven.Maven3Builder.call(Maven3Builder.java:71)
	at hudson.remoting.UserRequest.perform(UserRequest.java:153)
	at hudson.remoting.UserRequest.perform(UserRequest.java:50)
	at hudson.remoting.Request$2.run(Request.java:332)
	at hudson.remoting.InterceptingExecutorService$1.call(InterceptingExecutorService.java:68)
	at java.util.concurrent.FutureTask.run(FutureTask.java:266)
	at java.util.concurrent.ThreadPoolExecutor.runWorker(ThreadPoolExecutor.java:1142)
	at java.util.concurrent.ThreadPoolExecutor$Worker.run(ThreadPoolExecutor.java:617)
	at java.lang.Thread.run(Thread.java:745)
Caused by: org.apache.maven.plugin.MojoExecutionException: An Ant BuildException has occured:
Generated dependency info does not match the reference. Ensure LICENCE and NOTICE files are
correct and then update the reference by running again with -Dupdate-dependency-reference.
Generated file: '<https://builds.apache.org/job/Qpid-Java-Checks/ws/perftests/target/dependency-change-verification/PROCESSED_DEPENDENCIES_INFO'.>
Reference file: '<https://builds.apache.org/job/Qpid-Java-Checks/ws/perftests/src/main/assembly/dependency-verification/DEPENDENCIES_REFERENCE'.>
around Ant part ...<fail message="Generated dependency info does not match the reference.
Ensure LICENCE and NOTICE files are correct and then update the reference by running again
with -Dupdate-dependency-reference. Generated file: &apos;${dependency-verification-output-file}&apos;.
Reference file: &apos;<https://builds.apache.org/job/Qpid-Java-Checks/ws/perftests/src/main/assembly/dependency-verification/DEPENDENCIES_REFERENCE&apos;.">...>
@ 48:429 in <https://builds.apache.org/job/Qpid-Java-Checks/ws/perftests/target/antrun/build-main.xml>
	at org.apache.maven.plugin.antrun.AntRunMojo.execute(AntRunMojo.java:355)
	at org.apache.maven.plugin.DefaultBuildPluginManager.executeMojo(DefaultBuildPluginManager.java:134)
	at org.apache.maven.lifecycle.internal.MojoExecutor.execute(MojoExecutor.java:207)
	... 31 more
Caused by: <https://builds.apache.org/job/Qpid-Java-Checks/ws/perftests/target/antrun/build-main.xml>:48:
Generated dependency info does not match the reference. Ensure LICENCE and NOTICE files are
correct and then update the reference by running again with -Dupdate-dependency-reference.
Generated file: '<https://builds.apache.org/job/Qpid-Java-Checks/ws/perftests/target/dependency-change-verification/PROCESSED_DEPENDENCIES_INFO'.>
Reference file: '<https://builds.apache.org/job/Qpid-Java-Checks/ws/perftests/src/main/assembly/dependency-verification/DEPENDENCIES_REFERENCE'.>
	at org.apache.tools.ant.taskdefs.Exit.execute(Exit.java:164)
	at org.apache.tools.ant.UnknownElement.execute(UnknownElement.java:291)
	at sun.reflect.GeneratedMethodAccessor34.invoke(Unknown Source)
	at sun.reflect.DelegatingMethodAccessorImpl.invoke(DelegatingMethodAccessorImpl.java:43)
	at java.lang.reflect.Method.invoke(Method.java:498)
	at org.apache.tools.ant.dispatch.DispatchUtils.execute(DispatchUtils.java:106)
	at org.apache.tools.ant.Task.perform(Task.java:348)
	at org.apache.tools.ant.Target.execute(Target.java:390)
	at org.apache.tools.ant.Target.performTasks(Target.java:411)
	at org.apache.tools.ant.Project.executeSortedTargets(Project.java:1399)
	at org.apache.tools.ant.Project.executeTarget(Project.java:1368)
	at org.apache.maven.plugin.antrun.AntRunMojo.execute(AntRunMojo.java:327)
	... 33 more
[ERROR] 
[ERROR] Re-run Maven using the -X switch to enable full debug logging.
[ERROR] 
[ERROR] For more information about the errors and possible solutions, please read the following
articles:
[ERROR] [Help 1] http://cwiki.apache.org/confluence/display/MAVEN/MojoExecutionException
[ERROR] 
[ERROR] After correcting the problems, you can resume the build with the command
[ERROR]   mvn <goals> -rf :qpid-broker
channel stopped
Archiving artifacts

Mime
View raw message