qpid-notifications mailing list archives

Site index · List index
Message view « Date » · « Thread »
Top « Date » · « Thread »
From Apache Jenkins Server <jenk...@builds.apache.org>
Subject Build failed in Jenkins: Qpid-Java-Cpp-Test #3727
Date Fri, 09 Dec 2016 21:27:42 GMT
See <https://builds.apache.org/job/Qpid-Java-Cpp-Test/3727/changes>

Changes:

[robbie] QPID-7584: update versions etc for 1.37.0(-SNAPSHOT) on master

------------------------------------------
[...truncated 9779 lines...]
     [echo] [profile.broker.type] spawned
     [echo] [profile.broker.command] "<https://builds.apache.org/job/Qpid-Java-Cpp-Test/ws/build/src//qpidd">
-p @PORT --data-dir "@QPID_WORK" -t --auth no --no-module-dir
     [echo] [profile.specific.excludes] CPPPrefetchExcludes CPPTransientExcludes
     [echo] [profile.test.excludes] Excludes CPPExcludes cpp.excludes CPPPrefetchExcludes
CPPTransientExcludes cpp.excludes
     [echo] [profile.broker.version] v0_10
     [echo] [profile.test.amqp_port_protocols] ["AMQP_0_8","AMQP_0_9","AMQP_0_9_1","AMQP_0_10"]
     [echo] [profile.broker.persistent] false
     [echo] [profile.virtualhostnode.type] Memory
     [echo] [profile.virtualhostnode.context.blueprint] ${profile.virtualhostnode.context.blueprint}
     [echo] [profile.test_receive_timeout] 1000
[INFO] Executed tasks
[INFO] 
[INFO] --- maven-enforcer-plugin:1.3.1:enforce (enforce-minimum-versions) @ qpid-java-doc-jms-client-0-8
---
[INFO] 
[INFO] --- maven-enforcer-plugin:1.3.1:enforce (enforce-versions-standard-properties) @ qpid-java-doc-jms-client-0-8
---
[INFO] 
[INFO] --- maven-enforcer-plugin:1.3.1:enforce (enforce-cpp-broker-dir-defined) @ qpid-java-doc-jms-client-0-8
---
[INFO] 
[INFO] --- jacoco-maven-plugin:0.7.5.201505241946:prepare-agent (default-prepare-agent) @
qpid-java-doc-jms-client-0-8 ---
[INFO] argLine set to -javaagent:/home/jenkins/.m2/repository/org/jacoco/org.jacoco.agent/0.7.5.201505241946/org.jacoco.agent-0.7.5.201505241946-runtime.jar=destfile=<https://builds.apache.org/job/Qpid-Java-Cpp-Test/ws/qpid-java/doc/jms-client-0-8/target/jacoco.exec>
-Xmx512m
[INFO] 
[INFO] --- maven-resources-plugin:2.6:copy-resources (filter-docbook-sources) @ qpid-java-doc-jms-client-0-8
---
[INFO] Using 'UTF-8' encoding to copy filtered resources.
[INFO] Copying 17 resources
[INFO] 
[INFO] --- maven-remote-resources-plugin:1.5:process (default) @ qpid-java-doc-jms-client-0-8
---
[INFO] 
[INFO] --- maven-resources-plugin:2.6:resources (default-resources) @ qpid-java-doc-jms-client-0-8
---
[INFO] Using 'UTF-8' encoding to copy filtered resources.
[INFO] Copying 17 resources
[INFO] 
[INFO] --- maven-compiler-plugin:3.1:compile (default-compile) @ qpid-java-doc-jms-client-0-8
---
[INFO] No sources to compile
[INFO] 
[INFO] --- maven-resources-plugin:2.6:testResources (default-testResources) @ qpid-java-doc-jms-client-0-8
---
[INFO] Using 'UTF-8' encoding to copy filtered resources.
[INFO] Copying 17 resources
[INFO] 
[INFO] --- maven-compiler-plugin:3.1:testCompile (default-testCompile) @ qpid-java-doc-jms-client-0-8
---
[INFO] No sources to compile
[INFO] 
[INFO] --- maven-surefire-plugin:2.17:test (default-test) @ qpid-java-doc-jms-client-0-8 ---
[INFO] No tests to run.
[INFO] 
[INFO] --- maven-jar-plugin:2.5:jar (default-jar) @ qpid-java-doc-jms-client-0-8 ---
[INFO] Skipping packaging of the jar
[INFO] 
[INFO] --- maven-site-plugin:3.4:attach-descriptor (attach-descriptor) @ qpid-java-doc-jms-client-0-8
---
[INFO] 
[INFO] --- maven-assembly-plugin:2.4.1:single (default) @ qpid-java-doc-jms-client-0-8 ---
[INFO] Assemblies have been skipped per configuration of the skipAssembly parameter.
[INFO]                                                                         
[INFO] ------------------------------------------------------------------------
[INFO] Building Apache Qpid JMS Client for AMQP 0-10 Docbook 6.2.0-SNAPSHOT
[INFO] ------------------------------------------------------------------------
[INFO] 
[INFO] --- maven-clean-plugin:2.5:clean (default-clean) @ qpid-java-doc-jms-client-0-10 ---
[INFO] 
[INFO] --- maven-antrun-plugin:1.7:run (output-test-properties) @ qpid-java-doc-jms-client-0-10
---
[INFO] Executing tasks

main:
     [echo] Qpid Test Profile Properties
     [echo] [profile] cpp
     [echo] [profile.broker.language] cpp
     [echo] [profile.broker.type] spawned
     [echo] [profile.broker.command] "<https://builds.apache.org/job/Qpid-Java-Cpp-Test/ws/build/src//qpidd">
-p @PORT --data-dir "@QPID_WORK" -t --auth no --no-module-dir
     [echo] [profile.specific.excludes] CPPPrefetchExcludes CPPTransientExcludes
     [echo] [profile.test.excludes] Excludes CPPExcludes cpp.excludes CPPPrefetchExcludes
CPPTransientExcludes cpp.excludes
     [echo] [profile.broker.version] v0_10
     [echo] [profile.test.amqp_port_protocols] ["AMQP_0_8","AMQP_0_9","AMQP_0_9_1","AMQP_0_10"]
     [echo] [profile.broker.persistent] false
     [echo] [profile.virtualhostnode.type] Memory
     [echo] [profile.virtualhostnode.context.blueprint] ${profile.virtualhostnode.context.blueprint}
     [echo] [profile.test_receive_timeout] 1000
[INFO] Executed tasks
[INFO] 
[INFO] --- maven-enforcer-plugin:1.3.1:enforce (enforce-minimum-versions) @ qpid-java-doc-jms-client-0-10
---
[INFO] 
[INFO] --- maven-enforcer-plugin:1.3.1:enforce (enforce-versions-standard-properties) @ qpid-java-doc-jms-client-0-10
---
[INFO] 
[INFO] --- maven-enforcer-plugin:1.3.1:enforce (enforce-cpp-broker-dir-defined) @ qpid-java-doc-jms-client-0-10
---
[INFO] 
[INFO] --- jacoco-maven-plugin:0.7.5.201505241946:prepare-agent (default-prepare-agent) @
qpid-java-doc-jms-client-0-10 ---
[INFO] argLine set to -javaagent:/home/jenkins/.m2/repository/org/jacoco/org.jacoco.agent/0.7.5.201505241946/org.jacoco.agent-0.7.5.201505241946-runtime.jar=destfile=<https://builds.apache.org/job/Qpid-Java-Cpp-Test/ws/qpid-java/doc/jms-client-0-10/target/jacoco.exec>
-Xmx512m
[INFO] 
[INFO] --- maven-resources-plugin:2.6:copy-resources (filter-docbook-sources) @ qpid-java-doc-jms-client-0-10
---
[INFO] Using 'UTF-8' encoding to copy filtered resources.
[INFO] Copying 1 resource
[INFO] 
[INFO] --- maven-remote-resources-plugin:1.5:process (default) @ qpid-java-doc-jms-client-0-10
---
[INFO] 
[INFO] --- maven-resources-plugin:2.6:resources (default-resources) @ qpid-java-doc-jms-client-0-10
---
[INFO] Using 'UTF-8' encoding to copy filtered resources.
[INFO] Copying 1 resource
[INFO] 
[INFO] --- maven-compiler-plugin:3.1:compile (default-compile) @ qpid-java-doc-jms-client-0-10
---
[INFO] No sources to compile
[INFO] 
[INFO] --- maven-resources-plugin:2.6:testResources (default-testResources) @ qpid-java-doc-jms-client-0-10
---
[INFO] Using 'UTF-8' encoding to copy filtered resources.
[INFO] Copying 1 resource
[INFO] 
[INFO] --- maven-compiler-plugin:3.1:testCompile (default-testCompile) @ qpid-java-doc-jms-client-0-10
---
[INFO] No sources to compile
[INFO] 
[INFO] --- maven-surefire-plugin:2.17:test (default-test) @ qpid-java-doc-jms-client-0-10
---
[INFO] No tests to run.
[INFO] 
[INFO] --- maven-jar-plugin:2.5:jar (default-jar) @ qpid-java-doc-jms-client-0-10 ---
[INFO] Skipping packaging of the jar
[INFO] 
[INFO] --- maven-site-plugin:3.4:attach-descriptor (attach-descriptor) @ qpid-java-doc-jms-client-0-10
---
[INFO] 
[INFO] --- maven-assembly-plugin:2.4.1:single (default) @ qpid-java-doc-jms-client-0-10 ---
[INFO] Assemblies have been skipped per configuration of the skipAssembly parameter.
[INFO]                                                                         
[INFO] ------------------------------------------------------------------------
[INFO] Building Apache Qpid Performance Test Docbook 6.2.0-SNAPSHOT
[INFO] ------------------------------------------------------------------------
[INFO] 
[INFO] --- maven-clean-plugin:2.5:clean (default-clean) @ qpid-java-doc-perftests ---
[INFO] 
[INFO] --- maven-antrun-plugin:1.7:run (output-test-properties) @ qpid-java-doc-perftests
---
[INFO] Executing tasks

main:
     [echo] Qpid Test Profile Properties
     [echo] [profile] cpp
     [echo] [profile.broker.language] cpp
     [echo] [profile.broker.type] spawned
     [echo] [profile.broker.command] "<https://builds.apache.org/job/Qpid-Java-Cpp-Test/ws/build/src//qpidd">
-p @PORT --data-dir "@QPID_WORK" -t --auth no --no-module-dir
     [echo] [profile.specific.excludes] CPPPrefetchExcludes CPPTransientExcludes
     [echo] [profile.test.excludes] Excludes CPPExcludes cpp.excludes CPPPrefetchExcludes
CPPTransientExcludes cpp.excludes
     [echo] [profile.broker.version] v0_10
     [echo] [profile.test.amqp_port_protocols] ["AMQP_0_8","AMQP_0_9","AMQP_0_9_1","AMQP_0_10"]
     [echo] [profile.broker.persistent] false
     [echo] [profile.virtualhostnode.type] Memory
     [echo] [profile.virtualhostnode.context.blueprint] ${profile.virtualhostnode.context.blueprint}
     [echo] [profile.test_receive_timeout] 1000
[INFO] Executed tasks
[INFO] 
[INFO] --- maven-enforcer-plugin:1.3.1:enforce (enforce-minimum-versions) @ qpid-java-doc-perftests
---
[INFO] 
[INFO] --- maven-enforcer-plugin:1.3.1:enforce (enforce-versions-standard-properties) @ qpid-java-doc-perftests
---
[INFO] 
[INFO] --- maven-enforcer-plugin:1.3.1:enforce (enforce-cpp-broker-dir-defined) @ qpid-java-doc-perftests
---
[INFO] 
[INFO] --- jacoco-maven-plugin:0.7.5.201505241946:prepare-agent (default-prepare-agent) @
qpid-java-doc-perftests ---
[INFO] argLine set to -javaagent:/home/jenkins/.m2/repository/org/jacoco/org.jacoco.agent/0.7.5.201505241946/org.jacoco.agent-0.7.5.201505241946-runtime.jar=destfile=<https://builds.apache.org/job/Qpid-Java-Cpp-Test/ws/qpid-java/doc/java-perftests/target/jacoco.exec>
-Xmx512m
[INFO] 
[INFO] --- maven-resources-plugin:2.6:copy-resources (filter-docbook-sources) @ qpid-java-doc-perftests
---
[INFO] Using 'UTF-8' encoding to copy filtered resources.
[INFO] Copying 1 resource
[INFO] 
[INFO] --- maven-remote-resources-plugin:1.5:process (default) @ qpid-java-doc-perftests ---
[INFO] 
[INFO] --- maven-resources-plugin:2.6:resources (default-resources) @ qpid-java-doc-perftests
---
[INFO] Using 'UTF-8' encoding to copy filtered resources.
[INFO] Copying 1 resource
[INFO] 
[INFO] --- maven-compiler-plugin:3.1:compile (default-compile) @ qpid-java-doc-perftests ---
[INFO] No sources to compile
[INFO] 
[INFO] --- maven-resources-plugin:2.6:testResources (default-testResources) @ qpid-java-doc-perftests
---
[INFO] Using 'UTF-8' encoding to copy filtered resources.
[INFO] Copying 1 resource
[INFO] 
[INFO] --- maven-compiler-plugin:3.1:testCompile (default-testCompile) @ qpid-java-doc-perftests
---
[INFO] No sources to compile
[INFO] 
[INFO] --- maven-surefire-plugin:2.17:test (default-test) @ qpid-java-doc-perftests ---
[INFO] No tests to run.
[INFO] 
[INFO] --- maven-jar-plugin:2.5:jar (default-jar) @ qpid-java-doc-perftests ---
[INFO] Skipping packaging of the jar
[INFO] 
[INFO] --- maven-site-plugin:3.4:attach-descriptor (attach-descriptor) @ qpid-java-doc-perftests
---
[INFO] 
[INFO] --- maven-assembly-plugin:2.4.1:single (default) @ qpid-java-doc-perftests ---
[INFO] Assemblies have been skipped per configuration of the skipAssembly parameter.
[INFO] ------------------------------------------------------------------------
[INFO] Reactor Summary:
[INFO] 
[INFO] Apache Qpid for Java ............................... SUCCESS [  5.421 s]
[INFO] Apache Qpid Broker Code Generation ................. SUCCESS [  3.080 s]
[INFO] Apache Qpid Test Utilities ......................... SUCCESS [  0.932 s]
[INFO] Apache Qpid Common ................................. SUCCESS [04:17 min]
[INFO] Apache Qpid Broker Core ............................ SUCCESS [01:46 min]
[INFO] Apache Qpid LogBack Logging Broker Plug-in ......... SUCCESS [ 13.967 s]
[INFO] Apache Qpid Access Control Broker Plug-in .......... SUCCESS [  9.946 s]
[INFO] Apache Qpid AMQP 0-8 Protocol Broker Plug-in ....... SUCCESS [  4.388 s]
[INFO] Apache Qpid AMQP 0-10 Protocol Plug-in ............. SUCCESS [  8.765 s]
[INFO] Apache Qpid AMQP 1-0 Protocol Broker Plug-in ....... SUCCESS [ 10.018 s]
[INFO] Apache Qpid AMQP 0-8 to 0-10 Message Conversion Broker Plug-in SUCCESS [  0.479 s]
[INFO] Apache Qpid AMQP 0-8 to 1-0 Message Conversion Broker Plug-in SUCCESS [  0.521 s]
[INFO] Apache Qpid AMQP 0-10 to 1-0 Message Conversion Broker Plug-in SUCCESS [  0.360 s]
[INFO] Apache Qpid Derby Message Store Broker Plug-in ..... SUCCESS [06:35 min]
[INFO] Apache Qpid JDBC Message Store Connection Pooling Plug-in SUCCESS [  0.500 s]
[INFO] Apache Qpid JDBC Message Store Broker Plug-in ...... SUCCESS [ 22.265 s]
[INFO] Apache Qpid HTTP Management Broker Plug-in ......... SUCCESS [ 14.309 s]
[INFO] Apache Qpid AMQP Management Protocol Broker Plug-in  SUCCESS [  0.659 s]
[INFO] Apache Qpid Memory Message Store Broker Plug-in .... SUCCESS [  0.570 s]
[INFO] Apache Qpid WebSocket Broker Plug-in ............... SUCCESS [  0.724 s]
[INFO] Apache Qpid JMS Client for AMQP 0-9-1/0-10 ......... SUCCESS [ 16.250 s]
[INFO] Apache Qpid BDB Message Store Broker Plug-in ....... SUCCESS [ 30.660 s]
[INFO] Apache Qpid Broker for Java ........................ SUCCESS [ 15.428 s]
[INFO] Apache Qpid Client for AMQP 0-9-1/0-10 Examples .... SUCCESS [  0.284 s]
[INFO] Apache Qpid JCA .................................... SUCCESS [  3.937 s]
[INFO] Apache Qpid Resource Adaptor ....................... SUCCESS [  1.281 s]
[INFO] Apache Qpid Tools .................................. SUCCESS [  0.654 s]
[INFO] Apache Qpid System Test Parent ..................... SUCCESS [  1.486 s]
[INFO] Apache Qpid System Tests ........................... FAILURE [10:07 min]
[INFO] Apache Qpid Performance Tests ...................... SUCCESS [ 29.658 s]
[INFO] Apache Qpid Performance Test System Tests .......... SKIPPED
[INFO] Apache Qpid Performance Tests Visualisation JFC .... SUCCESS [ 18.933 s]
[INFO] Apache Qpid BDB Store System Tests ................. SKIPPED
[INFO] Apache Qpid Joram JMS Tests ........................ SUCCESS [  0.676 s]
[INFO] Apache Qpid JMS TCK Configuration .................. SUCCESS [  0.355 s]
[INFO] Apache Qpid for Java Docbook ....................... SUCCESS [  0.063 s]
[INFO] Apache Qpid Broker for Java Docbook ................ SUCCESS [  1.361 s]
[INFO] Apache Qpid JMS Client for AMQP 0-8, 0-9 and 0-9-1 Docbook SUCCESS [  0.389 s]
[INFO] Apache Qpid JMS Client for AMQP 0-10 Docbook ....... SUCCESS [  0.236 s]
[INFO] Apache Qpid Performance Test Docbook ............... SUCCESS [  0.154 s]
[INFO] ------------------------------------------------------------------------
[INFO] BUILD FAILURE
[INFO] ------------------------------------------------------------------------
[INFO] Total time: 26:26 min
[INFO] Finished at: 2016-12-09T20:53:31+00:00
[INFO] Final Memory: 102M/1163M
[INFO] ------------------------------------------------------------------------
[ERROR] Failed to execute goal org.apache.maven.plugins:maven-surefire-plugin:2.17:test (integration-test)
on project qpid-systests: There are test failures.
[ERROR] 
[ERROR] Please refer to <https://builds.apache.org/job/Qpid-Java-Cpp-Test/3727/artifact/qpid-java/systests/target/surefire-reports/cpp>
for the individual test results.
[ERROR] -> [Help 1]
[ERROR] 
[ERROR] To see the full stack trace of the errors, re-run Maven with the -e switch.
[ERROR] Re-run Maven using the -X switch to enable full debug logging.
[ERROR] 
[ERROR] For more information about the errors and possible solutions, please read the following
articles:
[ERROR] [Help 1] http://cwiki.apache.org/confluence/display/MAVEN/MojoFailureException
[ERROR] 
[ERROR] After correcting the problems, you can resume the build with the command
[ERROR]   mvn <goals> -rf :qpid-systests
Build step 'Invoke top-level Maven targets' marked build as failure
[locks-and-latches] Releasing all the locks
[locks-and-latches] All the locks released
Archiving artifacts
Recording test results

Mime
View raw message