qpid-notifications mailing list archives

Site index · List index
Message view « Date » · « Thread »
Top « Date » · « Thread »
From Apache Jenkins Server <jenk...@builds.apache.org>
Subject Build failed in Jenkins: Qpid-proton-c #1188
Date Tue, 27 Sep 2016 18:59:28 GMT
See <https://builds.apache.org/job/Qpid-proton-c/1188/changes>

Changes:

[aconway] NO-JIRA: Made go_/cpp_ ctest target names consistent as go-/cpp-

[aconway] NO-JIRA: Fix delay in some python tests using the EchoServer.

------------------------------------------
[...truncated 2343 lines...]
1: proton_tests.reactor.ExceptionTest.test_schedule ........................ pass
1: proton_tests.reactor.ExceptionTest.test_schedule_cancel ................. pass
1: proton_tests.reactor.ExceptionTest.test_schedule_cancel_many ............ pass
1: proton_tests.reactor.ExceptionTest.test_schedule_many_nothing_refs ...... pass
1: proton_tests.reactor.ExceptionTest. \
1:     test_schedule_many_nothing_refs_cancel_before_run ................... pass
1: proton_tests.reactor.ExceptionTest.test_schedule_many_nothings .......... pass
1: proton_tests.reactor.ExceptionTest.test_session_add ..................... pass
1: proton_tests.reactor.ExceptionTest.test_session_set ..................... pass
1: proton_tests.reactor.HandlerDerivationTest.test_reactor_final_derived ... pass
1: proton_tests.reactor.HandlerDerivationTest. \
1:     test_reactor_final_derived_child_derived ............................ pass
1: proton_tests.reactor.HandlerDerivationTest. \
1:     test_reactor_final_derived_child_py ................................. pass
1: proton_tests.reactor.HandlerDerivationTest. \
1:     test_reactor_final_py_child_derived ................................. pass
1: proton_tests.reactor.HandlerDerivationTest. \
1:     test_reactor_final_py_child_py ...................................... pass
1: proton_tests.reactor.HandlerDerivationTest.test_reactor_init_derived .... pass
1: proton_tests.reactor.HandlerDerivationTest. \
1:     test_reactor_init_derived_child_derived ............................. pass
1: proton_tests.reactor.HandlerDerivationTest. \
1:     test_reactor_init_derived_child_py .................................. pass
1: proton_tests.reactor.HandlerDerivationTest. \
1:     test_reactor_init_py_child_derived .................................. pass
1: proton_tests.reactor.HandlerDerivationTest. \
1:     test_reactor_init_py_child_py ....................................... pass
1: proton_tests.sasl.SASLEventTest.testDisallowedMechClient ................ skip
1:   SkipTest: Not supported in Proton-J
1: proton_tests.sasl.SASLEventTest.testDisallowedMechServer ................ skip
1:   SkipTest: Not supported in Proton-J
1: proton_tests.sasl.SASLEventTest.testDisallowedPlainClient ............... skip
1:   SkipTest: Not supported in Proton-J
1: proton_tests.sasl.SASLEventTest.testDisallowedPlainServer ............... skip
1:   SkipTest: Not supported in Proton-J
1: proton_tests.sasl.SASLEventTest.testFailedAuthenticationClient .......... skip
1:   Skipped: Extended SASL not supported
1: proton_tests.sasl.SASLEventTest.testFailedAuthenticationServer .......... skip
1:   Skipped: Extended SASL not supported
1: proton_tests.sasl.SASLEventTest.testNoMechClient ........................ skip
1:   Skipped: Extended SASL not supported
1: proton_tests.sasl.SASLEventTest.testNoMechServer ........................ skip
1:   Skipped: Extended SASL not supported
1: proton_tests.sasl.SASLEventTest.testNormalAuthenticationClient .......... skip
1:   Skipped: Extended SASL not supported
1: proton_tests.sasl.SASLEventTest.testNormalAuthenticationServer .......... skip
1:   Skipped: Extended SASL not supported
1: proton_tests.sasl.SASLMechTest.testANON ................................. skip
1:   SkipTest: Not supported in Proton-J
1: proton_tests.sasl.SASLMechTest.testCRAMMD5 .............................. skip
1:   Skipped: Extended SASL not supported
1: proton_tests.sasl.SASLMechTest.testDIGESTMD5 ............................ skip
1:   Skipped: Extended SASL not supported
1: proton_tests.sasl.SASLMechTest.testPLAIN ................................ skip
1:   Skipped: Extended SASL not supported
1: proton_tests.sasl.SASLMechTest.testPLAINClientFail ...................... skip
1:   Skipped: Extended SASL not supported
1: proton_tests.sasl.SASLMechTest.testPLAINfail ............................ skip
1:   Skipped: Extended SASL not supported
1: proton_tests.sasl.SSLSASLTest.testSSLExternalSimple ..................... skip
1:   Skipped: Proton-J does not support SSL with SASL
1: proton_tests.sasl.SSLSASLTest.testSSLExternalSimpleFail ................. skip
1:   Skipped: Proton-J does not support SSL with SASL
1: proton_tests.sasl.SSLSASLTest.testSSLPlainSimple ........................ skip
1:   Skipped: Proton-J does not support SSL with SASL
1: proton_tests.sasl.SSLSASLTest.testSSLPlainSimpleFail .................... skip
1:   Skipped: Proton-J does not support SSL with SASL
1: proton_tests.sasl.SaslTest.testFracturedSASL ............................ pass
1: proton_tests.sasl.SaslTest.testIllegalProtocolLayering .................. skip
1:   Skipped: Proton-J does not set error condition on protocol layering violation
1: proton_tests.sasl.SaslTest.testMechNotFound ............................. skip
1:   Skipped: Proton-J does not support checking authentication state
1: proton_tests.sasl.SaslTest.testPipelined2 ............................... skip
1:   Skipped: Proton-J does not support client pipelining
1: proton_tests.sasl.SaslTest.testPipelinedClient .......................... skip
1:   Skipped: Proton-J does not support pipelined client input
1: proton_tests.sasl.SaslTest.testPipelinedServer .......................... pass
1: proton_tests.sasl.SaslTest.testSaslSkipped .............................. skip
1:   SkipTest: Not supported in Proton-J
1: proton_tests.sasl.SaslTest.testSaslSkippedFail .......................... skip
1:   SkipTest: Not supported in Proton-J
1: proton_tests.sasl.SaslTest.test_singleton ............................... pass
1: proton_tests.ssl.MessengerSSLTests.test_client_credentials .............. pass
1: 2016-09-27 18:59:27.693 SEVERE Certificate file not found [/x1/jenkins/jenkins-slave/workspace/Qpid-proton-c/tests/python/proton_tests/ssl_db/bad]
1: 2016-09-27 18:59:27.693 SEVERE ConnectorImpl [_channel=java.nio.channels.SocketChannel[connected
local=/127.0.0.1:36979 remote=/127.0.0.1:56516]] error
1: proton_tests.ssl.MessengerSSLTests.test_client_credentials_bad_cert ..... pass
1: 2016-09-27 18:59:27.743 SEVERE ConnectorImpl [_channel=java.nio.channels.SocketChannel[connected
local=/127.0.0.1:51376 remote=/127.0.0.1:64371]] error
1: proton_tests.ssl.MessengerSSLTests.test_client_credentials_bad_password . pass
1: 2016-09-27 18:59:27.802 SEVERE Certificate file not found [/x1/jenkins/jenkins-slave/workspace/Qpid-proton-c/tests/python/proton_tests/ssl_db/bad]
1: 2016-09-27 18:59:27.803 SEVERE ConnectorImpl [_channel=java.nio.channels.SocketChannel[connected
local=/127.0.0.1:38629 remote=/127.0.0.1:56725]] error
1: proton_tests.ssl.MessengerSSLTests.test_client_credentials_bad_trusted .. pass
1: 2016-09-27 18:59:27.912 WARNING General SSLEngine problem
1: 2016-09-27 18:59:27.914 WARNING Received fatal alert: certificate_unknown
1: proton_tests.ssl.MessengerSSLTests.test_client_credentials_untrusted .... pass
1: proton_tests.ssl.MessengerSSLTests.test_server_credentials .............. pass
1: proton_tests.ssl.MessengerSSLTests.test_server_credentials_bad_cert ..... skip
1:   Skipped
1: proton_tests.ssl.MessengerSSLTests.test_server_credentials_bad_key ...... skip
1:   Skipped
1: proton_tests.ssl.MessengerSSLTests.test_server_credentials_bad_password . skip
1:   Skipped
1: proton_tests.ssl.SslTest. \
1:     test_allow_unsecured_client_which_connects_secured .................. pass
1: proton_tests.ssl.SslTest. \
1:     test_allow_unsecured_client_which_connects_unsecured ................ pass
1: 2016-09-27 18:59:28.003 WARNING General SSLEngine problem
1: 2016-09-27 18:59:28.004 WARNING Received fatal alert: certificate_unknown
1: proton_tests.ssl.SslTest.test_bad_server_certificate .................... pass
1: proton_tests.ssl.SslTest.test_certificate_fingerprint_and_subfields ..... skip
1:   Skipped: Not yet implemented in Proton-J
1: proton_tests.ssl.SslTest.test_client_authentication ..................... pass
1: 2016-09-27 18:59:28.097 WARNING null cert chain
1: 2016-09-27 18:59:28.098 WARNING Received fatal alert: bad_certificate
1: proton_tests.ssl.SslTest.test_client_authentication_fail_bad_cert ....... pass
1: 2016-09-27 18:59:28.124 WARNING null cert chain
1: proton_tests.ssl.SslTest.test_client_authentication_fail_no_cert ........ pass
1: 2016-09-27 18:59:28.126 WARNING Received fatal alert: bad_certificate
1: proton_tests.ssl.SslTest.test_client_server_authentication .............. pass
1: proton_tests.ssl.SslTest.test_defaults .................................. pass
1: 2016-09-27 18:59:28.186 WARNING Unrecognized SSL message, plaintext connection?
1: proton_tests.ssl.SslTest.test_disallow_unsecured_client ................. pass
1: proton_tests.ssl.SslTest.test_multiple_sessions ......................... pass
1: proton_tests.ssl.SslTest.test_server_authentication ..................... pass
1: proton_tests.ssl.SslTest.test_server_certificate ........................ pass
1: proton_tests.ssl.SslTest.test_server_hostname_authentication ............ skip
1:   ProtonUnsupportedOperationException: org.apache.qpid.proton.ProtonUnsupportedOperationException
1: proton_tests.ssl.SslTest.test_server_hostname_authentication_2 .......... skip
1:   ProtonUnsupportedOperationException: org.apache.qpid.proton.ProtonUnsupportedOperationException
1: proton_tests.ssl.SslTest.test_server_only_authentication ................ pass
1: proton_tests.ssl.SslTest.test_session_resume ............................ skip
1:   SkipTest
1: proton_tests.ssl.SslTest.test_singleton ................................. pass
1: proton_tests.ssl.SslTest.test_ssl_with_small_buffer ..................... pass
1: proton_tests.transport.ClientTransportTest.testBigGarbage ............... pass
1: proton_tests.transport.ClientTransportTest.testBindAfterOpen ............ pass
1: proton_tests.transport.ClientTransportTest.testCloseHead ................ pass
1: proton_tests.transport.ClientTransportTest.testCloseTail ................ pass
1: proton_tests.transport.ClientTransportTest.testEOS ...................... pass
1: proton_tests.transport.ClientTransportTest.testGarbage .................. pass
1: proton_tests.transport.ClientTransportTest.testHeader ................... pass
1: proton_tests.transport.ClientTransportTest.testHeaderBadDOFF1 ........... pass
1: proton_tests.transport.ClientTransportTest.testHeaderBadDOFF2 ........... pass
1: proton_tests.transport.ClientTransportTest.testHeaderBadSize ............ pass
1: proton_tests.transport.ClientTransportTest.testPartial .................. pass
1: proton_tests.transport.ClientTransportTest.testPeek ..................... pass
1: proton_tests.transport.ClientTransportTest.testProtocolNotSupported ..... pass
1: proton_tests.transport.ClientTransportTest.testSmallGarbage ............. pass
1: proton_tests.transport.ClientTransportTest.testUnpairedPop .............. pass
1: proton_tests.transport.LogTest.testTracer ............................... skip
1:   SkipTest
1: proton_tests.transport.ServerTransportTest.testBigGarbage ............... pass
1: proton_tests.transport.ServerTransportTest.testBindAfterOpen ............ pass
1: proton_tests.transport.ServerTransportTest.testCloseHead ................ pass
1: proton_tests.transport.ServerTransportTest.testCloseTail ................ pass
1: proton_tests.transport.ServerTransportTest.testEOS ...................... pass
1: proton_tests.transport.ServerTransportTest.testEOSAfterSASL ............. pass
1: proton_tests.transport.ServerTransportTest.testGarbage .................. pass
1: proton_tests.transport.ServerTransportTest.testHeader ................... pass
1: proton_tests.transport.ServerTransportTest.testPartial .................. pass
1: proton_tests.transport.ServerTransportTest.testPeek ..................... pass
1: proton_tests.transport.ServerTransportTest.testProtocolNotSupported ..... pass
1: proton_tests.transport.ServerTransportTest.testSmallGarbage ............. pass
1: proton_tests.transport.ServerTransportTest.testUnpairedPop .............. pass
1: proton_tests.url.UrlTest.testAmqps ...................................... pass
1: proton_tests.url.UrlTest.testArgs ....................................... pass
1: proton_tests.url.UrlTest.testDefaults ................................... pass
1: proton_tests.url.UrlTest.testEqual ...................................... pass
1: proton_tests.url.UrlTest.testMissing .................................... pass
1: proton_tests.url.UrlTest.testPort ....................................... pass
1: proton_tests.url.UrlTest.testUrl ........................................ pass
1: proton_tests.utils.SyncRequestResponseTest.test_allowed_mechs_anonymous . pass
1: proton_tests.utils.SyncRequestResponseTest.test_allowed_mechs_external .. skip
1:   Skipped
1: proton_tests.utils.SyncRequestResponseTest.test_connection_properties ... skip
1:   Skipped: Extended SASL not supported
1: proton_tests.utils.SyncRequestResponseTest.test_request_response ........ skip
1:   Skipped: Extended SASL not supported
1: Totals: 422 tests, 323 passed, 63 skipped, 35 ignored, 1 failed
1: Tests run: 1, Failures: 1, Errors: 0, Skipped: 0, Time elapsed: 181.394 sec <<<
FAILURE!
1: test(org.apache.qpid.proton.JythonTest)  Time elapsed: 181.385 sec  <<< FAILURE!
1: java.lang.AssertionError: Caught PyException on invocation number 2: Traceback (most recent
call last):
1:   File "/x1/jenkins/jenkins-slave/workspace/Qpid-proton-c/tests/python/proton-test", line
706, in <module>
1:     sys.exit(1)
1: SystemExit: 1
1:  with message: null
1: 	at org.junit.Assert.fail(Assert.java:88)
1: 	at org.apache.qpid.proton.JythonTest.runTestOnce(JythonTest.java:137)
1: 	at org.apache.qpid.proton.JythonTest.test(JythonTest.java:104)
1: 	at sun.reflect.NativeMethodAccessorImpl.invoke0(Native Method)
1: 	at sun.reflect.NativeMethodAccessorImpl.invoke(NativeMethodAccessorImpl.java:57)
1: 	at sun.reflect.DelegatingMethodAccessorImpl.invoke(DelegatingMethodAccessorImpl.java:43)
1: 	at java.lang.reflect.Method.invoke(Method.java:606)
1: 	at org.junit.runners.model.FrameworkMethod$1.runReflectiveCall(FrameworkMethod.java:50)
1: 	at org.junit.internal.runners.model.ReflectiveCallable.run(ReflectiveCallable.java:12)
1: 	at org.junit.runners.model.FrameworkMethod.invokeExplosively(FrameworkMethod.java:47)
1: 	at org.junit.internal.runners.statements.InvokeMethod.evaluate(InvokeMethod.java:17)
1: 	at org.junit.runners.ParentRunner.runLeaf(ParentRunner.java:325)
1: 	at org.junit.runners.BlockJUnit4ClassRunner.runChild(BlockJUnit4ClassRunner.java:78)
1: 	at org.junit.runners.BlockJUnit4ClassRunner.runChild(BlockJUnit4ClassRunner.java:57)
1: 	at org.junit.runners.ParentRunner$3.run(ParentRunner.java:290)
1: 	at org.junit.runners.ParentRunner$1.schedule(ParentRunner.java:71)
1: 	at org.junit.runners.ParentRunner.runChildren(ParentRunner.java:288)
1: 	at org.junit.runners.ParentRunner.access$000(ParentRunner.java:58)
1: 	at org.junit.runners.ParentRunner$2.evaluate(ParentRunner.java:268)
1: 	at org.junit.runners.ParentRunner.run(ParentRunner.java:363)
1: 	at org.apache.maven.surefire.junit4.JUnit4Provider.execute(JUnit4Provider.java:252)
1: 	at org.apache.maven.surefire.junit4.JUnit4Provider.executeTestSet(JUnit4Provider.java:141)
1: 	at org.apache.maven.surefire.junit4.JUnit4Provider.invoke(JUnit4Provider.java:112)
1: 	at sun.reflect.NativeMethodAccessorImpl.invoke0(Native Method)
1: 	at sun.reflect.NativeMethodAccessorImpl.invoke(NativeMethodAccessorImpl.java:57)
1: 	at sun.reflect.DelegatingMethodAccessorImpl.invoke(DelegatingMethodAccessorImpl.java:43)
1: 	at java.lang.reflect.Method.invoke(Method.java:606)
1: 	at org.apache.maven.surefire.util.ReflectionUtils.invokeMethodWithArray(ReflectionUtils.java:189)
1: 	at org.apache.maven.surefire.booter.ProviderFactory$ProviderProxy.invoke(ProviderFactory.java:165)
1: 	at org.apache.maven.surefire.booter.ProviderFactory.invokeProvider(ProviderFactory.java:85)
1: 	at org.apache.maven.surefire.booter.ForkedBooter.runSuitesInProcess(ForkedBooter.java:115)
1: 	at org.apache.maven.surefire.booter.ForkedBooter.main(ForkedBooter.java:75)
1: 
1: 
1: Results :
1: 
1: Failed tests:   test(org.apache.qpid.proton.JythonTest): Caught PyException on invocation
number 2: Traceback (most recent call last):(..)
1: 
1: Tests run: 9, Failures: 1, Errors: 0, Skipped: 0
1: 
1: [INFO] ------------------------------------------------------------------------
1: [ERROR] BUILD FAILURE
1: [INFO] ------------------------------------------------------------------------
1: [INFO] There are test failures.
1: 
1: Please refer to /x1/jenkins/jenkins-slave/workspace/Qpid-proton-c/tests/target/surefire-reports
for the individual test results.
1: [INFO] ------------------------------------------------------------------------
1: [INFO] For more information, run Maven with the -e switch
1: [INFO] ------------------------------------------------------------------------
1: [INFO] Total time: 3 minutes 29 seconds
1: [INFO] Finished at: Tue Sep 27 18:59:30 UTC 2016
1: [INFO] Final Memory: 51M/651M
1: [INFO] ------------------------------------------------------------------------
1/1 Test #1: proton-java ......................***Failed  210.17 sec

0% tests passed, 1 tests failed out of 1

Total Test time (real) = 210.18 sec

The following tests FAILED:
	  1 - proton-java (Failed)
Errors while running CTest
Build step 'Execute shell' marked build as failure
Recording test results

Mime
View raw message