qpid-notifications mailing list archives

Site index · List index
Message view « Date » · « Thread »
Top « Date » · « Thread »
From Apache Jenkins Server <jenk...@builds.apache.org>
Subject Build failed in Jenkins: Qpid-Java-JoramJMSTest » JDK 1.7 (latest),Ubuntu,qpid-jms-client #710
Date Thu, 29 Sep 2016 12:06:36 GMT
See <https://builds.apache.org/job/Qpid-Java-JoramJMSTest/jdk=JDK%201.7%20(latest),label=Ubuntu,qpid.joramtests=qpid-jms-client/710/changes>

Changes:

[rgodfrey] QPID-7379 : address review comment on filename for export

------------------------------------------
[...truncated 24406 lines...]
     [echo] [profile.test_receive_timeout] 1000
[INFO] Executed tasks
[INFO] 
[INFO] --- maven-enforcer-plugin:1.3.1:enforce (enforce-minimum-versions) @ qpid-java-doc-jms-client-0-8
---
[INFO] 
[INFO] --- maven-enforcer-plugin:1.3.1:enforce (enforce-versions-standard-properties) @ qpid-java-doc-jms-client-0-8
---
[INFO] 
[INFO] --- jacoco-maven-plugin:0.7.5.201505241946:prepare-agent (default-prepare-agent) @
qpid-java-doc-jms-client-0-8 ---
[INFO] argLine set to "-javaagent:/home/jenkins/.m2/repository/org/jacoco/org.jacoco.agent/0.7.5.201505241946/org.jacoco.agent-0.7.5.201505241946-runtime.jar=destfile=<https://builds.apache.org/job/Qpid-Java-JoramJMSTest/jdk=JDK%201.7%20(latest),label=Ubuntu,qpid.joramtests=qpid-jms-client/ws/trunk/doc/jms-client-0-8/target/jacoco.exec">
-Xmx512m
[INFO] 
[INFO] --- maven-resources-plugin:2.6:copy-resources (filter-docbook-sources) @ qpid-java-doc-jms-client-0-8
---
[INFO] Using 'UTF-8' encoding to copy filtered resources.
[INFO] Copying 17 resources
[INFO] 
[INFO] --- maven-remote-resources-plugin:1.5:process (default) @ qpid-java-doc-jms-client-0-8
---
[INFO] 
[INFO] --- maven-resources-plugin:2.6:resources (default-resources) @ qpid-java-doc-jms-client-0-8
---
[INFO] Using 'UTF-8' encoding to copy filtered resources.
[INFO] Copying 17 resources
[INFO] 
[INFO] --- maven-compiler-plugin:3.1:compile (default-compile) @ qpid-java-doc-jms-client-0-8
---
[INFO] No sources to compile
[INFO] 
[INFO] --- maven-resources-plugin:2.6:testResources (default-testResources) @ qpid-java-doc-jms-client-0-8
---
[INFO] Using 'UTF-8' encoding to copy filtered resources.
[INFO] Copying 17 resources
[INFO] 
[INFO] --- maven-compiler-plugin:3.1:testCompile (default-testCompile) @ qpid-java-doc-jms-client-0-8
---
[INFO] No sources to compile
[INFO] 
[INFO] --- maven-surefire-plugin:2.17:test (default-test) @ qpid-java-doc-jms-client-0-8 ---
[INFO] Tests are skipped.
[INFO] 
[INFO] --- maven-jar-plugin:2.5:jar (default-jar) @ qpid-java-doc-jms-client-0-8 ---
[INFO] Skipping packaging of the jar
[INFO] 
[INFO] --- maven-site-plugin:3.4:attach-descriptor (attach-descriptor) @ qpid-java-doc-jms-client-0-8
---
[INFO] 
[INFO] --- maven-assembly-plugin:2.4.1:single (default) @ qpid-java-doc-jms-client-0-8 ---
[INFO] Assemblies have been skipped per configuration of the skipAssembly parameter.
[INFO]                                                                         
[INFO] ------------------------------------------------------------------------
[INFO] Building Apache Qpid JMS Client for AMQP 0-10 Docbook 6.1.0-SNAPSHOT
[INFO] ------------------------------------------------------------------------
[INFO] 
[INFO] --- maven-clean-plugin:2.5:clean (default-clean) @ qpid-java-doc-jms-client-0-10 ---
[INFO] 
[INFO] --- maven-antrun-plugin:1.7:run (output-test-properties) @ qpid-java-doc-jms-client-0-10
---
[INFO] Executing tasks

main:
     [echo] Qpid Test Profile Properties
     [echo] [profile] java-mms.0-10
     [echo] [profile.broker.language] java
     [echo] [profile.broker.type] internal
     [echo] [profile.broker.command] "<https://builds.apache.org/job/Qpid-Java-JoramJMSTest/jdk=JDK%201.7%20(latest),label=Ubuntu,qpid.joramtests=qpid-jms-client/ws/trunk/doc/jms-client-0-10/bin/qpid-server">
-sp "@STORE_PATH" -st @STORE_TYPE -prop test.port=@PORT -prop "qpid.work_dir=@QPID_WORK"
     [echo] [profile.specific.excludes] JavaTransientExcludes Java010Excludes
     [echo] [profile.test.excludes] Excludes JavaExcludes java-mms.0-10.excludes JavaTransientExcludes
Java010Excludes
     [echo] [profile.broker.version] v0_10
     [echo] [profile.test.amqp_port_protocols] ["AMQP_0_8","AMQP_0_9","AMQP_0_9_1","AMQP_0_10"]
     [echo] [profile.broker.persistent] false
     [echo] [profile.virtualhostnode.type] Memory
     [echo] [profile.virtualhostnode.context.blueprint] {"type":"ProvidedStore","globalAddressDomains":"${qpid.globalAddressDomains}"}
     [echo] [profile.test_receive_timeout] 1000
[INFO] Executed tasks
[INFO] 
[INFO] --- maven-enforcer-plugin:1.3.1:enforce (enforce-minimum-versions) @ qpid-java-doc-jms-client-0-10
---
[INFO] 
[INFO] --- maven-enforcer-plugin:1.3.1:enforce (enforce-versions-standard-properties) @ qpid-java-doc-jms-client-0-10
---
[INFO] 
[INFO] --- jacoco-maven-plugin:0.7.5.201505241946:prepare-agent (default-prepare-agent) @
qpid-java-doc-jms-client-0-10 ---
[INFO] argLine set to "-javaagent:/home/jenkins/.m2/repository/org/jacoco/org.jacoco.agent/0.7.5.201505241946/org.jacoco.agent-0.7.5.201505241946-runtime.jar=destfile=<https://builds.apache.org/job/Qpid-Java-JoramJMSTest/jdk=JDK%201.7%20(latest),label=Ubuntu,qpid.joramtests=qpid-jms-client/ws/trunk/doc/jms-client-0-10/target/jacoco.exec">
-Xmx512m
[INFO] 
[INFO] --- maven-resources-plugin:2.6:copy-resources (filter-docbook-sources) @ qpid-java-doc-jms-client-0-10
---
[INFO] Using 'UTF-8' encoding to copy filtered resources.
[INFO] Copying 1 resource
[INFO] 
[INFO] --- maven-remote-resources-plugin:1.5:process (default) @ qpid-java-doc-jms-client-0-10
---
[INFO] 
[INFO] --- maven-resources-plugin:2.6:resources (default-resources) @ qpid-java-doc-jms-client-0-10
---
[INFO] Using 'UTF-8' encoding to copy filtered resources.
[INFO] Copying 1 resource
[INFO] 
[INFO] --- maven-compiler-plugin:3.1:compile (default-compile) @ qpid-java-doc-jms-client-0-10
---
[INFO] No sources to compile
[INFO] 
[INFO] --- maven-resources-plugin:2.6:testResources (default-testResources) @ qpid-java-doc-jms-client-0-10
---
[INFO] Using 'UTF-8' encoding to copy filtered resources.
[INFO] Copying 1 resource
[INFO] 
[INFO] --- maven-compiler-plugin:3.1:testCompile (default-testCompile) @ qpid-java-doc-jms-client-0-10
---
[INFO] No sources to compile
[INFO] 
[INFO] --- maven-surefire-plugin:2.17:test (default-test) @ qpid-java-doc-jms-client-0-10
---
[INFO] Tests are skipped.
[INFO] 
[INFO] --- maven-jar-plugin:2.5:jar (default-jar) @ qpid-java-doc-jms-client-0-10 ---
[INFO] Skipping packaging of the jar
[INFO] 
[INFO] --- maven-site-plugin:3.4:attach-descriptor (attach-descriptor) @ qpid-java-doc-jms-client-0-10
---
[INFO] 
[INFO] --- maven-assembly-plugin:2.4.1:single (default) @ qpid-java-doc-jms-client-0-10 ---
[INFO] Assemblies have been skipped per configuration of the skipAssembly parameter.
[INFO]                                                                         
[INFO] ------------------------------------------------------------------------
[INFO] Building Apache Qpid Performance Test Docbook 6.1.0-SNAPSHOT
[INFO] ------------------------------------------------------------------------
[INFO] 
[INFO] --- maven-clean-plugin:2.5:clean (default-clean) @ qpid-java-doc-perftests ---
[INFO] 
[INFO] --- maven-antrun-plugin:1.7:run (output-test-properties) @ qpid-java-doc-perftests
---
[INFO] Executing tasks

main:
     [echo] Qpid Test Profile Properties
     [echo] [profile] java-mms.0-10
     [echo] [profile.broker.language] java
     [echo] [profile.broker.type] internal
     [echo] [profile.broker.command] "<https://builds.apache.org/job/Qpid-Java-JoramJMSTest/jdk=JDK%201.7%20(latest),label=Ubuntu,qpid.joramtests=qpid-jms-client/ws/trunk/doc/java-perftests/bin/qpid-server">
-sp "@STORE_PATH" -st @STORE_TYPE -prop test.port=@PORT -prop "qpid.work_dir=@QPID_WORK"
     [echo] [profile.specific.excludes] JavaTransientExcludes Java010Excludes
     [echo] [profile.test.excludes] Excludes JavaExcludes java-mms.0-10.excludes JavaTransientExcludes
Java010Excludes
     [echo] [profile.broker.version] v0_10
     [echo] [profile.test.amqp_port_protocols] ["AMQP_0_8","AMQP_0_9","AMQP_0_9_1","AMQP_0_10"]
     [echo] [profile.broker.persistent] false
     [echo] [profile.virtualhostnode.type] Memory
     [echo] [profile.virtualhostnode.context.blueprint] {"type":"ProvidedStore","globalAddressDomains":"${qpid.globalAddressDomains}"}
     [echo] [profile.test_receive_timeout] 1000
[INFO] Executed tasks
[INFO] 
[INFO] --- maven-enforcer-plugin:1.3.1:enforce (enforce-minimum-versions) @ qpid-java-doc-perftests
---
[INFO] 
[INFO] --- maven-enforcer-plugin:1.3.1:enforce (enforce-versions-standard-properties) @ qpid-java-doc-perftests
---
[INFO] 
[INFO] --- jacoco-maven-plugin:0.7.5.201505241946:prepare-agent (default-prepare-agent) @
qpid-java-doc-perftests ---
[INFO] argLine set to "-javaagent:/home/jenkins/.m2/repository/org/jacoco/org.jacoco.agent/0.7.5.201505241946/org.jacoco.agent-0.7.5.201505241946-runtime.jar=destfile=<https://builds.apache.org/job/Qpid-Java-JoramJMSTest/jdk=JDK%201.7%20(latest),label=Ubuntu,qpid.joramtests=qpid-jms-client/ws/trunk/doc/java-perftests/target/jacoco.exec">
-Xmx512m
[INFO] 
[INFO] --- maven-resources-plugin:2.6:copy-resources (filter-docbook-sources) @ qpid-java-doc-perftests
---
[INFO] Using 'UTF-8' encoding to copy filtered resources.
[INFO] Copying 1 resource
[INFO] 
[INFO] --- maven-remote-resources-plugin:1.5:process (default) @ qpid-java-doc-perftests ---
[INFO] 
[INFO] --- maven-resources-plugin:2.6:resources (default-resources) @ qpid-java-doc-perftests
---
[INFO] Using 'UTF-8' encoding to copy filtered resources.
[INFO] Copying 1 resource
[INFO] 
[INFO] --- maven-compiler-plugin:3.1:compile (default-compile) @ qpid-java-doc-perftests ---
[INFO] No sources to compile
[INFO] 
[INFO] --- maven-resources-plugin:2.6:testResources (default-testResources) @ qpid-java-doc-perftests
---
[INFO] Using 'UTF-8' encoding to copy filtered resources.
[INFO] Copying 1 resource
[INFO] 
[INFO] --- maven-compiler-plugin:3.1:testCompile (default-testCompile) @ qpid-java-doc-perftests
---
[INFO] No sources to compile
[INFO] 
[INFO] --- maven-surefire-plugin:2.17:test (default-test) @ qpid-java-doc-perftests ---
[INFO] Tests are skipped.
[INFO] 
[INFO] --- maven-jar-plugin:2.5:jar (default-jar) @ qpid-java-doc-perftests ---
[INFO] Skipping packaging of the jar
[INFO] 
[INFO] --- maven-site-plugin:3.4:attach-descriptor (attach-descriptor) @ qpid-java-doc-perftests
---
[INFO] 
[INFO] --- maven-assembly-plugin:2.4.1:single (default) @ qpid-java-doc-perftests ---
[INFO] Assemblies have been skipped per configuration of the skipAssembly parameter.
[INFO] ------------------------------------------------------------------------
[INFO] Reactor Summary:
[INFO] 
[INFO] Apache Qpid for Java ............................... SUCCESS [  7.356 s]
[INFO] Apache Qpid Broker Code Generation ................. SUCCESS [  2.269 s]
[INFO] Apache Qpid Test Utilities ......................... SUCCESS [ 10.198 s]
[INFO] Apache Qpid Common ................................. SUCCESS [  7.337 s]
[INFO] Apache Qpid Broker Core ............................ FAILURE [ 20.731 s]
[INFO] Apache Qpid LogBack Logging Broker Plug-in ......... SKIPPED
[INFO] Apache Qpid Access Control Broker Plug-in .......... SKIPPED
[INFO] Apache Qpid AMQP 0-8 Protocol Broker Plug-in ....... SKIPPED
[INFO] Apache Qpid AMQP 0-10 Protocol Plug-in ............. SKIPPED
[INFO] Apache Qpid AMQP 1-0 Protocol Broker Plug-in ....... SKIPPED
[INFO] Apache Qpid AMQP 0-8 to 0-10 Message Conversion Broker Plug-in SKIPPED
[INFO] Apache Qpid AMQP 0-8 to 1-0 Message Conversion Broker Plug-in SKIPPED
[INFO] Apache Qpid AMQP 0-10 to 1-0 Message Conversion Broker Plug-in SKIPPED
[INFO] Apache Qpid Derby Message Store Broker Plug-in ..... SKIPPED
[INFO] Apache Qpid JDBC Message Store Connection Pooling Plug-in SKIPPED
[INFO] Apache Qpid JDBC Message Store Broker Plug-in ...... SKIPPED
[INFO] Apache Qpid HTTP Management Broker Plug-in ......... SKIPPED
[INFO] Apache Qpid Memory Message Store Broker Plug-in .... SKIPPED
[INFO] Apache Qpid WebSocket Broker Plug-in ............... SKIPPED
[INFO] Apache Qpid JMS Client for AMQP 0-9-1/0-10 ......... SUCCESS [  2.596 s]
[INFO] Apache Qpid BDB Message Store Broker Plug-in ....... SKIPPED
[INFO] Apache Qpid Broker for Java ........................ SKIPPED
[INFO] Apache Qpid AMQP Management Protocol Broker Plug-in  SKIPPED
[INFO] Apache Qpid Client for AMQP 0-9-1/0-10 Examples .... SUCCESS [  0.289 s]
[INFO] Apache Qpid JCA .................................... SUCCESS [  8.664 s]
[INFO] Apache Qpid Resource Adaptor ....................... SUCCESS [  0.597 s]
[INFO] Apache Qpid Tools .................................. SUCCESS [  0.438 s]
[INFO] Apache Qpid System Test Parent ..................... SUCCESS [  3.016 s]
[INFO] Apache Qpid System Tests ........................... SKIPPED
[INFO] Apache Qpid Performance Tests ...................... SUCCESS [  7.931 s]
[INFO] Apache Qpid Performance Test System Tests .......... SKIPPED
[INFO] Apache Qpid Performance Tests Visualisation JFC .... FAILURE [  2.861 s]
[INFO] Apache Qpid BDB Store System Tests ................. SKIPPED
[INFO] Apache Qpid Joram JMS Tests ........................ SUCCESS [  2.384 s]
[INFO] Apache Qpid JMX TCK Configuration .................. SUCCESS [  0.277 s]
[INFO] Apache Qpid for Java Docbook ....................... SUCCESS [  0.091 s]
[INFO] Apache Qpid Broker for Java Docbook ................ SUCCESS [  0.554 s]
[INFO] Apache Qpid JMS Client for AMQP 0-8, 0-9 and 0-9-1 Docbook SUCCESS [  0.178 s]
[INFO] Apache Qpid JMS Client for AMQP 0-10 Docbook ....... SUCCESS [  0.122 s]
[INFO] Apache Qpid Performance Test Docbook ............... SUCCESS [  0.106 s]
[INFO] ------------------------------------------------------------------------
[INFO] BUILD FAILURE
[INFO] ------------------------------------------------------------------------
[INFO] Total time: 01:19 min
[INFO] Finished at: 2016-09-29T12:06:39+00:00
[INFO] Final Memory: 54M/291M
[INFO] ------------------------------------------------------------------------
[ERROR] Failed to execute goal org.apache.maven.plugins:maven-compiler-plugin:3.1:compile
(default-compile) on project qpid-broker-core: Compilation failure
[ERROR] <https://builds.apache.org/job/Qpid-Java-JoramJMSTest/jdk=JDK%201.7%20(latest),label=Ubuntu,qpid.joramtests=qpid-jms-client/ws/trunk/broker-core/src/main/java/org/apache/qpid/server/virtualhost/AbstractVirtualHost.java>:[944,9]
missing return statement
[ERROR] -> [Help 1]
[ERROR] Failed to execute goal on project qpid-perftests-visualisation-jfc: Could not resolve
dependencies for project org.apache.qpid:qpid-perftests-visualisation-jfc:jar:6.1.0-SNAPSHOT:
Could not transfer artifact net.sourceforge.csvjdbc:csvjdbc:jar:1.0.8 from/to csvjdbc.releases
(http://csvjdbc.sourceforge.net/maven2): Connect to csvjdbc.sourceforge.net:80 [csvjdbc.sourceforge.net/216.34.181.96]
failed: Connection refused -> [Help 2]
[ERROR] 
[ERROR] To see the full stack trace of the errors, re-run Maven with the -e switch.
[ERROR] Re-run Maven using the -X switch to enable full debug logging.
[ERROR] 
[ERROR] For more information about the errors and possible solutions, please read the following
articles:
[ERROR] [Help 1] http://cwiki.apache.org/confluence/display/MAVEN/MojoFailureException
[ERROR] [Help 2] http://cwiki.apache.org/confluence/display/MAVEN/DependencyResolutionException
[ERROR] 
[ERROR] After correcting the problems, you can resume the build with the command
[ERROR]   mvn <goals> -rf :qpid-broker-core
Build step 'Invoke top-level Maven targets' marked build as failure
Performing Post build task...
Match found for : : True
Logical operation result is TRUE
Running script  : #!/bin/bash -x

if [[ "${BROKER_PID}" ]]
then
  echo Killing broker "${BROKER_PID}"
  kill -15 "${BROKER_PID}"
fi
[qpid-jms-client] $ /bin/bash -x /tmp/hudson9148053460803524999.sh
+ [[ -n '' ]]
POST BUILD TASK : SUCCESS
END OF POST BUILD TASK : 0
Archiving artifacts
Recording test results
ERROR: Step ‘Publish JUnit test result report’ failed: No test report files were found.
Configuration error?


Mime
View raw message