qpid-notifications mailing list archives

Site index · List index
Message view « Date » · « Thread »
Top « Date » · « Thread »
From Apache Jenkins Server <jenk...@builds.apache.org>
Subject Build failed in Jenkins: Qpid-Java-Java-MMS-6.0.x-TestMatrix » JDK 1.7 (latest),Ubuntu,java-mms.0-9-1 #90
Date Thu, 08 Sep 2016 10:28:13 GMT
See <https://builds.apache.org/job/Qpid-Java-Java-MMS-6.0.x-TestMatrix/jdk=JDK%201.7%20(latest),label=Ubuntu,profile=java-mms.0-9-1/90/changes>

Changes:

[lquack] QPID-7394: [Java Client, AMQP 0-8..0-91] Correct prefetch accounting when message
rolled back

merged from trunk via:
$ svn merge -c 1759774 ^/qpid/java/trunk

------------------------------------------
[...truncated 3731 lines...]
[INFO] skip non existing resourceDirectory <https://builds.apache.org/job/Qpid-Java-Java-MMS-6.0.x-TestMatrix/jdk=JDK%201.7%20(latest),label=Ubuntu,profile=java-mms.0-9-1/ws/6.0.x/doc/jms-client-0-8/src/main/resources>
[INFO] Copying 3 resources
[INFO] 
[INFO] --- maven-compiler-plugin:3.1:compile (default-compile) @ qpid-java-doc-jms-client-0-8
---
[INFO] No sources to compile
[INFO] 
[INFO] --- maven-resources-plugin:2.6:testResources (default-testResources) @ qpid-java-doc-jms-client-0-8
---
[INFO] Using 'UTF-8' encoding to copy filtered resources.
[INFO] skip non existing resourceDirectory <https://builds.apache.org/job/Qpid-Java-Java-MMS-6.0.x-TestMatrix/jdk=JDK%201.7%20(latest),label=Ubuntu,profile=java-mms.0-9-1/ws/6.0.x/doc/jms-client-0-8/src/test/resources>
[INFO] Copying 3 resources
[INFO] 
[INFO] --- maven-compiler-plugin:3.1:testCompile (default-testCompile) @ qpid-java-doc-jms-client-0-8
---
[INFO] No sources to compile
[INFO] 
[INFO] --- maven-surefire-plugin:2.17:test (default-test) @ qpid-java-doc-jms-client-0-8 ---
[INFO] No tests to run.
[INFO] 
[INFO] --- maven-jar-plugin:2.5:jar (default-jar) @ qpid-java-doc-jms-client-0-8 ---
[INFO] Skipping packaging of the jar
[INFO] 
[INFO] --- maven-site-plugin:3.4:attach-descriptor (attach-descriptor) @ qpid-java-doc-jms-client-0-8
---
[INFO] 
[INFO] --- maven-assembly-plugin:2.4.1:single (default) @ qpid-java-doc-jms-client-0-8 ---
[INFO] Assemblies have been skipped per configuration of the skipAssembly parameter.
[INFO] 
[INFO] --- maven-antrun-plugin:1.7:run (create-qbtc-output-dir) @ qpid-java-doc-jms-client-0-8
---
[INFO] Executing tasks

main:
    [mkdir] Created dir: <https://builds.apache.org/job/Qpid-Java-Java-MMS-6.0.x-TestMatrix/jdk=JDK%201.7%20(latest),label=Ubuntu,profile=java-mms.0-9-1/ws/6.0.x/doc/jms-client-0-8/target/qbtc-test-config>
[INFO] Executed tasks
[INFO]                                                                         
[INFO] ------------------------------------------------------------------------
[INFO] Building Apache Qpid JMS Client for AMQP 0-10 Docbook 6.0.5-SNAPSHOT
[INFO] ------------------------------------------------------------------------
[INFO] 
[INFO] --- maven-clean-plugin:2.5:clean (default-clean) @ qpid-java-doc-jms-client-0-10 ---
[INFO] Deleting <https://builds.apache.org/job/Qpid-Java-Java-MMS-6.0.x-TestMatrix/jdk=JDK%201.7%20(latest),label=Ubuntu,profile=java-mms.0-9-1/ws/6.0.x/doc/jms-client-0-10/target>
[INFO] 
[INFO] --- maven-antrun-plugin:1.7:run (output-test-properties) @ qpid-java-doc-jms-client-0-10
---
[INFO] Executing tasks

main:
     [echo] Qpid Test Profile Properties
     [echo] [profile] java-mms.0-9-1
     [echo] [profile.broker.language] java
     [echo] [profile.broker.type] internal
     [echo] [profile.broker.command] "<https://builds.apache.org/job/Qpid-Java-Java-MMS-6.0.x-TestMatrix/jdk=JDK%201.7%20(latest),label=Ubuntu,profile=java-mms.0-9-1/ws/6.0.x/doc/jms-client-0-10/bin/qpid-server">
-sp @STORE_PATH -st @STORE_TYPE
     [echo] [profile.specific.excludes] JavaTransientExcludes XAExcludes JavaPre010Excludes
     [echo] [profile.test.excludes] Excludes JavaExcludes java-mms.0-9-1.excludes JavaTransientExcludes
XAExcludes JavaPre010Excludes
     [echo] [profile.broker.version] v0_9_1
     [echo] [profile.test.amqp_port_protocols] ["AMQP_0_8","AMQP_0_9","AMQP_0_9_1"]
     [echo] [profile.broker.persistent] false
     [echo] [profile.virtualhostnode.type] Memory
     [echo] [profile.virtualhostnode.context.blueprint] {"type":"ProvidedStore","globalAddressDomains":"${qpid.globalAddressDomains}"}
     [echo] [profile.test_receive_timeout] 1000
[INFO] Executed tasks
[INFO] 
[INFO] --- maven-enforcer-plugin:1.3.1:enforce (enforce-minimum-versions) @ qpid-java-doc-jms-client-0-10
---
[INFO] 
[INFO] --- maven-enforcer-plugin:1.3.1:enforce (enforce-versions-standard-properties) @ qpid-java-doc-jms-client-0-10
---
[INFO] 
[INFO] --- jacoco-maven-plugin:0.7.5.201505241946:prepare-agent (default-prepare-agent) @
qpid-java-doc-jms-client-0-10 ---
[INFO] argLine set to "-javaagent:/home/jenkins/.m2/repository/org/jacoco/org.jacoco.agent/0.7.5.201505241946/org.jacoco.agent-0.7.5.201505241946-runtime.jar=destfile=<https://builds.apache.org/job/Qpid-Java-Java-MMS-6.0.x-TestMatrix/jdk=JDK%201.7%20(latest),label=Ubuntu,profile=java-mms.0-9-1/ws/6.0.x/doc/jms-client-0-10/target/jacoco.exec">
-Xmx512m
[INFO] 
[INFO] --- maven-resources-plugin:2.6:copy-resources (filter-docbook-sources) @ qpid-java-doc-jms-client-0-10
---
[INFO] Using 'UTF-8' encoding to copy filtered resources.
[INFO] Copying 1 resource
[INFO] 
[INFO] --- maven-remote-resources-plugin:1.5:process (default) @ qpid-java-doc-jms-client-0-10
---
[INFO] 
[INFO] --- maven-resources-plugin:2.6:resources (default-resources) @ qpid-java-doc-jms-client-0-10
---
[INFO] Using 'UTF-8' encoding to copy filtered resources.
[INFO] skip non existing resourceDirectory <https://builds.apache.org/job/Qpid-Java-Java-MMS-6.0.x-TestMatrix/jdk=JDK%201.7%20(latest),label=Ubuntu,profile=java-mms.0-9-1/ws/6.0.x/doc/jms-client-0-10/src/main/resources>
[INFO] Copying 3 resources
[INFO] 
[INFO] --- maven-compiler-plugin:3.1:compile (default-compile) @ qpid-java-doc-jms-client-0-10
---
[INFO] No sources to compile
[INFO] 
[INFO] --- maven-resources-plugin:2.6:testResources (default-testResources) @ qpid-java-doc-jms-client-0-10
---
[INFO] Using 'UTF-8' encoding to copy filtered resources.
[INFO] skip non existing resourceDirectory <https://builds.apache.org/job/Qpid-Java-Java-MMS-6.0.x-TestMatrix/jdk=JDK%201.7%20(latest),label=Ubuntu,profile=java-mms.0-9-1/ws/6.0.x/doc/jms-client-0-10/src/test/resources>
[INFO] Copying 3 resources
[INFO] 
[INFO] --- maven-compiler-plugin:3.1:testCompile (default-testCompile) @ qpid-java-doc-jms-client-0-10
---
[INFO] No sources to compile
[INFO] 
[INFO] --- maven-surefire-plugin:2.17:test (default-test) @ qpid-java-doc-jms-client-0-10
---
[INFO] No tests to run.
[INFO] 
[INFO] --- maven-jar-plugin:2.5:jar (default-jar) @ qpid-java-doc-jms-client-0-10 ---
[INFO] Skipping packaging of the jar
[INFO] 
[INFO] --- maven-site-plugin:3.4:attach-descriptor (attach-descriptor) @ qpid-java-doc-jms-client-0-10
---
[INFO] 
[INFO] --- maven-assembly-plugin:2.4.1:single (default) @ qpid-java-doc-jms-client-0-10 ---
[INFO] Assemblies have been skipped per configuration of the skipAssembly parameter.
[INFO] 
[INFO] --- maven-antrun-plugin:1.7:run (create-qbtc-output-dir) @ qpid-java-doc-jms-client-0-10
---
[INFO] Executing tasks

main:
    [mkdir] Created dir: <https://builds.apache.org/job/Qpid-Java-Java-MMS-6.0.x-TestMatrix/jdk=JDK%201.7%20(latest),label=Ubuntu,profile=java-mms.0-9-1/ws/6.0.x/doc/jms-client-0-10/target/qbtc-test-config>
[INFO] Executed tasks
[INFO]                                                                         
[INFO] ------------------------------------------------------------------------
[INFO] Building Apache Qpid Performance Test Docbook 6.0.5-SNAPSHOT
[INFO] ------------------------------------------------------------------------
[INFO] 
[INFO] --- maven-clean-plugin:2.5:clean (default-clean) @ qpid-java-doc-perftests ---
[INFO] Deleting <https://builds.apache.org/job/Qpid-Java-Java-MMS-6.0.x-TestMatrix/jdk=JDK%201.7%20(latest),label=Ubuntu,profile=java-mms.0-9-1/ws/6.0.x/doc/java-perftests/target>
[INFO] 
[INFO] --- maven-antrun-plugin:1.7:run (output-test-properties) @ qpid-java-doc-perftests
---
[INFO] Executing tasks

main:
     [echo] Qpid Test Profile Properties
     [echo] [profile] java-mms.0-9-1
     [echo] [profile.broker.language] java
     [echo] [profile.broker.type] internal
     [echo] [profile.broker.command] "<https://builds.apache.org/job/Qpid-Java-Java-MMS-6.0.x-TestMatrix/jdk=JDK%201.7%20(latest),label=Ubuntu,profile=java-mms.0-9-1/ws/6.0.x/doc/java-perftests/bin/qpid-server">
-sp @STORE_PATH -st @STORE_TYPE
     [echo] [profile.specific.excludes] JavaTransientExcludes XAExcludes JavaPre010Excludes
     [echo] [profile.test.excludes] Excludes JavaExcludes java-mms.0-9-1.excludes JavaTransientExcludes
XAExcludes JavaPre010Excludes
     [echo] [profile.broker.version] v0_9_1
     [echo] [profile.test.amqp_port_protocols] ["AMQP_0_8","AMQP_0_9","AMQP_0_9_1"]
     [echo] [profile.broker.persistent] false
     [echo] [profile.virtualhostnode.type] Memory
     [echo] [profile.virtualhostnode.context.blueprint] {"type":"ProvidedStore","globalAddressDomains":"${qpid.globalAddressDomains}"}
     [echo] [profile.test_receive_timeout] 1000
[INFO] Executed tasks
[INFO] 
[INFO] --- maven-enforcer-plugin:1.3.1:enforce (enforce-minimum-versions) @ qpid-java-doc-perftests
---
[INFO] 
[INFO] --- maven-enforcer-plugin:1.3.1:enforce (enforce-versions-standard-properties) @ qpid-java-doc-perftests
---
[INFO] 
[INFO] --- jacoco-maven-plugin:0.7.5.201505241946:prepare-agent (default-prepare-agent) @
qpid-java-doc-perftests ---
[INFO] argLine set to "-javaagent:/home/jenkins/.m2/repository/org/jacoco/org.jacoco.agent/0.7.5.201505241946/org.jacoco.agent-0.7.5.201505241946-runtime.jar=destfile=<https://builds.apache.org/job/Qpid-Java-Java-MMS-6.0.x-TestMatrix/jdk=JDK%201.7%20(latest),label=Ubuntu,profile=java-mms.0-9-1/ws/6.0.x/doc/java-perftests/target/jacoco.exec">
-Xmx512m
[INFO] 
[INFO] --- maven-resources-plugin:2.6:copy-resources (filter-docbook-sources) @ qpid-java-doc-perftests
---
[INFO] Using 'UTF-8' encoding to copy filtered resources.
[INFO] Copying 1 resource
[INFO] 
[INFO] --- maven-remote-resources-plugin:1.5:process (default) @ qpid-java-doc-perftests ---
[INFO] 
[INFO] --- maven-resources-plugin:2.6:resources (default-resources) @ qpid-java-doc-perftests
---
[INFO] Using 'UTF-8' encoding to copy filtered resources.
[INFO] skip non existing resourceDirectory <https://builds.apache.org/job/Qpid-Java-Java-MMS-6.0.x-TestMatrix/jdk=JDK%201.7%20(latest),label=Ubuntu,profile=java-mms.0-9-1/ws/6.0.x/doc/java-perftests/src/main/resources>
[INFO] Copying 3 resources
[INFO] 
[INFO] --- maven-compiler-plugin:3.1:compile (default-compile) @ qpid-java-doc-perftests ---
[INFO] No sources to compile
[INFO] 
[INFO] --- maven-resources-plugin:2.6:testResources (default-testResources) @ qpid-java-doc-perftests
---
[INFO] Using 'UTF-8' encoding to copy filtered resources.
[INFO] skip non existing resourceDirectory <https://builds.apache.org/job/Qpid-Java-Java-MMS-6.0.x-TestMatrix/jdk=JDK%201.7%20(latest),label=Ubuntu,profile=java-mms.0-9-1/ws/6.0.x/doc/java-perftests/src/test/resources>
[INFO] Copying 3 resources
[INFO] 
[INFO] --- maven-compiler-plugin:3.1:testCompile (default-testCompile) @ qpid-java-doc-perftests
---
[INFO] No sources to compile
[INFO] 
[INFO] --- maven-surefire-plugin:2.17:test (default-test) @ qpid-java-doc-perftests ---
[INFO] No tests to run.
[INFO] 
[INFO] --- maven-jar-plugin:2.5:jar (default-jar) @ qpid-java-doc-perftests ---
[INFO] Skipping packaging of the jar
[INFO] 
[INFO] --- maven-site-plugin:3.4:attach-descriptor (attach-descriptor) @ qpid-java-doc-perftests
---
[INFO] 
[INFO] --- maven-assembly-plugin:2.4.1:single (default) @ qpid-java-doc-perftests ---
[INFO] Assemblies have been skipped per configuration of the skipAssembly parameter.
[INFO] 
[INFO] --- maven-antrun-plugin:1.7:run (create-qbtc-output-dir) @ qpid-java-doc-perftests
---
[INFO] Executing tasks

main:
    [mkdir] Created dir: <https://builds.apache.org/job/Qpid-Java-Java-MMS-6.0.x-TestMatrix/jdk=JDK%201.7%20(latest),label=Ubuntu,profile=java-mms.0-9-1/ws/6.0.x/doc/java-perftests/target/qbtc-test-config>
[INFO] Executed tasks
[INFO] ------------------------------------------------------------------------
[INFO] Reactor Summary:
[INFO] 
[INFO] Apache Qpid for Java .............................. SUCCESS [7.332s]
[INFO] Apache Qpid Broker Code Generation ................ SUCCESS [2.671s]
[INFO] Apache Qpid Test Utilities ........................ SUCCESS [1.211s]
[INFO] Apache Qpid Common ................................ SUCCESS [32.555s]
[INFO] Qpid Management Common ............................ SUCCESS [2.105s]
[INFO] Apache Qpid Broker Core ........................... SUCCESS [2:04.090s]
[INFO] Apache Qpid Access Control Broker Plug-in ......... SUCCESS [6.277s]
[INFO] Apache Qpid AMQP 0-8 Protocol Broker Plug-in ...... SUCCESS [5.959s]
[INFO] Apache Qpid AMQP 0-10 Protocol Plug-in ............ SUCCESS [5.851s]
[INFO] Apache Qpid AMQP 1-0 Protocol Broker Plug-in ...... SUCCESS [7.075s]
[INFO] Apache Qpid AMQP 0-8 to 0-10 Message Conversion Broker Plug-in  SUCCESS [0.287s]
[INFO] Apache Qpid AMQP 0-8 to 1-0 Message Conversion Broker Plug-in  SUCCESS [0.302s]
[INFO] Apache Qpid AMQP 0-10 to 1-0 Message Conversion Broker Plug-in  SUCCESS [0.283s]
[INFO] Apache Qpid Derby Message Store Broker Plug-in .... SUCCESS [5:00.635s]
[INFO] Apache Qpid JDBC Message Store Connection Pooling Plug-in  SUCCESS [0.385s]
[INFO] Apache Qpid JDBC Message Store Broker Plug-in ..... SUCCESS [11.080s]
[INFO] Apache Qpid HTTP Management Broker Plug-in ........ SUCCESS [8.806s]
[INFO] Qpid JMX Management Broker Plug-in ................ SUCCESS [4.666s]
[INFO] Apache Qpid Memory Message Store Broker Plug-in ... SUCCESS [0.362s]
[INFO] Apache Qpid WebSocket Broker Plug-in .............. SUCCESS [0.390s]
[INFO] Apache Qpid JMS Client for AMQP 0-9-1/0-10 ........ SUCCESS [10.808s]
[INFO] Apache Qpid BDB Message Store Broker Plug-in ...... SUCCESS [7.493s]
[INFO] Qpid BDB Message Store JMX ........................ SUCCESS [2.814s]
[INFO] Apache Qpid Broker for Java ....................... SUCCESS [7.796s]
[INFO] Apache Qpid AMQP Management Protocol Broker Plug-in  SUCCESS [0.273s]
[INFO] Apache Qpid Client for AMQP 0-9-1/0-10 Examples ... SUCCESS [0.180s]
[INFO] Apache Qpid JCA ................................... SUCCESS [3.114s]
[INFO] Apache Qpid Resource Adaptor ...................... SUCCESS [0.597s]
[INFO] Apache Qpid Tools ................................. SUCCESS [0.447s]
[INFO] Qpid Management Examples .......................... SUCCESS [0.121s]
[INFO] Apache Qpid System Test Parent .................... SUCCESS [1.235s]
[INFO] Apache Qpid System Tests .......................... FAILURE [3.193s]
[INFO] Apache Qpid Performance Tests ..................... SUCCESS [20.696s]
[INFO] Apache Qpid Performance Test System Tests ......... SKIPPED
[INFO] Apache Qpid Performance Tests Visualisation JFC ... SUCCESS [11.319s]
[INFO] Apache Qpid BDB Store System Tests ................ SKIPPED
[INFO] Apache Qpid Joram JMS Tests ....................... SUCCESS [0.954s]
[INFO] Apache Qpid for Java Docbook ...................... SUCCESS [0.091s]
[INFO] Apache Qpid Broker for Java Docbook ............... SUCCESS [0.530s]
[INFO] Apache Qpid JMS Client for AMQP 0-8, 0-9 and 0-9-1 Docbook  SUCCESS [0.156s]
[INFO] Apache Qpid JMS Client for AMQP 0-10 Docbook ...... SUCCESS [0.096s]
[INFO] Apache Qpid Performance Test Docbook .............. SUCCESS [0.066s]
[INFO] ------------------------------------------------------------------------
[INFO] BUILD FAILURE
[INFO] ------------------------------------------------------------------------
[INFO] Total time: 9:55.738s
[INFO] Finished at: Thu Sep 08 10:27:49 UTC 2016
[INFO] Final Memory: 87M/1067M
[INFO] ------------------------------------------------------------------------
[ERROR] Failed to execute goal org.apache.maven.plugins:maven-compiler-plugin:3.1:testCompile
(default-testCompile) on project qpid-systests: Compilation failure: Compilation failure:
[ERROR] <https://builds.apache.org/job/Qpid-Java-Java-MMS-6.0.x-TestMatrix/jdk=JDK%201.7%20(latest),label=Ubuntu,profile=java-mms.0-9-1/ws/6.0.x/systests/src/test/java/org/apache/qpid/test/client/FlowControlTest.java>:[91,43]
setPrefetchLimits(int,long) is not public in org.apache.qpid.client.AMQSession_0_8; cannot
be accessed from outside package
[ERROR] <https://builds.apache.org/job/Qpid-Java-Java-MMS-6.0.x-TestMatrix/jdk=JDK%201.7%20(latest),label=Ubuntu,profile=java-mms.0-9-1/ws/6.0.x/systests/src/test/java/org/apache/qpid/test/client/FlowControlTest.java>:[161,44]
setPrefetchLimits(int,long) is not public in org.apache.qpid.client.AMQSession_0_8; cannot
be accessed from outside package
[ERROR] <https://builds.apache.org/job/Qpid-Java-Java-MMS-6.0.x-TestMatrix/jdk=JDK%201.7%20(latest),label=Ubuntu,profile=java-mms.0-9-1/ws/6.0.x/systests/src/test/java/org/apache/qpid/test/client/FlowControlTest.java>:[174,44]
setPrefetchLimits(int,long) is not public in org.apache.qpid.client.AMQSession_0_8; cannot
be accessed from outside package
[ERROR] -> [Help 1]
[ERROR] 
[ERROR] To see the full stack trace of the errors, re-run Maven with the -e switch.
[ERROR] Re-run Maven using the -X switch to enable full debug logging.
[ERROR] 
[ERROR] For more information about the errors and possible solutions, please read the following
articles:
[ERROR] [Help 1] http://cwiki.apache.org/confluence/display/MAVEN/MojoFailureException
[ERROR] 
[ERROR] After correcting the problems, you can resume the build with the command
[ERROR]   mvn <goals> -rf :qpid-systests
Build step 'Invoke top-level Maven targets' marked build as failure
[locks-and-latches] Releasing all the locks
[locks-and-latches] All the locks released
Archiving artifacts
Compressed 53.57 MB of artifacts by 86.4% relative to #89
Recording test results

Mime
View raw message