qpid-notifications mailing list archives

Site index · List index
Message view « Date » · « Thread »
Top « Date » · « Thread »
From Apache Jenkins Server <jenk...@builds.apache.org>
Subject Build failed in Jenkins: Qpid-Java-Java-MMS-TestMatrix » JDK 1.7 (latest),ubuntu,java-mms.0-9-1 #3184
Date Wed, 13 Jul 2016 16:24:23 GMT
See <https://builds.apache.org/job/Qpid-Java-Java-MMS-TestMatrix/jdk=JDK%201.7%20(latest),label=ubuntu,profile=java-mms.0-9-1/3184/changes>

Changes:

[rgodfrey] QPID-7318 : Ensure injected operations are passed through access control checking.
 Clean up use of ACTIONS that should instead be checked as METHODs

------------------------------------------
[...truncated 10513 lines...]

main:
     [echo] Qpid Test Profile Properties
     [echo] [profile] java-mms.0-9-1
     [echo] [profile.broker.language] java
     [echo] [profile.broker.type] internal
     [echo] [profile.broker.command] "<https://builds.apache.org/job/Qpid-Java-Java-MMS-TestMatrix/jdk=JDK%201.7%20(latest),label=ubuntu,profile=java-mms.0-9-1/ws/trunk/doc/jms-client-0-8/bin/qpid-server">
-sp "@STORE_PATH" -st @STORE_TYPE -prop test.port=@PORT -prop "qpid.work_dir=@QPID_WORK"
     [echo] [profile.specific.excludes] JavaTransientExcludes XAExcludes JavaPre010Excludes
     [echo] [profile.test.excludes] Excludes JavaExcludes java-mms.0-9-1.excludes JavaTransientExcludes
XAExcludes JavaPre010Excludes
     [echo] [profile.broker.version] v0_9_1
     [echo] [profile.test.amqp_port_protocols] ["AMQP_0_8","AMQP_0_9","AMQP_0_9_1"]
     [echo] [profile.broker.persistent] false
     [echo] [profile.virtualhostnode.type] Memory
     [echo] [profile.virtualhostnode.context.blueprint] {"type":"ProvidedStore","globalAddressDomains":"${qpid.globalAddressDomains}"}
     [echo] [profile.test_receive_timeout] 1000
[INFO] Executed tasks
[INFO] 
[INFO] --- maven-enforcer-plugin:1.3.1:enforce (enforce-minimum-versions) @ qpid-java-doc-jms-client-0-8
---
[INFO] 
[INFO] --- maven-enforcer-plugin:1.3.1:enforce (enforce-versions-standard-properties) @ qpid-java-doc-jms-client-0-8
---
[INFO] 
[INFO] --- jacoco-maven-plugin:0.7.5.201505241946:prepare-agent (default-prepare-agent) @
qpid-java-doc-jms-client-0-8 ---
[INFO] argLine set to "-javaagent:/home/jenkins/.m2/repository/org/jacoco/org.jacoco.agent/0.7.5.201505241946/org.jacoco.agent-0.7.5.201505241946-runtime.jar=destfile=<https://builds.apache.org/job/Qpid-Java-Java-MMS-TestMatrix/jdk=JDK%201.7%20(latest),label=ubuntu,profile=java-mms.0-9-1/ws/trunk/doc/jms-client-0-8/target/jacoco.exec">
-Xmx512m
[INFO] 
[INFO] --- maven-resources-plugin:2.6:copy-resources (filter-docbook-sources) @ qpid-java-doc-jms-client-0-8
---
[INFO] Using 'UTF-8' encoding to copy filtered resources.
[INFO] Copying 17 resources
[INFO] 
[INFO] --- maven-remote-resources-plugin:1.5:process (default) @ qpid-java-doc-jms-client-0-8
---
[INFO] 
[INFO] --- maven-resources-plugin:2.6:resources (default-resources) @ qpid-java-doc-jms-client-0-8
---
[INFO] Using 'UTF-8' encoding to copy filtered resources.
[INFO] skip non existing resourceDirectory <https://builds.apache.org/job/Qpid-Java-Java-MMS-TestMatrix/jdk=JDK%201.7%20(latest),label=ubuntu,profile=java-mms.0-9-1/ws/trunk/doc/jms-client-0-8/src/main/resources>
[INFO] Copying 3 resources
[INFO] 
[INFO] --- maven-compiler-plugin:3.1:compile (default-compile) @ qpid-java-doc-jms-client-0-8
---
[INFO] No sources to compile
[INFO] 
[INFO] --- maven-resources-plugin:2.6:testResources (default-testResources) @ qpid-java-doc-jms-client-0-8
---
[INFO] Using 'UTF-8' encoding to copy filtered resources.
[INFO] skip non existing resourceDirectory <https://builds.apache.org/job/Qpid-Java-Java-MMS-TestMatrix/jdk=JDK%201.7%20(latest),label=ubuntu,profile=java-mms.0-9-1/ws/trunk/doc/jms-client-0-8/src/test/resources>
[INFO] Copying 3 resources
[INFO] 
[INFO] --- maven-compiler-plugin:3.1:testCompile (default-testCompile) @ qpid-java-doc-jms-client-0-8
---
[INFO] No sources to compile
[INFO] 
[INFO] --- maven-surefire-plugin:2.17:test (default-test) @ qpid-java-doc-jms-client-0-8 ---
[INFO] No tests to run.
[INFO] 
[INFO] --- maven-jar-plugin:2.5:jar (default-jar) @ qpid-java-doc-jms-client-0-8 ---
[INFO] Skipping packaging of the jar
[INFO] 
[INFO] --- maven-site-plugin:3.4:attach-descriptor (attach-descriptor) @ qpid-java-doc-jms-client-0-8
---
[INFO] 
[INFO] --- maven-assembly-plugin:2.4.1:single (default) @ qpid-java-doc-jms-client-0-8 ---
[INFO] Assemblies have been skipped per configuration of the skipAssembly parameter.
[INFO]                                                                         
[INFO] ------------------------------------------------------------------------
[INFO] Building Qpid Java JMS Client 0-10 Docbook 6.1.0-SNAPSHOT
[INFO] ------------------------------------------------------------------------
[INFO] 
[INFO] --- maven-clean-plugin:2.5:clean (default-clean) @ qpid-java-doc-jms-client-0-10 ---
[INFO] 
[INFO] --- maven-antrun-plugin:1.7:run (output-test-properties) @ qpid-java-doc-jms-client-0-10
---
[INFO] Executing tasks

main:
     [echo] Qpid Test Profile Properties
     [echo] [profile] java-mms.0-9-1
     [echo] [profile.broker.language] java
     [echo] [profile.broker.type] internal
     [echo] [profile.broker.command] "<https://builds.apache.org/job/Qpid-Java-Java-MMS-TestMatrix/jdk=JDK%201.7%20(latest),label=ubuntu,profile=java-mms.0-9-1/ws/trunk/doc/jms-client-0-10/bin/qpid-server">
-sp "@STORE_PATH" -st @STORE_TYPE -prop test.port=@PORT -prop "qpid.work_dir=@QPID_WORK"
     [echo] [profile.specific.excludes] JavaTransientExcludes XAExcludes JavaPre010Excludes
     [echo] [profile.test.excludes] Excludes JavaExcludes java-mms.0-9-1.excludes JavaTransientExcludes
XAExcludes JavaPre010Excludes
     [echo] [profile.broker.version] v0_9_1
     [echo] [profile.test.amqp_port_protocols] ["AMQP_0_8","AMQP_0_9","AMQP_0_9_1"]
     [echo] [profile.broker.persistent] false
     [echo] [profile.virtualhostnode.type] Memory
     [echo] [profile.virtualhostnode.context.blueprint] {"type":"ProvidedStore","globalAddressDomains":"${qpid.globalAddressDomains}"}
     [echo] [profile.test_receive_timeout] 1000
[INFO] Executed tasks
[INFO] 
[INFO] --- maven-enforcer-plugin:1.3.1:enforce (enforce-minimum-versions) @ qpid-java-doc-jms-client-0-10
---
[INFO] 
[INFO] --- maven-enforcer-plugin:1.3.1:enforce (enforce-versions-standard-properties) @ qpid-java-doc-jms-client-0-10
---
[INFO] 
[INFO] --- jacoco-maven-plugin:0.7.5.201505241946:prepare-agent (default-prepare-agent) @
qpid-java-doc-jms-client-0-10 ---
[INFO] argLine set to "-javaagent:/home/jenkins/.m2/repository/org/jacoco/org.jacoco.agent/0.7.5.201505241946/org.jacoco.agent-0.7.5.201505241946-runtime.jar=destfile=<https://builds.apache.org/job/Qpid-Java-Java-MMS-TestMatrix/jdk=JDK%201.7%20(latest),label=ubuntu,profile=java-mms.0-9-1/ws/trunk/doc/jms-client-0-10/target/jacoco.exec">
-Xmx512m
[INFO] 
[INFO] --- maven-resources-plugin:2.6:copy-resources (filter-docbook-sources) @ qpid-java-doc-jms-client-0-10
---
[INFO] Using 'UTF-8' encoding to copy filtered resources.
[INFO] Copying 1 resource
[INFO] 
[INFO] --- maven-remote-resources-plugin:1.5:process (default) @ qpid-java-doc-jms-client-0-10
---
[INFO] 
[INFO] --- maven-resources-plugin:2.6:resources (default-resources) @ qpid-java-doc-jms-client-0-10
---
[INFO] Using 'UTF-8' encoding to copy filtered resources.
[INFO] skip non existing resourceDirectory <https://builds.apache.org/job/Qpid-Java-Java-MMS-TestMatrix/jdk=JDK%201.7%20(latest),label=ubuntu,profile=java-mms.0-9-1/ws/trunk/doc/jms-client-0-10/src/main/resources>
[INFO] Copying 3 resources
[INFO] 
[INFO] --- maven-compiler-plugin:3.1:compile (default-compile) @ qpid-java-doc-jms-client-0-10
---
[INFO] No sources to compile
[INFO] 
[INFO] --- maven-resources-plugin:2.6:testResources (default-testResources) @ qpid-java-doc-jms-client-0-10
---
[INFO] Using 'UTF-8' encoding to copy filtered resources.
[INFO] skip non existing resourceDirectory <https://builds.apache.org/job/Qpid-Java-Java-MMS-TestMatrix/jdk=JDK%201.7%20(latest),label=ubuntu,profile=java-mms.0-9-1/ws/trunk/doc/jms-client-0-10/src/test/resources>
[INFO] Copying 3 resources
[INFO] 
[INFO] --- maven-compiler-plugin:3.1:testCompile (default-testCompile) @ qpid-java-doc-jms-client-0-10
---
[INFO] No sources to compile
[INFO] 
[INFO] --- maven-surefire-plugin:2.17:test (default-test) @ qpid-java-doc-jms-client-0-10
---
[INFO] No tests to run.
[INFO] 
[INFO] --- maven-jar-plugin:2.5:jar (default-jar) @ qpid-java-doc-jms-client-0-10 ---
[INFO] Skipping packaging of the jar
[INFO] 
[INFO] --- maven-site-plugin:3.4:attach-descriptor (attach-descriptor) @ qpid-java-doc-jms-client-0-10
---
[INFO] 
[INFO] --- maven-assembly-plugin:2.4.1:single (default) @ qpid-java-doc-jms-client-0-10 ---
[INFO] Assemblies have been skipped per configuration of the skipAssembly parameter.
[INFO]                                                                         
[INFO] ------------------------------------------------------------------------
[INFO] Building Qpid Java Perftest Docbook 6.1.0-SNAPSHOT
[INFO] ------------------------------------------------------------------------
[INFO] 
[INFO] --- maven-clean-plugin:2.5:clean (default-clean) @ qpid-java-doc-perftests ---
[INFO] 
[INFO] --- maven-antrun-plugin:1.7:run (output-test-properties) @ qpid-java-doc-perftests
---
[INFO] Executing tasks

main:
     [echo] Qpid Test Profile Properties
     [echo] [profile] java-mms.0-9-1
     [echo] [profile.broker.language] java
     [echo] [profile.broker.type] internal
     [echo] [profile.broker.command] "<https://builds.apache.org/job/Qpid-Java-Java-MMS-TestMatrix/jdk=JDK%201.7%20(latest),label=ubuntu,profile=java-mms.0-9-1/ws/trunk/doc/java-perftests/bin/qpid-server">
-sp "@STORE_PATH" -st @STORE_TYPE -prop test.port=@PORT -prop "qpid.work_dir=@QPID_WORK"
     [echo] [profile.specific.excludes] JavaTransientExcludes XAExcludes JavaPre010Excludes
     [echo] [profile.test.excludes] Excludes JavaExcludes java-mms.0-9-1.excludes JavaTransientExcludes
XAExcludes JavaPre010Excludes
     [echo] [profile.broker.version] v0_9_1
     [echo] [profile.test.amqp_port_protocols] ["AMQP_0_8","AMQP_0_9","AMQP_0_9_1"]
     [echo] [profile.broker.persistent] false
     [echo] [profile.virtualhostnode.type] Memory
     [echo] [profile.virtualhostnode.context.blueprint] {"type":"ProvidedStore","globalAddressDomains":"${qpid.globalAddressDomains}"}
     [echo] [profile.test_receive_timeout] 1000
[INFO] Executed tasks
[INFO] 
[INFO] --- maven-enforcer-plugin:1.3.1:enforce (enforce-minimum-versions) @ qpid-java-doc-perftests
---
[INFO] 
[INFO] --- maven-enforcer-plugin:1.3.1:enforce (enforce-versions-standard-properties) @ qpid-java-doc-perftests
---
[INFO] 
[INFO] --- jacoco-maven-plugin:0.7.5.201505241946:prepare-agent (default-prepare-agent) @
qpid-java-doc-perftests ---
[INFO] argLine set to "-javaagent:/home/jenkins/.m2/repository/org/jacoco/org.jacoco.agent/0.7.5.201505241946/org.jacoco.agent-0.7.5.201505241946-runtime.jar=destfile=<https://builds.apache.org/job/Qpid-Java-Java-MMS-TestMatrix/jdk=JDK%201.7%20(latest),label=ubuntu,profile=java-mms.0-9-1/ws/trunk/doc/java-perftests/target/jacoco.exec">
-Xmx512m
[INFO] 
[INFO] --- maven-resources-plugin:2.6:copy-resources (filter-docbook-sources) @ qpid-java-doc-perftests
---
[INFO] Using 'UTF-8' encoding to copy filtered resources.
[INFO] Copying 1 resource
[INFO] 
[INFO] --- maven-remote-resources-plugin:1.5:process (default) @ qpid-java-doc-perftests ---
[INFO] 
[INFO] --- maven-resources-plugin:2.6:resources (default-resources) @ qpid-java-doc-perftests
---
[INFO] Using 'UTF-8' encoding to copy filtered resources.
[INFO] skip non existing resourceDirectory <https://builds.apache.org/job/Qpid-Java-Java-MMS-TestMatrix/jdk=JDK%201.7%20(latest),label=ubuntu,profile=java-mms.0-9-1/ws/trunk/doc/java-perftests/src/main/resources>
[INFO] Copying 3 resources
[INFO] 
[INFO] --- maven-compiler-plugin:3.1:compile (default-compile) @ qpid-java-doc-perftests ---
[INFO] No sources to compile
[INFO] 
[INFO] --- maven-resources-plugin:2.6:testResources (default-testResources) @ qpid-java-doc-perftests
---
[INFO] Using 'UTF-8' encoding to copy filtered resources.
[INFO] skip non existing resourceDirectory <https://builds.apache.org/job/Qpid-Java-Java-MMS-TestMatrix/jdk=JDK%201.7%20(latest),label=ubuntu,profile=java-mms.0-9-1/ws/trunk/doc/java-perftests/src/test/resources>
[INFO] Copying 3 resources
[INFO] 
[INFO] --- maven-compiler-plugin:3.1:testCompile (default-testCompile) @ qpid-java-doc-perftests
---
[INFO] No sources to compile
[INFO] 
[INFO] --- maven-surefire-plugin:2.17:test (default-test) @ qpid-java-doc-perftests ---
[INFO] No tests to run.
[INFO] 
[INFO] --- maven-jar-plugin:2.5:jar (default-jar) @ qpid-java-doc-perftests ---
[INFO] Skipping packaging of the jar
[INFO] 
[INFO] --- maven-site-plugin:3.4:attach-descriptor (attach-descriptor) @ qpid-java-doc-perftests
---
[INFO] 
[INFO] --- maven-assembly-plugin:2.4.1:single (default) @ qpid-java-doc-perftests ---
[INFO] Assemblies have been skipped per configuration of the skipAssembly parameter.
[INFO] ------------------------------------------------------------------------
[INFO] Reactor Summary:
[INFO] 
[INFO] Qpid Java Build ................................... SUCCESS [3.235s]
[INFO] Qpid Broker Code Generation ....................... SUCCESS [2.108s]
[INFO] Qpid Test Utilities ............................... SUCCESS [0.579s]
[INFO] Qpid Common ....................................... SUCCESS [23.646s]
[INFO] Qpid Java Broker Core ............................. SUCCESS [1:48.187s]
[INFO] Qpid Access Control Broker Plug-in ................ SUCCESS [6.845s]
[INFO] Qpid AMQP 0-8 Protocol Broker Plug-in ............. SUCCESS [6.316s]
[INFO] Qpid AMQP 0-10 Protocol Plug-in ................... SUCCESS [6.521s]
[INFO] Qpid AMQP 1-0 Protocol Broker Plug-in ............. SUCCESS [6.703s]
[INFO] Qpid AMQP 0-8 to 0-10 Message Conversion Broker Plug-in  SUCCESS [0.301s]
[INFO] Qpid AMQP 0-8 to 1-0 Message Conversion Broker Plug-in  SUCCESS [0.272s]
[INFO] Qpid AMQP 0-10 to 1-0 Message Conversion Broker Plug-in  SUCCESS [0.250s]
[INFO] Qpid Derby Message Store .......................... SUCCESS [22.331s]
[INFO] Qpid JDBC Message Store Connection Pooling Plug-in  SUCCESS [0.215s]
[INFO] Qpid JDBC Message Store Broker Plug-in ............ SUCCESS [10.848s]
[INFO] Qpid HTTP Management Broker Plug-in ............... SUCCESS [8.269s]
[INFO] Qpid Memory Message Store Broker Plug-in .......... SUCCESS [0.386s]
[INFO] Qpid WebSocket Broker Plug-in ..................... SUCCESS [0.321s]
[INFO] Qpid AMQP 0-x JMS Client .......................... SUCCESS [9.792s]
[INFO] Qpid BDB Message Store ............................ SUCCESS [7.400s]
[INFO] Qpid Java Broker .................................. SUCCESS [6.465s]
[INFO] Qpid AMQP Management Protocol Broker Plug-in ...... SUCCESS [0.313s]
[INFO] Qpid AMQP 0-x JMS Client Examples ................. SUCCESS [0.169s]
[INFO] Qpid JCA .......................................... SUCCESS [2.245s]
[INFO] Qpid Resource Adaptor ............................. SUCCESS [0.387s]
[INFO] Qpid Tools ........................................ SUCCESS [0.384s]
[INFO] Qpid Java System Test Parent ...................... SUCCESS [0.855s]
[INFO] Qpid System Tests ................................. SUCCESS [17:52.600s]
[INFO] Qpid Performance Tests ............................ SUCCESS [13.614s]
[INFO] Qpid Performance Test System Tests ................ SUCCESS [19.341s]
[INFO] Qpid Performance Tests Visualisation JFC .......... FAILURE [0.212s]
[INFO] Qpid BDB Store System Tests ....................... SUCCESS [2.516s]
[INFO] Qpid Joram JMS Tests .............................. SUCCESS [0.308s]
[INFO] Qpid Java Docbook ................................. SUCCESS [0.071s]
[INFO] Qpid Java Broker Docbook .......................... SUCCESS [0.355s]
[INFO] Qpid Java Jms Client 0-8 Docbook .................. SUCCESS [0.115s]
[INFO] Qpid Java JMS Client 0-10 Docbook ................. SUCCESS [0.100s]
[INFO] Qpid Java Perftest Docbook ........................ SUCCESS [0.106s]
[INFO] ------------------------------------------------------------------------
[INFO] BUILD FAILURE
[INFO] ------------------------------------------------------------------------
[INFO] Total time: 22:25.625s
[INFO] Finished at: Wed Jul 13 16:18:52 UTC 2016
[INFO] Final Memory: 43M/268M
[INFO] ------------------------------------------------------------------------
[ERROR] Failed to execute goal on project qpid-perftests-visualisation-jfc: Could not resolve
dependencies for project org.apache.qpid:qpid-perftests-visualisation-jfc:jar:6.1.0-SNAPSHOT:
Failed to collect dependencies for [org.apache.qpid:qpid-perftests:jar:6.1.0-SNAPSHOT (compile),
org.apache.qpid:qpid-common:jar:6.1.0-SNAPSHOT (compile), org.slf4j:slf4j-api:jar:1.7.12 (compile),
org.apache.derby:derby:jar:10.11.1.1 (provided), net.sourceforge.csvjdbc:csvjdbc:jar:1.0.8
(provided), jfree:jfreechart:jar:1.0.13 (provided), org.apache.qpid:qpid-test-utils:jar:6.1.0-SNAPSHOT
(test), junit:junit:jar:4.11 (test), org.mockito:mockito-all:jar:1.9.5 (test)]: Failed to
read artifact descriptor for net.sourceforge.csvjdbc:csvjdbc:jar:1.0.8: Could not transfer
artifact net.sourceforge.csvjdbc:csvjdbc:pom:1.0.8 from/to csvjdbc.releases (http://csvjdbc.sourceforge.net/maven2):
Connection reset -> [Help 1]
[ERROR] 
[ERROR] To see the full stack trace of the errors, re-run Maven with the -e switch.
[ERROR] Re-run Maven using the -X switch to enable full debug logging.
[ERROR] 
[ERROR] For more information about the errors and possible solutions, please read the following
articles:
[ERROR] [Help 1] http://cwiki.apache.org/confluence/display/MAVEN/DependencyResolutionException
[ERROR] 
[ERROR] After correcting the problems, you can resume the build with the command
[ERROR]   mvn <goals> -rf :qpid-perftests-visualisation-jfc
Build step 'Invoke top-level Maven targets' marked build as failure
[locks-and-latches] Releasing all the locks
[locks-and-latches] All the locks released
Archiving artifacts
Recording test results

Mime
View raw message