qpid-notifications mailing list archives

Site index · List index
Message view « Date » · « Thread »
Top « Date » · « Thread »
From Apache Jenkins Server <jenk...@builds.apache.org>
Subject Build failed in Jenkins: Qpid-Java-Java-BDB-6.0.x-TestMatrix » JDK 1.7 (latest),Ubuntu,java-bdb.0-9-1 #64
Date Wed, 22 Jun 2016 09:03:05 GMT
See <https://builds.apache.org/job/Qpid-Java-Java-BDB-6.0.x-TestMatrix/jdk=JDK%201.7%20(latest),label=Ubuntu,profile=java-bdb.0-9-1/64/>

------------------------------------------
[...truncated 8330 lines...]
[INFO] 
[INFO] --- maven-remote-resources-plugin:1.5:process (default) @ qpid-java-doc-jms-client-0-8
---
[INFO] 
[INFO] --- maven-resources-plugin:2.6:resources (default-resources) @ qpid-java-doc-jms-client-0-8
---
[INFO] Using 'UTF-8' encoding to copy filtered resources.
[INFO] skip non existing resourceDirectory <https://builds.apache.org/job/Qpid-Java-Java-BDB-6.0.x-TestMatrix/jdk=JDK%201.7%20(latest),label=Ubuntu,profile=java-bdb.0-9-1/ws/doc/jms-client-0-8/src/main/resources>
[INFO] Copying 3 resources
[INFO] 
[INFO] --- maven-compiler-plugin:3.1:compile (default-compile) @ qpid-java-doc-jms-client-0-8
---
[INFO] No sources to compile
[INFO] 
[INFO] --- maven-resources-plugin:2.6:testResources (default-testResources) @ qpid-java-doc-jms-client-0-8
---
[INFO] Using 'UTF-8' encoding to copy filtered resources.
[INFO] skip non existing resourceDirectory <https://builds.apache.org/job/Qpid-Java-Java-BDB-6.0.x-TestMatrix/jdk=JDK%201.7%20(latest),label=Ubuntu,profile=java-bdb.0-9-1/ws/doc/jms-client-0-8/src/test/resources>
[INFO] Copying 3 resources
[INFO] 
[INFO] --- maven-compiler-plugin:3.1:testCompile (default-testCompile) @ qpid-java-doc-jms-client-0-8
---
[INFO] No sources to compile
[INFO] 
[INFO] --- maven-surefire-plugin:2.17:test (default-test) @ qpid-java-doc-jms-client-0-8 ---
[INFO] No tests to run.
[INFO] 
[INFO] --- maven-jar-plugin:2.5:jar (default-jar) @ qpid-java-doc-jms-client-0-8 ---
[INFO] Skipping packaging of the jar
[INFO] 
[INFO] --- maven-site-plugin:3.4:attach-descriptor (attach-descriptor) @ qpid-java-doc-jms-client-0-8
---
[INFO] 
[INFO] --- maven-assembly-plugin:2.4.1:single (default) @ qpid-java-doc-jms-client-0-8 ---
[INFO] Assemblies have been skipped per configuration of the skipAssembly parameter.
[INFO] 
[INFO] --- maven-antrun-plugin:1.7:run (create-qbtc-output-dir) @ qpid-java-doc-jms-client-0-8
---
[INFO] Executing tasks

main:
    [mkdir] Created dir: <https://builds.apache.org/job/Qpid-Java-Java-BDB-6.0.x-TestMatrix/jdk=JDK%201.7%20(latest),label=Ubuntu,profile=java-bdb.0-9-1/ws/doc/jms-client-0-8/target/qbtc-test-config>
[INFO] Executed tasks
[INFO]                                                                         
[INFO] ------------------------------------------------------------------------
[INFO] Building Qpid Java JMS Client 0-10 Docbook 6.0.4-SNAPSHOT
[INFO] ------------------------------------------------------------------------
[INFO] 
[INFO] --- maven-clean-plugin:2.5:clean (default-clean) @ qpid-java-doc-jms-client-0-10 ---
[INFO] 
[INFO] --- maven-antrun-plugin:1.7:run (output-test-properties) @ qpid-java-doc-jms-client-0-10
---
[INFO] Executing tasks

main:
     [echo] Qpid Test Profile Properties
     [echo] [profile] java-bdb.0-9-1
     [echo] [profile.broker.language] java
     [echo] [profile.broker.type] internal
     [echo] [profile.broker.command] "<https://builds.apache.org/job/Qpid-Java-Java-BDB-6.0.x-TestMatrix/jdk=JDK%201.7%20(latest),label=Ubuntu,profile=java-bdb.0-9-1/ws/doc/jms-client-0-10/bin/qpid-server">
-sp @STORE_PATH -st @STORE_TYPE
     [echo] [profile.specific.excludes] JavaPersistentExcludes XAExcludes JavaPre010Excludes
JavaBDBExcludes
     [echo] [profile.test.excludes] Excludes JavaExcludes java-bdb.0-9-1.excludes JavaPersistentExcludes
XAExcludes JavaPre010Excludes JavaBDBExcludes
     [echo] [profile.broker.version] v0_9_1
     [echo] [profile.test.amqp_port_protocols] ["AMQP_0_8","AMQP_0_9","AMQP_0_9_1"]
     [echo] [profile.broker.persistent] true
     [echo] [profile.virtualhostnode.type] BDB
     [echo] [profile.virtualhostnode.context.blueprint] {"type":"ProvidedStore","globalAddressDomains":"${qpid.globalAddressDomains}"}
     [echo] [profile.test_receive_timeout] 1000
[INFO] Executed tasks
[INFO] 
[INFO] --- maven-enforcer-plugin:1.3.1:enforce (enforce-minimum-versions) @ qpid-java-doc-jms-client-0-10
---
[INFO] 
[INFO] --- maven-enforcer-plugin:1.3.1:enforce (enforce-versions-standard-properties) @ qpid-java-doc-jms-client-0-10
---
[INFO] 
[INFO] --- jacoco-maven-plugin:0.7.5.201505241946:prepare-agent (default-prepare-agent) @
qpid-java-doc-jms-client-0-10 ---
[INFO] argLine set to "-javaagent:/home/jenkins/.m2/repository/org/jacoco/org.jacoco.agent/0.7.5.201505241946/org.jacoco.agent-0.7.5.201505241946-runtime.jar=destfile=<https://builds.apache.org/job/Qpid-Java-Java-BDB-6.0.x-TestMatrix/jdk=JDK%201.7%20(latest),label=Ubuntu,profile=java-bdb.0-9-1/ws/doc/jms-client-0-10/target/jacoco.exec">
-Xmx512m
[INFO] 
[INFO] --- maven-resources-plugin:2.6:copy-resources (filter-docbook-sources) @ qpid-java-doc-jms-client-0-10
---
[INFO] Using 'UTF-8' encoding to copy filtered resources.
[INFO] Copying 1 resource
[INFO] 
[INFO] --- maven-remote-resources-plugin:1.5:process (default) @ qpid-java-doc-jms-client-0-10
---
[INFO] 
[INFO] --- maven-resources-plugin:2.6:resources (default-resources) @ qpid-java-doc-jms-client-0-10
---
[INFO] Using 'UTF-8' encoding to copy filtered resources.
[INFO] skip non existing resourceDirectory <https://builds.apache.org/job/Qpid-Java-Java-BDB-6.0.x-TestMatrix/jdk=JDK%201.7%20(latest),label=Ubuntu,profile=java-bdb.0-9-1/ws/doc/jms-client-0-10/src/main/resources>
[INFO] Copying 3 resources
[INFO] 
[INFO] --- maven-compiler-plugin:3.1:compile (default-compile) @ qpid-java-doc-jms-client-0-10
---
[INFO] No sources to compile
[INFO] 
[INFO] --- maven-resources-plugin:2.6:testResources (default-testResources) @ qpid-java-doc-jms-client-0-10
---
[INFO] Using 'UTF-8' encoding to copy filtered resources.
[INFO] skip non existing resourceDirectory <https://builds.apache.org/job/Qpid-Java-Java-BDB-6.0.x-TestMatrix/jdk=JDK%201.7%20(latest),label=Ubuntu,profile=java-bdb.0-9-1/ws/doc/jms-client-0-10/src/test/resources>
[INFO] Copying 3 resources
[INFO] 
[INFO] --- maven-compiler-plugin:3.1:testCompile (default-testCompile) @ qpid-java-doc-jms-client-0-10
---
[INFO] No sources to compile
[INFO] 
[INFO] --- maven-surefire-plugin:2.17:test (default-test) @ qpid-java-doc-jms-client-0-10
---
[INFO] No tests to run.
[INFO] 
[INFO] --- maven-jar-plugin:2.5:jar (default-jar) @ qpid-java-doc-jms-client-0-10 ---
[INFO] Skipping packaging of the jar
[INFO] 
[INFO] --- maven-site-plugin:3.4:attach-descriptor (attach-descriptor) @ qpid-java-doc-jms-client-0-10
---
[INFO] 
[INFO] --- maven-assembly-plugin:2.4.1:single (default) @ qpid-java-doc-jms-client-0-10 ---
[INFO] Assemblies have been skipped per configuration of the skipAssembly parameter.
[INFO] 
[INFO] --- maven-antrun-plugin:1.7:run (create-qbtc-output-dir) @ qpid-java-doc-jms-client-0-10
---
[INFO] Executing tasks

main:
    [mkdir] Created dir: <https://builds.apache.org/job/Qpid-Java-Java-BDB-6.0.x-TestMatrix/jdk=JDK%201.7%20(latest),label=Ubuntu,profile=java-bdb.0-9-1/ws/doc/jms-client-0-10/target/qbtc-test-config>
[INFO] Executed tasks
[INFO]                                                                         
[INFO] ------------------------------------------------------------------------
[INFO] Building Qpid Java Perftest Docbook 6.0.4-SNAPSHOT
[INFO] ------------------------------------------------------------------------
[INFO] 
[INFO] --- maven-clean-plugin:2.5:clean (default-clean) @ qpid-java-doc-perftests ---
[INFO] 
[INFO] --- maven-antrun-plugin:1.7:run (output-test-properties) @ qpid-java-doc-perftests
---
[INFO] Executing tasks

main:
     [echo] Qpid Test Profile Properties
     [echo] [profile] java-bdb.0-9-1
     [echo] [profile.broker.language] java
     [echo] [profile.broker.type] internal
     [echo] [profile.broker.command] "<https://builds.apache.org/job/Qpid-Java-Java-BDB-6.0.x-TestMatrix/jdk=JDK%201.7%20(latest),label=Ubuntu,profile=java-bdb.0-9-1/ws/doc/java-perftests/bin/qpid-server">
-sp @STORE_PATH -st @STORE_TYPE
     [echo] [profile.specific.excludes] JavaPersistentExcludes XAExcludes JavaPre010Excludes
JavaBDBExcludes
     [echo] [profile.test.excludes] Excludes JavaExcludes java-bdb.0-9-1.excludes JavaPersistentExcludes
XAExcludes JavaPre010Excludes JavaBDBExcludes
     [echo] [profile.broker.version] v0_9_1
     [echo] [profile.test.amqp_port_protocols] ["AMQP_0_8","AMQP_0_9","AMQP_0_9_1"]
     [echo] [profile.broker.persistent] true
     [echo] [profile.virtualhostnode.type] BDB
     [echo] [profile.virtualhostnode.context.blueprint] {"type":"ProvidedStore","globalAddressDomains":"${qpid.globalAddressDomains}"}
     [echo] [profile.test_receive_timeout] 1000
[INFO] Executed tasks
[INFO] 
[INFO] --- maven-enforcer-plugin:1.3.1:enforce (enforce-minimum-versions) @ qpid-java-doc-perftests
---
[INFO] 
[INFO] --- maven-enforcer-plugin:1.3.1:enforce (enforce-versions-standard-properties) @ qpid-java-doc-perftests
---
[INFO] 
[INFO] --- jacoco-maven-plugin:0.7.5.201505241946:prepare-agent (default-prepare-agent) @
qpid-java-doc-perftests ---
[INFO] argLine set to "-javaagent:/home/jenkins/.m2/repository/org/jacoco/org.jacoco.agent/0.7.5.201505241946/org.jacoco.agent-0.7.5.201505241946-runtime.jar=destfile=<https://builds.apache.org/job/Qpid-Java-Java-BDB-6.0.x-TestMatrix/jdk=JDK%201.7%20(latest),label=Ubuntu,profile=java-bdb.0-9-1/ws/doc/java-perftests/target/jacoco.exec">
-Xmx512m
[INFO] 
[INFO] --- maven-resources-plugin:2.6:copy-resources (filter-docbook-sources) @ qpid-java-doc-perftests
---
[INFO] Using 'UTF-8' encoding to copy filtered resources.
[INFO] Copying 1 resource
[INFO] 
[INFO] --- maven-remote-resources-plugin:1.5:process (default) @ qpid-java-doc-perftests ---
[INFO] 
[INFO] --- maven-resources-plugin:2.6:resources (default-resources) @ qpid-java-doc-perftests
---
[INFO] Using 'UTF-8' encoding to copy filtered resources.
[INFO] skip non existing resourceDirectory <https://builds.apache.org/job/Qpid-Java-Java-BDB-6.0.x-TestMatrix/jdk=JDK%201.7%20(latest),label=Ubuntu,profile=java-bdb.0-9-1/ws/doc/java-perftests/src/main/resources>
[INFO] Copying 3 resources
[INFO] 
[INFO] --- maven-compiler-plugin:3.1:compile (default-compile) @ qpid-java-doc-perftests ---
[INFO] No sources to compile
[INFO] 
[INFO] --- maven-resources-plugin:2.6:testResources (default-testResources) @ qpid-java-doc-perftests
---
[INFO] Using 'UTF-8' encoding to copy filtered resources.
[INFO] skip non existing resourceDirectory <https://builds.apache.org/job/Qpid-Java-Java-BDB-6.0.x-TestMatrix/jdk=JDK%201.7%20(latest),label=Ubuntu,profile=java-bdb.0-9-1/ws/doc/java-perftests/src/test/resources>
[INFO] Copying 3 resources
[INFO] 
[INFO] --- maven-compiler-plugin:3.1:testCompile (default-testCompile) @ qpid-java-doc-perftests
---
[INFO] No sources to compile
[INFO] 
[INFO] --- maven-surefire-plugin:2.17:test (default-test) @ qpid-java-doc-perftests ---
[INFO] No tests to run.
[INFO] 
[INFO] --- maven-jar-plugin:2.5:jar (default-jar) @ qpid-java-doc-perftests ---
[INFO] Skipping packaging of the jar
[INFO] 
[INFO] --- maven-site-plugin:3.4:attach-descriptor (attach-descriptor) @ qpid-java-doc-perftests
---
[INFO] 
[INFO] --- maven-assembly-plugin:2.4.1:single (default) @ qpid-java-doc-perftests ---
[INFO] Assemblies have been skipped per configuration of the skipAssembly parameter.
[INFO] 
[INFO] --- maven-antrun-plugin:1.7:run (create-qbtc-output-dir) @ qpid-java-doc-perftests
---
[INFO] Executing tasks

main:
    [mkdir] Created dir: <https://builds.apache.org/job/Qpid-Java-Java-BDB-6.0.x-TestMatrix/jdk=JDK%201.7%20(latest),label=Ubuntu,profile=java-bdb.0-9-1/ws/doc/java-perftests/target/qbtc-test-config>
[INFO] Executed tasks
[INFO] ------------------------------------------------------------------------
[INFO] Reactor Summary:
[INFO] 
[INFO] Qpid Java Build ................................... SUCCESS [5.942s]
[INFO] Qpid Broker Code Generation ....................... SUCCESS [2.368s]
[INFO] Qpid Test Utilities ............................... SUCCESS [0.598s]
[INFO] Qpid Common ....................................... SUCCESS [24.280s]
[INFO] Qpid Management Common ............................ SUCCESS [2.269s]
[INFO] Qpid Java Broker Core ............................. SUCCESS [2:06.890s]
[INFO] Qpid Access Control Broker Plug-in ................ SUCCESS [5.732s]
[INFO] Qpid AMQP 0-8 Protocol Broker Plug-in ............. SUCCESS [6.148s]
[INFO] Qpid AMQP 0-10 Protocol Plug-in ................... SUCCESS [5.801s]
[INFO] Qpid AMQP 1-0 Protocol Broker Plug-in ............. SUCCESS [7.892s]
[INFO] Qpid AMQP 0-8 to 0-10 Message Conversion Broker Plug-in  SUCCESS [0.446s]
[INFO] Qpid AMQP 0-8 to 1-0 Message Conversion Broker Plug-in  SUCCESS [0.410s]
[INFO] Qpid AMQP 0-10 to 1-0 Message Conversion Broker Plug-in  SUCCESS [0.496s]
[INFO] Qpid Derby Message Store .......................... SUCCESS [40.805s]
[INFO] Qpid JDBC Message Store Connection Pooling Plug-in  SUCCESS [0.563s]
[INFO] Qpid JDBC Message Store Broker Plug-in ............ SUCCESS [11.437s]
[INFO] Qpid HTTP Management Broker Plug-in ............... SUCCESS [8.651s]
[INFO] Qpid JMX Management Broker Plug-in ................ SUCCESS [5.023s]
[INFO] Qpid Memory Message Store Broker Plug-in .......... SUCCESS [0.243s]
[INFO] Qpid WebSocket Broker Plug-in ..................... SUCCESS [0.277s]
[INFO] Qpid AMQP 0-x JMS Client .......................... SUCCESS [10.911s]
[INFO] Qpid BDB Message Store ............................ SUCCESS [4:14.281s]
[INFO] Qpid BDB Message Store JMX ........................ SUCCESS [4.005s]
[INFO] Qpid Java Broker .................................. SUCCESS [7.724s]
[INFO] Qpid AMQP Management Protocol Broker Plug-in ...... SUCCESS [0.230s]
[INFO] Qpid AMQP 0-x JMS Client Examples ................. SUCCESS [0.171s]
[INFO] Qpid JCA .......................................... SUCCESS [3.714s]
[INFO] Qpid Resource Adaptor ............................. SUCCESS [0.906s]
[INFO] Qpid Tools ........................................ SUCCESS [0.591s]
[INFO] Qpid Management Examples .......................... SUCCESS [0.178s]
[INFO] Qpid Java System Test Parent ...................... SUCCESS [1.231s]
[INFO] Qpid System Tests ................................. FAILURE [1:08.754s]
[INFO] Qpid Performance Tests ............................ SUCCESS [18.576s]
[INFO] Qpid Performance Test System Tests ................ SKIPPED
[INFO] Qpid Performance Tests Visualisation JFC .......... SUCCESS [6.471s]
[INFO] Qpid BDB Store System Tests ....................... SKIPPED
[INFO] Qpid Joram JMS Tests .............................. SUCCESS [0.801s]
[INFO] Qpid Java Docbook ................................. SUCCESS [0.117s]
[INFO] Qpid Java Broker Docbook .......................... SUCCESS [0.606s]
[INFO] Qpid Java Jms Client 0-8 Docbook .................. SUCCESS [0.252s]
[INFO] Qpid Java JMS Client 0-10 Docbook ................. SUCCESS [0.226s]
[INFO] Qpid Java Perftest Docbook ........................ SUCCESS [0.212s]
[INFO] ------------------------------------------------------------------------
[INFO] BUILD FAILURE
[INFO] ------------------------------------------------------------------------
[INFO] Total time: 10:37.250s
[INFO] Finished at: Wed Jun 22 09:01:52 UTC 2016
[INFO] Final Memory: 104M/1094M
[INFO] ------------------------------------------------------------------------
[ERROR] Failed to execute goal org.apache.maven.plugins:maven-surefire-plugin:2.17:test (integration-test)
on project qpid-systests: Execution integration-test of goal org.apache.maven.plugins:maven-surefire-plugin:2.17:test
failed: The forked VM terminated without properly saying goodbye. VM crash or System.exit
called?
[ERROR] Command was /bin/sh -c cd "<https://builds.apache.org/job/Qpid-Java-Java-BDB-6.0.x-TestMatrix/jdk=JDK%201.7%20(latest),label=Ubuntu,profile=java-bdb.0-9-1/ws/systests/..">
&& /home/jenkins/jenkins-slave/tools/hudson.model.JDK/JDK_1.7_latest_/jre/bin/java
-jar '<https://builds.apache.org/job/Qpid-Java-Java-BDB-6.0.x-TestMatrix/jdk=JDK%201.7%20(latest),label=Ubuntu,profile=java-bdb.0-9-1/ws/systests/target/surefire/surefirebooter7772401905742925609.jar'>
'<https://builds.apache.org/job/Qpid-Java-Java-BDB-6.0.x-TestMatrix/jdk=JDK%201.7%20(latest),label=Ubuntu,profile=java-bdb.0-9-1/ws/systests/target/surefire/surefire4739290121795276980tmp'>
'<https://builds.apache.org/job/Qpid-Java-Java-BDB-6.0.x-TestMatrix/jdk=JDK%201.7%20(latest),label=Ubuntu,profile=java-bdb.0-9-1/ws/systests/target/surefire/surefire_165374440618111143983tmp'>
[ERROR] -> [Help 1]
[ERROR] 
[ERROR] To see the full stack trace of the errors, re-run Maven with the -e switch.
[ERROR] Re-run Maven using the -X switch to enable full debug logging.
[ERROR] 
[ERROR] For more information about the errors and possible solutions, please read the following
articles:
[ERROR] [Help 1] http://cwiki.apache.org/confluence/display/MAVEN/PluginExecutionException
[ERROR] 
[ERROR] After correcting the problems, you can resume the build with the command
[ERROR]   mvn <goals> -rf :qpid-systests
Build step 'Invoke top-level Maven targets' marked build as failure
[locks-and-latches] Releasing all the locks
[locks-and-latches] All the locks released
Archiving artifacts
Recording test results

Mime
View raw message