qpid-notifications mailing list archives

Site index · List index
Message view « Date » · « Thread »
Top « Date » · « Thread »
From Apache Jenkins Server <jenk...@builds.apache.org>
Subject Build failed in Jenkins: Qpid-Java-Cpp-Test #3242
Date Fri, 08 Apr 2016 20:26:35 GMT
See <https://builds.apache.org/job/Qpid-Java-Cpp-Test/3242/changes>

Changes:

[kwall] QPID-7189: [Java Client] Consistently name the connection delegates

* The previous inconsistency with the naming of 0-91's delegate was caused by the fact that
  AMQP 0-10 implementation misinterpreted 0-91 header.
* Also on the 0-8..0-91 path ensure that a AMQProtocolHeaderException is promptly reported
to the caller (rather than causing a hang).

------------------------------------------
[...truncated 1321 lines...]
Linking CXX executable server
[ 99%] Built target server
Scanning dependencies of target server_reconnect
[ 99%] Building CXX object examples/messaging/CMakeFiles/server_reconnect.dir/server_reconnect.cpp.o
[ 99%] Building CXX object examples/messaging/CMakeFiles/server_reconnect.dir/OptionParser.cpp.o
Linking CXX executable server_reconnect
[ 99%] Built target server_reconnect
Scanning dependencies of target spout
[100%] Building CXX object examples/messaging/CMakeFiles/spout.dir/spout.cpp.o
[100%] Building CXX object examples/messaging/CMakeFiles/spout.dir/OptionParser.cpp.o
Linking CXX executable spout
[100%] Built target spout
Install the project...
-- Install configuration: "DEBUG"
-- Installing: <https://builds.apache.org/job/Qpid-Java-Cpp-Test/ws/qpid/qpid/cpp/build/ship/share/doc/qpid-cpp-0.35/LICENSE>
-- Installing: <https://builds.apache.org/job/Qpid-Java-Cpp-Test/ws/qpid/qpid/cpp/build/ship/share/doc/qpid-cpp-0.35/NOTICE>
-- Installing: <https://builds.apache.org/job/Qpid-Java-Cpp-Test/ws/qpid/qpid/cpp/build/ship/include/qmf/qmf2.i>
-- Installing: <https://builds.apache.org/job/Qpid-Java-Cpp-Test/ws/qpid/qpid/cpp/build/ship/bin/qmf-gen>
-- Installing: <https://builds.apache.org/job/Qpid-Java-Cpp-Test/ws/qpid/qpid/cpp/build/ship/lib/python2.7/site-packages/qmfgen>
-- Installing: <https://builds.apache.org/job/Qpid-Java-Cpp-Test/ws/qpid/qpid/cpp/build/ship/lib/python2.7/site-packages/qmfgen/management-types.xml>
-- Installing: <https://builds.apache.org/job/Qpid-Java-Cpp-Test/ws/qpid/qpid/cpp/build/ship/lib/python2.7/site-packages/qmfgen/__init__.py>
-- Installing: <https://builds.apache.org/job/Qpid-Java-Cpp-Test/ws/qpid/qpid/cpp/build/ship/lib/python2.7/site-packages/qmfgen/generate.py>
-- Installing: <https://builds.apache.org/job/Qpid-Java-Cpp-Test/ws/qpid/qpid/cpp/build/ship/lib/python2.7/site-packages/qmfgen/templates>
-- Installing: <https://builds.apache.org/job/Qpid-Java-Cpp-Test/ws/qpid/qpid/cpp/build/ship/lib/python2.7/site-packages/qmfgen/templates/Class.h>
-- Installing: <https://builds.apache.org/job/Qpid-Java-Cpp-Test/ws/qpid/qpid/cpp/build/ship/lib/python2.7/site-packages/qmfgen/templates/Package.cpp>
-- Installing: <https://builds.apache.org/job/Qpid-Java-Cpp-Test/ws/qpid/qpid/cpp/build/ship/lib/python2.7/site-packages/qmfgen/templates/CMakeLists.cmake>
-- Installing: <https://builds.apache.org/job/Qpid-Java-Cpp-Test/ws/qpid/qpid/cpp/build/ship/lib/python2.7/site-packages/qmfgen/templates/Event.h>
-- Installing: <https://builds.apache.org/job/Qpid-Java-Cpp-Test/ws/qpid/qpid/cpp/build/ship/lib/python2.7/site-packages/qmfgen/templates/Args.h>
-- Installing: <https://builds.apache.org/job/Qpid-Java-Cpp-Test/ws/qpid/qpid/cpp/build/ship/lib/python2.7/site-packages/qmfgen/templates/Class.cpp>
-- Installing: <https://builds.apache.org/job/Qpid-Java-Cpp-Test/ws/qpid/qpid/cpp/build/ship/lib/python2.7/site-packages/qmfgen/templates/Event.cpp>
-- Installing: <https://builds.apache.org/job/Qpid-Java-Cpp-Test/ws/qpid/qpid/cpp/build/ship/lib/python2.7/site-packages/qmfgen/templates/Package.h>
-- Installing: <https://builds.apache.org/job/Qpid-Java-Cpp-Test/ws/qpid/qpid/cpp/build/ship/lib/python2.7/site-packages/qmfgen/templates/V2Package.h>
-- Installing: <https://builds.apache.org/job/Qpid-Java-Cpp-Test/ws/qpid/qpid/cpp/build/ship/lib/python2.7/site-packages/qmfgen/templates/V2Package.cpp>
-- Installing: <https://builds.apache.org/job/Qpid-Java-Cpp-Test/ws/qpid/qpid/cpp/build/ship/lib/python2.7/site-packages/qmfgen/schema.py>
-- Installing: <https://builds.apache.org/job/Qpid-Java-Cpp-Test/ws/qpid/qpid/cpp/build/ship/lib/qpid/daemon/ha.so>
-- Set runtime path of "<https://builds.apache.org/job/Qpid-Java-Cpp-Test/ws/qpid/qpid/cpp/build/ship/lib/qpid/daemon/ha.so">
to "<https://builds.apache.org/job/Qpid-Java-Cpp-Test/ws/qpid/qpid/cpp/build/ship/lib">
-- Installing: <https://builds.apache.org/job/Qpid-Java-Cpp-Test/ws/qpid/qpid/cpp/build/ship/lib/libqpidcommon.so.2.0.0>
-- Installing: <https://builds.apache.org/job/Qpid-Java-Cpp-Test/ws/qpid/qpid/cpp/build/ship/lib/libqpidcommon.so.2>
-- Installing: <https://builds.apache.org/job/Qpid-Java-Cpp-Test/ws/qpid/qpid/cpp/build/ship/lib/libqpidcommon.so>
-- Set runtime path of "<https://builds.apache.org/job/Qpid-Java-Cpp-Test/ws/qpid/qpid/cpp/build/ship/lib/libqpidcommon.so.2.0.0">
to "<https://builds.apache.org/job/Qpid-Java-Cpp-Test/ws/qpid/qpid/cpp/build/ship/lib">
-- Installing: <https://builds.apache.org/job/Qpid-Java-Cpp-Test/ws/qpid/qpid/cpp/build/ship/lib/libqpidtypes.so.1.0.0>
-- Installing: <https://builds.apache.org/job/Qpid-Java-Cpp-Test/ws/qpid/qpid/cpp/build/ship/lib/libqpidtypes.so.1>
-- Installing: <https://builds.apache.org/job/Qpid-Java-Cpp-Test/ws/qpid/qpid/cpp/build/ship/lib/libqpidtypes.so>
-- Set runtime path of "<https://builds.apache.org/job/Qpid-Java-Cpp-Test/ws/qpid/qpid/cpp/build/ship/lib/libqpidtypes.so.1.0.0">
to "<https://builds.apache.org/job/Qpid-Java-Cpp-Test/ws/qpid/qpid/cpp/build/ship/lib">
-- Installing: <https://builds.apache.org/job/Qpid-Java-Cpp-Test/ws/qpid/qpid/cpp/build/ship/lib/libqpidclient.so.2.0.0>
-- Installing: <https://builds.apache.org/job/Qpid-Java-Cpp-Test/ws/qpid/qpid/cpp/build/ship/lib/libqpidclient.so.2>
-- Installing: <https://builds.apache.org/job/Qpid-Java-Cpp-Test/ws/qpid/qpid/cpp/build/ship/lib/libqpidclient.so>
-- Set runtime path of "<https://builds.apache.org/job/Qpid-Java-Cpp-Test/ws/qpid/qpid/cpp/build/ship/lib/libqpidclient.so.2.0.0">
to "<https://builds.apache.org/job/Qpid-Java-Cpp-Test/ws/qpid/qpid/cpp/build/ship/lib">
-- Installing: <https://builds.apache.org/job/Qpid-Java-Cpp-Test/ws/qpid/qpid/cpp/build/ship/include/qpid>
-- Installing: <https://builds.apache.org/job/Qpid-Java-Cpp-Test/ws/qpid/qpid/cpp/build/ship/include/qpid/messaging>
-- Installing: <https://builds.apache.org/job/Qpid-Java-Cpp-Test/ws/qpid/qpid/cpp/build/ship/include/qpid/messaging/Address.h>
-- Installing: <https://builds.apache.org/job/Qpid-Java-Cpp-Test/ws/qpid/qpid/cpp/build/ship/include/qpid/messaging/FailoverUpdates.h>
-- Installing: <https://builds.apache.org/job/Qpid-Java-Cpp-Test/ws/qpid/qpid/cpp/build/ship/include/qpid/messaging/Message.h>
-- Installing: <https://builds.apache.org/job/Qpid-Java-Cpp-Test/ws/qpid/qpid/cpp/build/ship/include/qpid/messaging/Duration.h>
-- Installing: <https://builds.apache.org/job/Qpid-Java-Cpp-Test/ws/qpid/qpid/cpp/build/ship/include/qpid/messaging/ImportExport.h>
-- Installing: <https://builds.apache.org/job/Qpid-Java-Cpp-Test/ws/qpid/qpid/cpp/build/ship/include/qpid/messaging/Session.h>
-- Installing: <https://builds.apache.org/job/Qpid-Java-Cpp-Test/ws/qpid/qpid/cpp/build/ship/include/qpid/messaging/Message_io.h>
-- Installing: <https://builds.apache.org/job/Qpid-Java-Cpp-Test/ws/qpid/qpid/cpp/build/ship/include/qpid/messaging/Connection.h>
-- Installing: <https://builds.apache.org/job/Qpid-Java-Cpp-Test/ws/qpid/qpid/cpp/build/ship/include/qpid/messaging/Logger.h>
-- Installing: <https://builds.apache.org/job/Qpid-Java-Cpp-Test/ws/qpid/qpid/cpp/build/ship/include/qpid/messaging/Sender.h>
-- Installing: <https://builds.apache.org/job/Qpid-Java-Cpp-Test/ws/qpid/qpid/cpp/build/ship/include/qpid/messaging/Receiver.h>
-- Installing: <https://builds.apache.org/job/Qpid-Java-Cpp-Test/ws/qpid/qpid/cpp/build/ship/include/qpid/messaging/Handle.h>
-- Installing: <https://builds.apache.org/job/Qpid-Java-Cpp-Test/ws/qpid/qpid/cpp/build/ship/include/qpid/messaging/exceptions.h>
-- Installing: <https://builds.apache.org/job/Qpid-Java-Cpp-Test/ws/qpid/qpid/cpp/build/ship/include/qpid/types>
-- Installing: <https://builds.apache.org/job/Qpid-Java-Cpp-Test/ws/qpid/qpid/cpp/build/ship/include/qpid/types/Uuid.h>
-- Installing: <https://builds.apache.org/job/Qpid-Java-Cpp-Test/ws/qpid/qpid/cpp/build/ship/include/qpid/types/Variant.h>
-- Installing: <https://builds.apache.org/job/Qpid-Java-Cpp-Test/ws/qpid/qpid/cpp/build/ship/include/qpid/types/ImportExport.h>
-- Installing: <https://builds.apache.org/job/Qpid-Java-Cpp-Test/ws/qpid/qpid/cpp/build/ship/include/qpid/types/Exception.h>
-- Installing: <https://builds.apache.org/job/Qpid-Java-Cpp-Test/ws/qpid/qpid/cpp/build/ship/include/qpid/ImportExport.h>
-- Installing: <https://builds.apache.org/job/Qpid-Java-Cpp-Test/ws/qpid/qpid/cpp/build/ship/include/qpid/swig_ruby_typemaps.i>
-- Installing: <https://builds.apache.org/job/Qpid-Java-Cpp-Test/ws/qpid/qpid/cpp/build/ship/include/qpid/sys>
-- Installing: <https://builds.apache.org/job/Qpid-Java-Cpp-Test/ws/qpid/qpid/cpp/build/ship/include/qpid/sys/posix>
-- Installing: <https://builds.apache.org/job/Qpid-Java-Cpp-Test/ws/qpid/qpid/cpp/build/ship/include/qpid/sys/posix/IntegerTypes.h>
-- Installing: <https://builds.apache.org/job/Qpid-Java-Cpp-Test/ws/qpid/qpid/cpp/build/ship/include/qpid/sys/IntegerTypes.h>
-- Installing: <https://builds.apache.org/job/Qpid-Java-Cpp-Test/ws/qpid/qpid/cpp/build/ship/include/qpid/sys/windows>
-- Installing: <https://builds.apache.org/job/Qpid-Java-Cpp-Test/ws/qpid/qpid/cpp/build/ship/include/qpid/sys/windows/IntegerTypes.h>
-- Installing: <https://builds.apache.org/job/Qpid-Java-Cpp-Test/ws/qpid/qpid/cpp/build/ship/include/qpid/swig_perl_typemaps.i>
-- Installing: <https://builds.apache.org/job/Qpid-Java-Cpp-Test/ws/qpid/qpid/cpp/build/ship/include/qpid/swig_python_typemaps.i>
-- Installing: <https://builds.apache.org/job/Qpid-Java-Cpp-Test/ws/qpid/qpid/cpp/build/ship/include/qpid/qpid.i>
-- Installing: <https://builds.apache.org/job/Qpid-Java-Cpp-Test/ws/qpid/qpid/cpp/build/ship/lib/libqpidmessaging.so.2.0.0>
-- Installing: <https://builds.apache.org/job/Qpid-Java-Cpp-Test/ws/qpid/qpid/cpp/build/ship/lib/libqpidmessaging.so.2>
-- Installing: <https://builds.apache.org/job/Qpid-Java-Cpp-Test/ws/qpid/qpid/cpp/build/ship/lib/libqpidmessaging.so>
-- Set runtime path of "<https://builds.apache.org/job/Qpid-Java-Cpp-Test/ws/qpid/qpid/cpp/build/ship/lib/libqpidmessaging.so.2.0.0">
to "<https://builds.apache.org/job/Qpid-Java-Cpp-Test/ws/qpid/qpid/cpp/build/ship/lib">
-- Installing: <https://builds.apache.org/job/Qpid-Java-Cpp-Test/ws/qpid/qpid/cpp/build/ship/lib/libqpidbroker.so.2.0.0>
-- Installing: <https://builds.apache.org/job/Qpid-Java-Cpp-Test/ws/qpid/qpid/cpp/build/ship/lib/libqpidbroker.so.2>
-- Installing: <https://builds.apache.org/job/Qpid-Java-Cpp-Test/ws/qpid/qpid/cpp/build/ship/lib/libqpidbroker.so>
-- Set runtime path of "<https://builds.apache.org/job/Qpid-Java-Cpp-Test/ws/qpid/qpid/cpp/build/ship/lib/libqpidbroker.so.2.0.0">
to "<https://builds.apache.org/job/Qpid-Java-Cpp-Test/ws/qpid/qpid/cpp/build/ship/lib">
-- Installing: <https://builds.apache.org/job/Qpid-Java-Cpp-Test/ws/qpid/qpid/cpp/build/ship/sbin/qpidd>
-- Set runtime path of "<https://builds.apache.org/job/Qpid-Java-Cpp-Test/ws/qpid/qpid/cpp/build/ship/sbin/qpidd">
to "<https://builds.apache.org/job/Qpid-Java-Cpp-Test/ws/qpid/qpid/cpp/build/ship/lib">
-- Installing: <https://builds.apache.org/job/Qpid-Java-Cpp-Test/ws/qpid/qpid/cpp/build/ship/lib/libqmf2.so.1.0.0>
-- Installing: <https://builds.apache.org/job/Qpid-Java-Cpp-Test/ws/qpid/qpid/cpp/build/ship/lib/libqmf2.so.1>
-- Installing: <https://builds.apache.org/job/Qpid-Java-Cpp-Test/ws/qpid/qpid/cpp/build/ship/lib/libqmf2.so>
-- Set runtime path of "<https://builds.apache.org/job/Qpid-Java-Cpp-Test/ws/qpid/qpid/cpp/build/ship/lib/libqmf2.so.1.0.0">
to "<https://builds.apache.org/job/Qpid-Java-Cpp-Test/ws/qpid/qpid/cpp/build/ship/lib">
-- Installing: <https://builds.apache.org/job/Qpid-Java-Cpp-Test/ws/qpid/qpid/cpp/build/ship/include/qmf/AgentEvent.h>
-- Installing: <https://builds.apache.org/job/Qpid-Java-Cpp-Test/ws/qpid/qpid/cpp/build/ship/include/qmf/Agent.h>
-- Installing: <https://builds.apache.org/job/Qpid-Java-Cpp-Test/ws/qpid/qpid/cpp/build/ship/include/qmf/AgentSession.h>
-- Installing: <https://builds.apache.org/job/Qpid-Java-Cpp-Test/ws/qpid/qpid/cpp/build/ship/include/qmf/ConsoleEvent.h>
-- Installing: <https://builds.apache.org/job/Qpid-Java-Cpp-Test/ws/qpid/qpid/cpp/build/ship/include/qmf/ConsoleSession.h>
-- Installing: <https://builds.apache.org/job/Qpid-Java-Cpp-Test/ws/qpid/qpid/cpp/build/ship/include/qmf/DataAddr.h>
-- Installing: <https://builds.apache.org/job/Qpid-Java-Cpp-Test/ws/qpid/qpid/cpp/build/ship/include/qmf/Data.h>
-- Installing: <https://builds.apache.org/job/Qpid-Java-Cpp-Test/ws/qpid/qpid/cpp/build/ship/include/qmf/exceptions.h>
-- Installing: <https://builds.apache.org/job/Qpid-Java-Cpp-Test/ws/qpid/qpid/cpp/build/ship/include/qmf/Handle.h>
-- Installing: <https://builds.apache.org/job/Qpid-Java-Cpp-Test/ws/qpid/qpid/cpp/build/ship/include/qmf/ImportExport.h>
-- Installing: <https://builds.apache.org/job/Qpid-Java-Cpp-Test/ws/qpid/qpid/cpp/build/ship/include/qmf/Query.h>
-- Installing: <https://builds.apache.org/job/Qpid-Java-Cpp-Test/ws/qpid/qpid/cpp/build/ship/include/qmf/Schema.h>
-- Installing: <https://builds.apache.org/job/Qpid-Java-Cpp-Test/ws/qpid/qpid/cpp/build/ship/include/qmf/SchemaId.h>
-- Installing: <https://builds.apache.org/job/Qpid-Java-Cpp-Test/ws/qpid/qpid/cpp/build/ship/include/qmf/SchemaMethod.h>
-- Installing: <https://builds.apache.org/job/Qpid-Java-Cpp-Test/ws/qpid/qpid/cpp/build/ship/include/qmf/SchemaProperty.h>
-- Installing: <https://builds.apache.org/job/Qpid-Java-Cpp-Test/ws/qpid/qpid/cpp/build/ship/include/qmf/SchemaTypes.h>
-- Installing: <https://builds.apache.org/job/Qpid-Java-Cpp-Test/ws/qpid/qpid/cpp/build/ship/include/qmf/Subscription.h>
-- Installing: <https://builds.apache.org/job/Qpid-Java-Cpp-Test/ws/qpid/qpid/cpp/build/ship/include/qmf/EventNotifier.h>
-- Installing: <https://builds.apache.org/job/Qpid-Java-Cpp-Test/ws/qpid/qpid/cpp/build/ship/lib/pkgconfig/qpid.pc>
-- Installing: <https://builds.apache.org/job/Qpid-Java-Cpp-Test/ws/qpid/qpid/cpp/build/ship/lib/pkgconfig/qmf2.pc>
-- Installing: <https://builds.apache.org/job/Qpid-Java-Cpp-Test/ws/qpid/qpid/cpp/build/ship/lib/cmake/Qpid/QpidConfig.cmake>
-- Installing: <https://builds.apache.org/job/Qpid-Java-Cpp-Test/ws/qpid/qpid/cpp/build/ship/lib/cmake/Qpid/QpidConfigVersion.cmake>
-- Installing: <https://builds.apache.org/job/Qpid-Java-Cpp-Test/ws/qpid/qpid/cpp/build/ship/lib/qpid/daemon/store.so.0.35>
-- Installing: <https://builds.apache.org/job/Qpid-Java-Cpp-Test/ws/qpid/qpid/cpp/build/ship/lib/qpid/daemon/store.so>
-- Set runtime path of "<https://builds.apache.org/job/Qpid-Java-Cpp-Test/ws/qpid/qpid/cpp/build/ship/lib/qpid/daemon/store.so.0.35">
to "<https://builds.apache.org/job/Qpid-Java-Cpp-Test/ws/qpid/qpid/cpp/build/ship/lib">
-- Installing: <https://builds.apache.org/job/Qpid-Java-Cpp-Test/ws/qpid/qpid/cpp/build/ship/bin/qpid-receive>
-- Set runtime path of "<https://builds.apache.org/job/Qpid-Java-Cpp-Test/ws/qpid/qpid/cpp/build/ship/bin/qpid-receive">
to "<https://builds.apache.org/job/Qpid-Java-Cpp-Test/ws/qpid/qpid/cpp/build/ship/lib">
-- Installing: <https://builds.apache.org/job/Qpid-Java-Cpp-Test/ws/qpid/qpid/cpp/build/ship/bin/qpid-send>
-- Set runtime path of "<https://builds.apache.org/job/Qpid-Java-Cpp-Test/ws/qpid/qpid/cpp/build/ship/bin/qpid-send">
to "<https://builds.apache.org/job/Qpid-Java-Cpp-Test/ws/qpid/qpid/cpp/build/ship/lib">
-- Installing: <https://builds.apache.org/job/Qpid-Java-Cpp-Test/ws/qpid/qpid/cpp/build/ship/libexec/qpid/tests/qpid-perftest>
-- Set runtime path of "<https://builds.apache.org/job/Qpid-Java-Cpp-Test/ws/qpid/qpid/cpp/build/ship/libexec/qpid/tests/qpid-perftest">
to "<https://builds.apache.org/job/Qpid-Java-Cpp-Test/ws/qpid/qpid/cpp/build/ship/lib">
-- Installing: <https://builds.apache.org/job/Qpid-Java-Cpp-Test/ws/qpid/qpid/cpp/build/ship/libexec/qpid/tests/qpid-latency-test>
-- Set runtime path of "<https://builds.apache.org/job/Qpid-Java-Cpp-Test/ws/qpid/qpid/cpp/build/ship/libexec/qpid/tests/qpid-latency-test">
to "<https://builds.apache.org/job/Qpid-Java-Cpp-Test/ws/qpid/qpid/cpp/build/ship/lib">
-- Installing: <https://builds.apache.org/job/Qpid-Java-Cpp-Test/ws/qpid/qpid/cpp/build/ship/libexec/qpid/tests/qpid-client-test>
-- Set runtime path of "<https://builds.apache.org/job/Qpid-Java-Cpp-Test/ws/qpid/qpid/cpp/build/ship/libexec/qpid/tests/qpid-client-test">
to "<https://builds.apache.org/job/Qpid-Java-Cpp-Test/ws/qpid/qpid/cpp/build/ship/lib">
-- Installing: <https://builds.apache.org/job/Qpid-Java-Cpp-Test/ws/qpid/qpid/cpp/build/ship/libexec/qpid/tests/qpid-ping>
-- Set runtime path of "<https://builds.apache.org/job/Qpid-Java-Cpp-Test/ws/qpid/qpid/cpp/build/ship/libexec/qpid/tests/qpid-ping">
to "<https://builds.apache.org/job/Qpid-Java-Cpp-Test/ws/qpid/qpid/cpp/build/ship/lib">
-- Installing: <https://builds.apache.org/job/Qpid-Java-Cpp-Test/ws/qpid/qpid/cpp/build/ship/libexec/qpid/tests/qpid-topic-listener>
-- Set runtime path of "<https://builds.apache.org/job/Qpid-Java-Cpp-Test/ws/qpid/qpid/cpp/build/ship/libexec/qpid/tests/qpid-topic-listener">
to "<https://builds.apache.org/job/Qpid-Java-Cpp-Test/ws/qpid/qpid/cpp/build/ship/lib">
-- Installing: <https://builds.apache.org/job/Qpid-Java-Cpp-Test/ws/qpid/qpid/cpp/build/ship/libexec/qpid/tests/qpid-topic-publisher>
-- Set runtime path of "<https://builds.apache.org/job/Qpid-Java-Cpp-Test/ws/qpid/qpid/cpp/build/ship/libexec/qpid/tests/qpid-topic-publisher">
to "<https://builds.apache.org/job/Qpid-Java-Cpp-Test/ws/qpid/qpid/cpp/build/ship/lib">
-- Installing: <https://builds.apache.org/job/Qpid-Java-Cpp-Test/ws/qpid/qpid/cpp/build/ship/libexec/qpid/tests/receiver>
-- Set runtime path of "<https://builds.apache.org/job/Qpid-Java-Cpp-Test/ws/qpid/qpid/cpp/build/ship/libexec/qpid/tests/receiver">
to "<https://builds.apache.org/job/Qpid-Java-Cpp-Test/ws/qpid/qpid/cpp/build/ship/lib">
-- Installing: <https://builds.apache.org/job/Qpid-Java-Cpp-Test/ws/qpid/qpid/cpp/build/ship/libexec/qpid/tests/sender>
-- Set runtime path of "<https://builds.apache.org/job/Qpid-Java-Cpp-Test/ws/qpid/qpid/cpp/build/ship/libexec/qpid/tests/sender">
to "<https://builds.apache.org/job/Qpid-Java-Cpp-Test/ws/qpid/qpid/cpp/build/ship/lib">
-- Installing: <https://builds.apache.org/job/Qpid-Java-Cpp-Test/ws/qpid/qpid/cpp/build/ship/libexec/qpid/tests/qpid-txtest>
-- Set runtime path of "<https://builds.apache.org/job/Qpid-Java-Cpp-Test/ws/qpid/qpid/cpp/build/ship/libexec/qpid/tests/qpid-txtest">
to "<https://builds.apache.org/job/Qpid-Java-Cpp-Test/ws/qpid/qpid/cpp/build/ship/lib">
-- Installing: <https://builds.apache.org/job/Qpid-Java-Cpp-Test/ws/qpid/qpid/cpp/build/ship/libexec/qpid/tests/qpid-txtest2>
-- Set runtime path of "<https://builds.apache.org/job/Qpid-Java-Cpp-Test/ws/qpid/qpid/cpp/build/ship/libexec/qpid/tests/qpid-txtest2">
to "<https://builds.apache.org/job/Qpid-Java-Cpp-Test/ws/qpid/qpid/cpp/build/ship/lib">
-- Installing: <https://builds.apache.org/job/Qpid-Java-Cpp-Test/ws/qpid/qpid/cpp/build/ship/etc/rc.d/init.d/qpidd>
-- Installing: <https://builds.apache.org/job/Qpid-Java-Cpp-Test/ws/qpid/qpid/cpp/build/ship/etc/rc.d/init.d/qpidd-primary>
-- Installing: <https://builds.apache.org/job/Qpid-Java-Cpp-Test/ws/qpid/qpid/cpp/build/ship/etc/qpid/qpidc.conf>
-- Installing: <https://builds.apache.org/job/Qpid-Java-Cpp-Test/ws/qpid/qpid/cpp/build/ship/etc/qpid/qpidd.conf>
-- Installing: <https://builds.apache.org/job/Qpid-Java-Cpp-Test/ws/qpid/qpid/cpp/build/ship/etc/sasl2/qpidd.conf>
-- Installing: <https://builds.apache.org/job/Qpid-Java-Cpp-Test/ws/qpid/qpid/cpp/build/ship/share/qpid/examples/README.txt>
-- Installing: <https://builds.apache.org/job/Qpid-Java-Cpp-Test/ws/qpid/qpid/cpp/build/ship/share/qpid/examples/qmf2/agent.cpp>
-- Installing: <https://builds.apache.org/job/Qpid-Java-Cpp-Test/ws/qpid/qpid/cpp/build/ship/share/qpid/examples/qmf2/event_driven_list_agents.cpp>
-- Installing: <https://builds.apache.org/job/Qpid-Java-Cpp-Test/ws/qpid/qpid/cpp/build/ship/share/qpid/examples/qmf2/list_agents.cpp>
-- Installing: <https://builds.apache.org/job/Qpid-Java-Cpp-Test/ws/qpid/qpid/cpp/build/ship/share/qpid/examples/qmf2/print_events.cpp>
-- Installing: <https://builds.apache.org/job/Qpid-Java-Cpp-Test/ws/qpid/qpid/cpp/build/ship/share/man/man1/qpidd.1>
-- Installing: <https://builds.apache.org/job/Qpid-Java-Cpp-Test/ws/qpid/qpid/cpp/build/ship/share/qpid/examples/README.txt>
-- Installing: <https://builds.apache.org/job/Qpid-Java-Cpp-Test/ws/qpid/qpid/cpp/build/ship/share/qpid/examples/messaging/drain.cpp>
-- Installing: <https://builds.apache.org/job/Qpid-Java-Cpp-Test/ws/qpid/qpid/cpp/build/ship/share/qpid/examples/messaging/OptionParser.h>
-- Installing: <https://builds.apache.org/job/Qpid-Java-Cpp-Test/ws/qpid/qpid/cpp/build/ship/share/qpid/examples/messaging/OptionParser.cpp>
-- Installing: <https://builds.apache.org/job/Qpid-Java-Cpp-Test/ws/qpid/qpid/cpp/build/ship/share/qpid/examples/messaging/spout.cpp>
-- Up-to-date: <https://builds.apache.org/job/Qpid-Java-Cpp-Test/ws/qpid/qpid/cpp/build/ship/share/qpid/examples/messaging/OptionParser.h>
-- Up-to-date: <https://builds.apache.org/job/Qpid-Java-Cpp-Test/ws/qpid/qpid/cpp/build/ship/share/qpid/examples/messaging/OptionParser.cpp>
-- Installing: <https://builds.apache.org/job/Qpid-Java-Cpp-Test/ws/qpid/qpid/cpp/build/ship/share/qpid/examples/messaging/map_receiver.cpp>
-- Up-to-date: <https://builds.apache.org/job/Qpid-Java-Cpp-Test/ws/qpid/qpid/cpp/build/ship/share/qpid/examples/messaging/OptionParser.h>
-- Up-to-date: <https://builds.apache.org/job/Qpid-Java-Cpp-Test/ws/qpid/qpid/cpp/build/ship/share/qpid/examples/messaging/OptionParser.cpp>
-- Installing: <https://builds.apache.org/job/Qpid-Java-Cpp-Test/ws/qpid/qpid/cpp/build/ship/share/qpid/examples/messaging/map_sender.cpp>
-- Up-to-date: <https://builds.apache.org/job/Qpid-Java-Cpp-Test/ws/qpid/qpid/cpp/build/ship/share/qpid/examples/messaging/OptionParser.h>
-- Up-to-date: <https://builds.apache.org/job/Qpid-Java-Cpp-Test/ws/qpid/qpid/cpp/build/ship/share/qpid/examples/messaging/OptionParser.cpp>
-- Installing: <https://builds.apache.org/job/Qpid-Java-Cpp-Test/ws/qpid/qpid/cpp/build/ship/share/qpid/examples/messaging/client.cpp>
-- Up-to-date: <https://builds.apache.org/job/Qpid-Java-Cpp-Test/ws/qpid/qpid/cpp/build/ship/share/qpid/examples/messaging/OptionParser.h>
-- Up-to-date: <https://builds.apache.org/job/Qpid-Java-Cpp-Test/ws/qpid/qpid/cpp/build/ship/share/qpid/examples/messaging/OptionParser.cpp>
-- Installing: <https://builds.apache.org/job/Qpid-Java-Cpp-Test/ws/qpid/qpid/cpp/build/ship/share/qpid/examples/messaging/server.cpp>
-- Up-to-date: <https://builds.apache.org/job/Qpid-Java-Cpp-Test/ws/qpid/qpid/cpp/build/ship/share/qpid/examples/messaging/OptionParser.h>
-- Up-to-date: <https://builds.apache.org/job/Qpid-Java-Cpp-Test/ws/qpid/qpid/cpp/build/ship/share/qpid/examples/messaging/OptionParser.cpp>
-- Installing: <https://builds.apache.org/job/Qpid-Java-Cpp-Test/ws/qpid/qpid/cpp/build/ship/share/qpid/examples/messaging/server_reconnect.cpp>
-- Up-to-date: <https://builds.apache.org/job/Qpid-Java-Cpp-Test/ws/qpid/qpid/cpp/build/ship/share/qpid/examples/messaging/OptionParser.h>
-- Up-to-date: <https://builds.apache.org/job/Qpid-Java-Cpp-Test/ws/qpid/qpid/cpp/build/ship/share/qpid/examples/messaging/OptionParser.cpp>
-- Installing: <https://builds.apache.org/job/Qpid-Java-Cpp-Test/ws/qpid/qpid/cpp/build/ship/share/qpid/examples/messaging/hello_world.cpp>
-- Installing: <https://builds.apache.org/job/Qpid-Java-Cpp-Test/ws/qpid/qpid/cpp/build/ship/share/qpid/examples/messaging/CMakeLists.txt>
-- Up-to-date: <https://builds.apache.org/job/Qpid-Java-Cpp-Test/ws/qpid/qpid/cpp/build/ship/share/qpid/examples/messaging/OptionParser.cpp>
-- Up-to-date: <https://builds.apache.org/job/Qpid-Java-Cpp-Test/ws/qpid/qpid/cpp/build/ship/share/qpid/examples/messaging/OptionParser.h>
-- Up-to-date: <https://builds.apache.org/job/Qpid-Java-Cpp-Test/ws/qpid/qpid/cpp/build/ship/share/qpid/examples/messaging/hello_world.cpp>
-- Installing: <https://builds.apache.org/job/Qpid-Java-Cpp-Test/ws/qpid/qpid/cpp/build/ship/share/qpid/examples/messaging/hello_xml.cpp>
-- Up-to-date: <https://builds.apache.org/job/Qpid-Java-Cpp-Test/ws/qpid/qpid/cpp/build/ship/share/qpid/examples/messaging/drain.cpp>
-- Up-to-date: <https://builds.apache.org/job/Qpid-Java-Cpp-Test/ws/qpid/qpid/cpp/build/ship/share/qpid/examples/messaging/spout.cpp>
-- Up-to-date: <https://builds.apache.org/job/Qpid-Java-Cpp-Test/ws/qpid/qpid/cpp/build/ship/share/qpid/examples/messaging/map_receiver.cpp>
-- Up-to-date: <https://builds.apache.org/job/Qpid-Java-Cpp-Test/ws/qpid/qpid/cpp/build/ship/share/qpid/examples/messaging/map_sender.cpp>
-- Up-to-date: <https://builds.apache.org/job/Qpid-Java-Cpp-Test/ws/qpid/qpid/cpp/build/ship/share/qpid/examples/messaging/client.cpp>
-- Up-to-date: <https://builds.apache.org/job/Qpid-Java-Cpp-Test/ws/qpid/qpid/cpp/build/ship/share/qpid/examples/messaging/server.cpp>
-- Up-to-date: <https://builds.apache.org/job/Qpid-Java-Cpp-Test/ws/qpid/qpid/cpp/build/ship/share/qpid/examples/messaging/server_reconnect.cpp>
[locks-and-latches] Releasing all the locks
[locks-and-latches] All the locks released
FATAL: Failed to install https://repo.maven.apache.org/maven2/org/apache/maven/apache-maven/3.0.4/apache-maven-3.0.4-bin.zip
to /home/jenkins/tools/maven/apache-maven-3.0.4
java.io.IOException: Failed to install https://repo.maven.apache.org/maven2/org/apache/maven/apache-maven/3.0.4/apache-maven-3.0.4-bin.zip
to /home/jenkins/tools/maven/apache-maven-3.0.4
	at hudson.FilePath.installIfNecessaryFrom(FilePath.java:832)
	at hudson.tools.DownloadFromUrlInstaller.performInstallation(DownloadFromUrlInstaller.java:75)
	at hudson.tools.InstallerTranslator.getToolHome(InstallerTranslator.java:68)
	at hudson.tools.ToolLocationNodeProperty.getToolHome(ToolLocationNodeProperty.java:108)
	at hudson.tools.ToolInstallation.translateFor(ToolInstallation.java:206)
	at hudson.tasks.Maven$MavenInstallation.forNode(Maven.java:624)
	at hudson.tasks.Maven.perform(Maven.java:288)
	at hudson.tasks.BuildStepMonitor$1.perform(BuildStepMonitor.java:20)
	at hudson.model.AbstractBuild$AbstractBuildExecution.perform(AbstractBuild.java:782)
	at hudson.model.Build$BuildExecution.build(Build.java:205)
	at hudson.model.Build$BuildExecution.doRun(Build.java:162)
	at hudson.model.AbstractBuild$AbstractBuildExecution.run(AbstractBuild.java:534)
	at hudson.model.Run.execute(Run.java:1738)
	at hudson.model.FreeStyleBuild.run(FreeStyleBuild.java:43)
	at hudson.model.ResourceController.execute(ResourceController.java:98)
	at hudson.model.Executor.run(Executor.java:410)
Caused by: java.io.IOException: remote file operation failed: /home/jenkins/tools/maven/apache-maven-3.0.4
at hudson.remoting.Channel@e3210c0:ubuntu-us1: java.nio.file.AccessDeniedException: /home/jenkins/tools/maven/apache-maven-3.0.4/.installedFrom
	at hudson.FilePath.act(FilePath.java:986)
	at hudson.FilePath.act(FilePath.java:968)
	at hudson.FilePath.deleteContents(FilePath.java:1183)
	at hudson.FilePath.installIfNecessaryFrom(FilePath.java:796)
	... 15 more
Caused by: java.nio.file.AccessDeniedException: /home/jenkins/tools/maven/apache-maven-3.0.4/.installedFrom
	at sun.nio.fs.UnixException.translateToIOException(UnixException.java:84)
	at sun.nio.fs.UnixException.rethrowAsIOException(UnixException.java:102)
	at sun.nio.fs.UnixException.rethrowAsIOException(UnixException.java:107)
	at sun.nio.fs.UnixFileSystemProvider.implDelete(UnixFileSystemProvider.java:244)
	at sun.nio.fs.AbstractFileSystemProvider.delete(AbstractFileSystemProvider.java:103)
	at java.nio.file.Files.delete(Files.java:1077)
	at sun.reflect.GeneratedMethodAccessor608.invoke(Unknown Source)
	at sun.reflect.DelegatingMethodAccessorImpl.invoke(DelegatingMethodAccessorImpl.java:43)
	at java.lang.reflect.Method.invoke(Method.java:606)
	at hudson.Util.deleteFile(Util.java:255)
	at hudson.FilePath.deleteRecursive(FilePath.java:1203)
	at hudson.FilePath.deleteContentsRecursive(FilePath.java:1212)
	at hudson.FilePath.access$1100(FilePath.java:190)
	at hudson.FilePath$15.invoke(FilePath.java:1186)
	at hudson.FilePath$15.invoke(FilePath.java:1183)
	at hudson.FilePath$FileCallableWrapper.call(FilePath.java:2719)
	at hudson.remoting.UserRequest.perform(UserRequest.java:120)
	at hudson.remoting.UserRequest.perform(UserRequest.java:48)
	at hudson.remoting.Request$2.run(Request.java:326)
	at hudson.remoting.InterceptingExecutorService$1.call(InterceptingExecutorService.java:68)
	at java.util.concurrent.FutureTask.run(FutureTask.java:262)
	at java.util.concurrent.ThreadPoolExecutor.runWorker(ThreadPoolExecutor.java:1145)
	at java.util.concurrent.ThreadPoolExecutor$Worker.run(ThreadPoolExecutor.java:615)
	at java.lang.Thread.run(Thread.java:745)
	at ......remote call to ubuntu-us1(Native Method)
	at hudson.remoting.Channel.attachCallSiteStackTrace(Channel.java:1416)
	at hudson.remoting.UserResponse.retrieve(UserRequest.java:220)
	at hudson.remoting.Channel.call(Channel.java:781)
	at hudson.FilePath.act(FilePath.java:979)
	... 18 more
Archiving artifacts
Recording test results
ERROR: Step ‘Publish JUnit test result report’ failed: No test report files were found.
Configuration error?


Mime
View raw message