qpid-notifications mailing list archives

Site index · List index
Message view « Date » · « Thread »
Top « Date » · « Thread »
From Apache Jenkins Server <jenk...@builds.apache.org>
Subject Build failed in Jenkins: Qpid-Java-Java-MMS-TestMatrix » JDK 1.7 (latest),ubuntu,java-mms.0-9-1 #3028
Date Mon, 11 Apr 2016 17:25:24 GMT
See <https://builds.apache.org/job/Qpid-Java-Java-MMS-TestMatrix/jdk=JDK%201.7%20(latest),label=ubuntu,profile=java-mms.0-9-1/3028/changes>

Changes:

[kwall] QPID-7155: [Java Broker] Change ticker implementation to separate slow protocol header
detection from reader/writer idle timeouts established by connection tune

------------------------------------------
[...truncated 4320 lines...]
A         perftests/src/main/java/org/apache/qpid/disttest/message/ParticipantResult.java
A         perftests/src/main/java/org/apache/qpid/disttest/message/CreateConsumerCommand.java
A         perftests/src/main/java/org/apache/qpid/disttest/message/Command.java
A         perftests/src/main/java/org/apache/qpid/disttest/message/CommandType.java
A         perftests/src/main/java/org/apache/qpid/disttest/message/ProducerParticipantResult.java
A         perftests/src/main/java/org/apache/qpid/disttest/ConfigFileHelper.java
A         perftests/src/main/java/org/apache/qpid/disttest/db
A         perftests/src/main/java/org/apache/qpid/disttest/db/ResultsDbWriter.java
A         perftests/src/main/java/test-utils.js
A         perftests/src/main/resources
A         perftests/src/main/resources/perftests.properties
A         perftests/src/main/resources/logback.xml
A         perftests/src/main/assembly
A         perftests/src/main/assembly/LICENSE
A         perftests/src/main/assembly/dependency-verification
A         perftests/src/main/assembly/dependency-verification/DEPENDENCIES_REFERENCE
A         perftests/src/main/assembly/qpid-perftests-bin.xml
A         perftests/src/main/assembly/NOTICE
A         perftests/src/test
A         perftests/src/test/java
A         perftests/src/test/java/org
A         perftests/src/test/java/org/apache
A         perftests/src/test/java/org/apache/qpid
A         perftests/src/test/java/org/apache/qpid/disttest
A         perftests/src/test/java/org/apache/qpid/disttest/PerfTestConstants.java
A         perftests/src/test/java/org/apache/qpid/disttest/jms
A         perftests/src/test/java/org/apache/qpid/disttest/jms/JmsMessageAdaptorTest.java
A         perftests/src/test/java/org/apache/qpid/disttest/client
A         perftests/src/test/java/org/apache/qpid/disttest/client/ProducerParticipantTest.java
A         perftests/src/test/java/org/apache/qpid/disttest/client/property
A         perftests/src/test/java/org/apache/qpid/disttest/client/property/SimplePropertyValueTest.java
A         perftests/src/test/java/org/apache/qpid/disttest/client/property/ListPropertyValueTest.java
A         perftests/src/test/java/org/apache/qpid/disttest/client/property/RangePropertyValueTest.java
A         perftests/src/test/java/org/apache/qpid/disttest/client/property/RandomPropertyValueTest.java
A         perftests/src/test/java/org/apache/qpid/disttest/client/property/PropertyValueFactoryTest.java
A         perftests/src/test/java/org/apache/qpid/disttest/client/ParticipantResultFactoryTest.java
A         perftests/src/test/java/org/apache/qpid/disttest/client/ParticipantRegistryTest.java
A         perftests/src/test/java/org/apache/qpid/disttest/client/ConsumerParticipantTest.java
A         perftests/src/test/java/org/apache/qpid/disttest/client/ClientCommandVisitorTest.java
A         perftests/src/test/java/org/apache/qpid/disttest/client/ParticipantExecutorTest.java
A         perftests/src/test/java/org/apache/qpid/disttest/client/ClientTest.java
A         perftests/src/test/java/org/apache/qpid/disttest/client/ParticipantTestHelper.java
A         perftests/src/test/java/org/apache/qpid/disttest/client/MessageProviderTest.java
A         perftests/src/test/java/org/apache/qpid/disttest/ArgumentParserTest.java
A         perftests/src/test/java/org/apache/qpid/disttest/VisitorTest.java
A         perftests/src/test/java/org/apache/qpid/disttest/results
A         perftests/src/test/java/org/apache/qpid/disttest/results/aggregation
A         perftests/src/test/java/org/apache/qpid/disttest/results/aggregation/ParticipantResultAggregatorTest.java
A         perftests/src/test/java/org/apache/qpid/disttest/results/aggregation/TestResultAggregatorTest.java
A         perftests/src/test/java/org/apache/qpid/disttest/results/aggregation/AggregatorTest.java
A         perftests/src/test/java/org/apache/qpid/disttest/results/aggregation/SeriesStatisticsTest.java
A         perftests/src/test/java/org/apache/qpid/disttest/results/ResultsTestFixture.java
A         perftests/src/test/java/org/apache/qpid/disttest/results/ResultsCsvWriterTest.java
A         perftests/src/test/java/org/apache/qpid/disttest/results/formatting
A         perftests/src/test/java/org/apache/qpid/disttest/results/formatting/expectedOutput.csv
A         perftests/src/test/java/org/apache/qpid/disttest/results/formatting/CSVOrderParticipantResultComparatorTest.java
A         perftests/src/test/java/org/apache/qpid/disttest/results/formatting/CSVFormatterTest.java
A         perftests/src/test/java/org/apache/qpid/disttest/results/ResultsXmlWriterTest.java
A         perftests/src/test/java/org/apache/qpid/disttest/controller
A         perftests/src/test/java/org/apache/qpid/disttest/controller/ParticipatingClientsTest.java
A         perftests/src/test/java/org/apache/qpid/disttest/controller/OrdinaryTestRunnerTest.java
A         perftests/src/test/java/org/apache/qpid/disttest/controller/ControllerTest.java
A         perftests/src/test/java/org/apache/qpid/disttest/controller/config
A         perftests/src/test/java/org/apache/qpid/disttest/controller/config/ConnectionConfigTest.java
A         perftests/src/test/java/org/apache/qpid/disttest/controller/config/MessageProviderConfigTest.java
A         perftests/src/test/java/org/apache/qpid/disttest/controller/config/ConfigTestUtils.java
A         perftests/src/test/java/org/apache/qpid/disttest/controller/config/ConfigReaderTest.java
A         perftests/src/test/java/org/apache/qpid/disttest/controller/config/JavaScriptConfigEvaluatorTest-test-config.js
A         perftests/src/test/java/org/apache/qpid/disttest/controller/config/IterationValueTest.java
A         perftests/src/test/java/org/apache/qpid/disttest/controller/config/sampleConfig.json
A         perftests/src/test/java/org/apache/qpid/disttest/controller/config/ConfigReaderTest-test-config.js
A         perftests/src/test/java/org/apache/qpid/disttest/controller/config/ClientConfigTest.java
A         perftests/src/test/java/org/apache/qpid/disttest/controller/config/TestInstanceTest.java
A         perftests/src/test/java/org/apache/qpid/disttest/controller/config/ConfigTest.java
A         perftests/src/test/java/org/apache/qpid/disttest/controller/config/TestConfigTest.java
A         perftests/src/test/java/org/apache/qpid/disttest/controller/config/ProducerConfigTest.java
A         perftests/src/test/java/org/apache/qpid/disttest/controller/config/SessionConfigTest.java
A         perftests/src/test/java/org/apache/qpid/disttest/controller/config/JavaScriptConfigEvaluatorTest.java
A         perftests/src/test/java/org/apache/qpid/disttest/controller/config/ConsumerConfigTest.java
A         perftests/src/test/java/org/apache/qpid/disttest/controller/HillClimberTest.java
A         perftests/src/test/java/org/apache/qpid/disttest/controller/ClientRegistryTest.java
A         perftests/src/test/java/org/apache/qpid/disttest/message
A         perftests/src/test/java/org/apache/qpid/disttest/message/ParticipantResultTest.java
A         perftests/src/test/java/org/apache/qpid/disttest/message/JsonHandlerTest.java
A         perftests/src/test/java/org/apache/qpid/disttest/ConfigFileHelperTest.java
A         perftests/src/test/java/org/apache/qpid/disttest/ConfigFileTestHelper.java
A         perftests/src/test/java/org/apache/qpid/disttest/db
A         perftests/src/test/java/org/apache/qpid/disttest/db/ResultsDbWriterTest.java
A         perftests/pom.xml
A         perftests/visualisation-jfc
A         perftests/visualisation-jfc/src
A         perftests/visualisation-jfc/src/test
A         perftests/visualisation-jfc/src/test/java
A         perftests/visualisation-jfc/src/test/java/org
A         perftests/visualisation-jfc/src/test/java/org/apache
A         perftests/visualisation-jfc/src/test/java/org/apache/qpid
A         perftests/visualisation-jfc/src/test/java/org/apache/qpid/disttest
A         perftests/visualisation-jfc/src/test/java/org/apache/qpid/disttest/charting
A         perftests/visualisation-jfc/src/test/java/org/apache/qpid/disttest/charting/seriesbuilder
A         perftests/visualisation-jfc/src/test/java/org/apache/qpid/disttest/charting/seriesbuilder/JdbcUrlGeneratorTest.java
A         perftests/visualisation-jfc/src/test/java/org/apache/qpid/disttest/charting/seriesbuilder/SeriesRowTest.java
A         perftests/visualisation-jfc/src/test/java/org/apache/qpid/disttest/charting/seriesbuilder/JdbcSeriesBuilderTest.java
A         perftests/visualisation-jfc/src/test/java/org/apache/qpid/disttest/charting/chartbuilder
A         perftests/visualisation-jfc/src/test/java/org/apache/qpid/disttest/charting/chartbuilder/TimeSeriesBuilderCallbackTest.java
A         perftests/visualisation-jfc/src/test/java/org/apache/qpid/disttest/charting/chartbuilder/ChartBuilderFactoryTest.java
A         perftests/visualisation-jfc/src/test/java/org/apache/qpid/disttest/charting/chartbuilder/BaseChartBuilderTest.java
A         perftests/visualisation-jfc/src/test/java/org/apache/qpid/disttest/charting/chartbuilder/ColorFactoryTest.java
A         perftests/visualisation-jfc/src/test/java/org/apache/qpid/disttest/charting/chartbuilder/ChartProductionTest.java
A         perftests/visualisation-jfc/src/test/java/org/apache/qpid/disttest/charting/definition
A         perftests/visualisation-jfc/src/test/java/org/apache/qpid/disttest/charting/definition/SeriesDefinitionCreatorTest.java
A         perftests/visualisation-jfc/src/test/java/org/apache/qpid/disttest/charting/definition/ChartingDefinitionCreatorTest.java
A         perftests/visualisation-jfc/src/test/java/org/apache/qpid/disttest/charting/writer
A         perftests/visualisation-jfc/src/test/java/org/apache/qpid/disttest/charting/writer/ChartWriterTest.java
AU        perftests/visualisation-jfc/src/test/java/org/apache/qpid/disttest/charting/writer/expected-chart-summary.html
A         perftests/visualisation-jfc/src/main
A         perftests/visualisation-jfc/src/main/assembly
A         perftests/visualisation-jfc/src/main/assembly/qpid-perftests-visualisation-jfc-bin.xml
A         perftests/visualisation-jfc/src/main/assembly/NOTICE
A         perftests/visualisation-jfc/src/main/assembly/LICENSE
A         perftests/visualisation-jfc/src/main/java
A         perftests/visualisation-jfc/src/main/java/org
A         perftests/visualisation-jfc/src/main/java/org/apache
A         perftests/visualisation-jfc/src/main/java/org/apache/qpid
A         perftests/visualisation-jfc/src/main/java/org/apache/qpid/disttest
A         perftests/visualisation-jfc/src/main/java/org/apache/qpid/disttest/charting
A         perftests/visualisation-jfc/src/main/java/org/apache/qpid/disttest/charting/chartbuilder
A         perftests/visualisation-jfc/src/main/java/org/apache/qpid/disttest/charting/chartbuilder/ColorFactory.java
A         perftests/visualisation-jfc/src/main/java/org/apache/qpid/disttest/charting/chartbuilder/LineChart3DBuilder.java
A         perftests/visualisation-jfc/src/main/java/org/apache/qpid/disttest/charting/chartbuilder/TimeSeriesHolder.java
A         perftests/visualisation-jfc/src/main/java/org/apache/qpid/disttest/charting/chartbuilder/ChartBuilder.java
A         perftests/visualisation-jfc/src/main/java/org/apache/qpid/disttest/charting/chartbuilder/TimeSeriesLineChartBuilder.java
A         perftests/visualisation-jfc/src/main/java/org/apache/qpid/disttest/charting/chartbuilder/CategoryDataSetBasedChartBuilder.java
A         perftests/visualisation-jfc/src/main/java/org/apache/qpid/disttest/charting/chartbuilder/SeriesPainter.java
A         perftests/visualisation-jfc/src/main/java/org/apache/qpid/disttest/charting/chartbuilder/SeriesStrokeAndPaintApplier.java
A         perftests/visualisation-jfc/src/main/java/org/apache/qpid/disttest/charting/chartbuilder/LineChartBuilder.java
A         perftests/visualisation-jfc/src/main/java/org/apache/qpid/disttest/charting/chartbuilder/BarChart3DBuilder.java
A         perftests/visualisation-jfc/src/main/java/org/apache/qpid/disttest/charting/chartbuilder/BarChartBuilder.java
A         perftests/visualisation-jfc/src/main/java/org/apache/qpid/disttest/charting/chartbuilder/XYDataSetBasedChartBuilder.java
A         perftests/visualisation-jfc/src/main/java/org/apache/qpid/disttest/charting/chartbuilder/ChartBuilderFactory.java
A         perftests/visualisation-jfc/src/main/java/org/apache/qpid/disttest/charting/chartbuilder/XYLineChartBuilder.java
A         perftests/visualisation-jfc/src/main/java/org/apache/qpid/disttest/charting/chartbuilder/CategoryStrokeAndPaintApplier.java
A         perftests/visualisation-jfc/src/main/java/org/apache/qpid/disttest/charting/chartbuilder/StatisticalBarChartBuilder.java
A         perftests/visualisation-jfc/src/main/java/org/apache/qpid/disttest/charting/chartbuilder/BaseChartBuilder.java
A         perftests/visualisation-jfc/src/main/java/org/apache/qpid/disttest/charting/definition
A         perftests/visualisation-jfc/src/main/java/org/apache/qpid/disttest/charting/definition/SeriesDefinition.java
A         perftests/visualisation-jfc/src/main/java/org/apache/qpid/disttest/charting/definition/SeriesDefinitionCreator.java
A         perftests/visualisation-jfc/src/main/java/org/apache/qpid/disttest/charting/definition/ChartingDefinition.java
A         perftests/visualisation-jfc/src/main/java/org/apache/qpid/disttest/charting/definition/ChartingDefinitionCreator.java
A         perftests/visualisation-jfc/src/main/java/org/apache/qpid/disttest/charting/writer
A         perftests/visualisation-jfc/src/main/java/org/apache/qpid/disttest/charting/writer/ChartWriter.java
A         perftests/visualisation-jfc/src/main/java/org/apache/qpid/disttest/charting/ChartingUtil.java
A         perftests/visualisation-jfc/src/main/java/org/apache/qpid/disttest/charting/ChartingException.java
A         perftests/visualisation-jfc/src/main/java/org/apache/qpid/disttest/charting/seriesbuilder
A         perftests/visualisation-jfc/src/main/java/org/apache/qpid/disttest/charting/seriesbuilder/SeriesBuilder.java
A         perftests/visualisation-jfc/src/main/java/org/apache/qpid/disttest/charting/seriesbuilder/SeriesRow.java
A         perftests/visualisation-jfc/src/main/java/org/apache/qpid/disttest/charting/seriesbuilder/DatasetHolder.java
A         perftests/visualisation-jfc/src/main/java/org/apache/qpid/disttest/charting/seriesbuilder/JdbcSeriesBuilder.java
A         perftests/visualisation-jfc/src/main/java/org/apache/qpid/disttest/charting/seriesbuilder/JdbcUrlGenerator.java
A         perftests/visualisation-jfc/src/main/java/org/apache/qpid/disttest/charting/ChartType.java
A         perftests/visualisation-jfc/pom.xml
A         perftests/etc
A         perftests/etc/perftests-jndi-qpid-jms-client.properties
A         perftests/etc/perftests-jndi.properties
A         perftests/etc/testdefs
A         perftests/etc/testdefs/defaultTests.js
AU        perftests/etc/json_config_tool.py
A         perftests/etc/chartdefs
A         perftests/etc/chartdefs/timeseries
A         perftests/etc/chartdefs/timeseries/combined_transient_autoack_ssl.chartdef
A         perftests/etc/chartdefs/timeseries/combined_transient_autoack_plain.chartdef
A         perftests/etc/chartdefs/timeseries/combined_persistent_transaction_ssl.chartdef
A         perftests/etc/chartdefs/timeseries/combined_persistent_transaction_plain.chartdef
AU        NOTICE
 U        .
At revision 1738607
[locks-and-latches] Checking to see if we really have the locks
[locks-and-latches] Have all the locks, build can start
[java-mms.0-9-1] $ /bin/bash -xe /tmp/hudson4924178246336053654.sh
+ df -H
Filesystem      Size  Used Avail Use% Mounted on
udev            8.5G  4.1k  8.5G   1% /dev
tmpfs           1.7G  451k  1.7G   1% /run
/dev/vda1        27G   19G  7.1G  72% /
none            4.1k     0  4.1k   0% /sys/fs/cgroup
none            5.3M     0  5.3M   0% /run/lock
none            8.5G     0  8.5G   0% /run/shm
none            105M     0  105M   0% /run/user
/dev/vdb1       1.1T  166G  838G  17% /home
[locks-and-latches] Releasing all the locks
[locks-and-latches] All the locks released
FATAL: Failed to install https://repo.maven.apache.org/maven2/org/apache/maven/apache-maven/3.0.4/apache-maven-3.0.4-bin.zip
to /home/jenkins/tools/maven/apache-maven-3.0.4
java.io.IOException: Failed to install https://repo.maven.apache.org/maven2/org/apache/maven/apache-maven/3.0.4/apache-maven-3.0.4-bin.zip
to /home/jenkins/tools/maven/apache-maven-3.0.4
	at hudson.FilePath.installIfNecessaryFrom(FilePath.java:832)
	at hudson.tools.DownloadFromUrlInstaller.performInstallation(DownloadFromUrlInstaller.java:75)
	at hudson.tools.InstallerTranslator.getToolHome(InstallerTranslator.java:68)
	at hudson.tools.ToolLocationNodeProperty.getToolHome(ToolLocationNodeProperty.java:108)
	at hudson.tools.ToolInstallation.translateFor(ToolInstallation.java:206)
	at hudson.tasks.Maven$MavenInstallation.forNode(Maven.java:624)
	at hudson.tasks.Maven.perform(Maven.java:288)
	at hudson.tasks.BuildStepMonitor$1.perform(BuildStepMonitor.java:20)
	at hudson.model.AbstractBuild$AbstractBuildExecution.perform(AbstractBuild.java:782)
	at hudson.model.Build$BuildExecution.build(Build.java:205)
	at hudson.model.Build$BuildExecution.doRun(Build.java:162)
	at hudson.model.AbstractBuild$AbstractBuildExecution.run(AbstractBuild.java:534)
	at hudson.model.Run.execute(Run.java:1738)
	at hudson.matrix.MatrixRun.run(MatrixRun.java:146)
	at hudson.model.ResourceController.execute(ResourceController.java:98)
	at hudson.model.Executor.run(Executor.java:410)
Caused by: java.io.IOException: remote file operation failed: /home/jenkins/tools/maven/apache-maven-3.0.4
at hudson.remoting.Channel@e3210c0:ubuntu-us1: java.nio.file.AccessDeniedException: /home/jenkins/tools/maven/apache-maven-3.0.4/.installedFrom
	at hudson.FilePath.act(FilePath.java:986)
	at hudson.FilePath.act(FilePath.java:968)
	at hudson.FilePath.deleteContents(FilePath.java:1183)
	at hudson.FilePath.installIfNecessaryFrom(FilePath.java:796)
	... 15 more
Caused by: java.nio.file.AccessDeniedException: /home/jenkins/tools/maven/apache-maven-3.0.4/.installedFrom
	at sun.nio.fs.UnixException.translateToIOException(UnixException.java:84)
	at sun.nio.fs.UnixException.rethrowAsIOException(UnixException.java:102)
	at sun.nio.fs.UnixException.rethrowAsIOException(UnixException.java:107)
	at sun.nio.fs.UnixFileSystemProvider.implDelete(UnixFileSystemProvider.java:244)
	at sun.nio.fs.AbstractFileSystemProvider.delete(AbstractFileSystemProvider.java:103)
	at java.nio.file.Files.delete(Files.java:1077)
	at sun.reflect.GeneratedMethodAccessor1048.invoke(Unknown Source)
	at sun.reflect.DelegatingMethodAccessorImpl.invoke(DelegatingMethodAccessorImpl.java:43)
	at java.lang.reflect.Method.invoke(Method.java:606)
	at hudson.Util.deleteFile(Util.java:255)
	at hudson.FilePath.deleteRecursive(FilePath.java:1203)
	at hudson.FilePath.deleteContentsRecursive(FilePath.java:1212)
	at hudson.FilePath.access$1100(FilePath.java:190)
	at hudson.FilePath$15.invoke(FilePath.java:1186)
	at hudson.FilePath$15.invoke(FilePath.java:1183)
	at hudson.FilePath$FileCallableWrapper.call(FilePath.java:2719)
	at hudson.remoting.UserRequest.perform(UserRequest.java:120)
	at hudson.remoting.UserRequest.perform(UserRequest.java:48)
	at hudson.remoting.Request$2.run(Request.java:326)
	at hudson.remoting.InterceptingExecutorService$1.call(InterceptingExecutorService.java:68)
	at java.util.concurrent.FutureTask.run(FutureTask.java:262)
	at java.util.concurrent.ThreadPoolExecutor.runWorker(ThreadPoolExecutor.java:1145)
	at java.util.concurrent.ThreadPoolExecutor$Worker.run(ThreadPoolExecutor.java:615)
	at java.lang.Thread.run(Thread.java:745)
	at ......remote call to ubuntu-us1(Native Method)
	at hudson.remoting.Channel.attachCallSiteStackTrace(Channel.java:1416)
	at hudson.remoting.UserResponse.retrieve(UserRequest.java:220)
	at hudson.remoting.Channel.call(Channel.java:781)
	at hudson.FilePath.act(FilePath.java:979)
	... 18 more
Archiving artifacts
Recording test results
ERROR: Step ‘Publish JUnit test result report’ failed: No test report files were found.
Configuration error?


Mime
View raw message