qpid-notifications mailing list archives

Site index · List index
Message view « Date » · « Thread »
Top « Date » · « Thread »
From Apache Jenkins Server <jenk...@builds.apache.org>
Subject Build failed in Jenkins: Qpid-proton-c #946
Date Sun, 24 Jan 2016 08:23:20 GMT
See <https://builds.apache.org/job/Qpid-proton-c/946/changes>

Changes:

[cliffjansen] PROTON-1102: C++ binding removal of "_t" from xxx_t

------------------------------------------
[...truncated 41 lines...]
NOTICE
README.md
RELEASE.md
TODO
appveyor.yml
bin
config.bat.in
config.sh.in
contrib
cpp.cmake
design
docs
examples
pom.xml
proton-c
proton-j
tests
tools
version.txt
-- The C compiler identification is GNU
-- Check for working C compiler: /usr/bin/gcc
-- Check for working C compiler: /usr/bin/gcc -- works
-- Detecting C compiler ABI info
-- Detecting C compiler ABI info - done
-- The CXX compiler identification is GNU
-- Check for working CXX compiler: /usr/bin/c++
-- Check for working CXX compiler: /usr/bin/c++ -- works
-- Detecting CXX compiler ABI info
-- Detecting CXX compiler ABI info - done
-- Build type is "DEBUG"
-- PN_VERSION: 0.12.0 (SNAPSHOT)
-- Found Java: /home/jenkins/jenkins-slave/tools/hudson.model.JDK/latest1.7/bin/java 
-- Can't locate the valgrind command; no run-time error detection
-- checking for module 'openssl'
--   found openssl, version 1.0.1
-- Found OpenSSL: /usr/lib/x86_64-linux-gnu/libssl.so;/usr/lib/x86_64-linux-gnu/libcrypto.so
(found version "1..1")
-- Found PythonInterp: /usr/bin/python (found version "2.7.3")
-- Found SWIG: /usr/bin/swig2.0 (found version "2.0.4")
-- Found CyrusSASL: /usr/lib/x86_64-linux-gnu/libsasl2.so 
-- Looking for clock_gettime
-- Looking for clock_gettime - not found.
-- Looking for clock_gettime in rt
-- Looking for clock_gettime in rt - found
-- Looking for strerror_r
-- Looking for strerror_r - found
-- Looking for atoll
-- Looking for atoll - found
-- Node.js (http://nodejs.org) is not installed: can't build JavaScript binding
-- Found PythonLibs: /usr/lib/libpython2.7.so (Required is exact version "2.7.3")
-e:1: Use RbConfig instead of obsolete and deprecated Config.
-e:1: Use RbConfig instead of obsolete and deprecated Config.
-e:1: Use RbConfig instead of obsolete and deprecated Config.
-e:1: Use RbConfig instead of obsolete and deprecated Config.
-e:1: Use RbConfig instead of obsolete and deprecated Config.
-e:1: Use RbConfig instead of obsolete and deprecated Config.
-e:1: Use RbConfig instead of obsolete and deprecated Config.
-e:1: Use RbConfig instead of obsolete and deprecated Config.
-e:1: Use RbConfig instead of obsolete and deprecated Config.
-e:1: Use RbConfig instead of obsolete and deprecated Config.
-- Could NOT find Ruby (missing:  RUBY_LIBRARY) (found version "1.9.1")
-- Found Perl: /usr/bin/perl 
-- Could NOT find PerlLibs (missing:  PERL_LIBRARY) (found version "5.14.2")
-- Trying alternative search for Perl
-- Looking for libperl.so.5.14.2
-- Found PerlLibs: /usr/lib/libperl.so.5.14.2
-- Performing Test HAS_LONG_LONG
-- Performing Test HAS_LONG_LONG - Failed
-- Performing Test HAS_STD_PTR
-- Performing Test HAS_STD_PTR - Failed
-- Could NOT find Doxygen (missing:  DOXYGEN_EXECUTABLE) 
-- Could NOT find Doxygen (missing:  DOXYGEN_EXECUTABLE) 
-- Looking for include files INTTYPES_AVAILABLE
-- Looking for include files INTTYPES_AVAILABLE - found
-- The tox tool is not available - skipping the python-tox-tests
-- Cannot find ruby, skipping ruby tests
-- Configuring done
-- Generating done
-- Build files have been written to: /x1/jenkins/jenkins-slave/workspace/Qpid-proton-c/build
Scanning dependencies of target proton-j
[  1%] Building Java objects for proton-j.jar
Note: Some input files use or override a deprecated API.
Note: Recompile with -Xlint:deprecation for details.
Note: Some input files use unchecked or unsafe operations.
Note: Recompile with -Xlint:unchecked for details.
[  2%] Generating CMakeFiles/proton-j.dir/java_class_filelist
[  2%] Creating Java archive proton-j-0.12.0.jar
Rebuilding proton-j-0.12.0.jar to include missing resources
[  2%] Built target proton-j
[  2%] Generating src/protocol.h
[  3%] Generating src/encodings.h
Scanning dependencies of target qpid-proton
[  3%] Building C object proton-c/CMakeFiles/qpid-proton.dir/src/object/object.c.o
[  4%] Building C object proton-c/CMakeFiles/qpid-proton.dir/src/object/list.c.o
[  5%] Building C object proton-c/CMakeFiles/qpid-proton.dir/src/object/map.c.o
[  5%] Building C object proton-c/CMakeFiles/qpid-proton.dir/src/object/string.c.o
[  6%] Building C object proton-c/CMakeFiles/qpid-proton.dir/src/object/iterator.c.o
[  6%] Building C object proton-c/CMakeFiles/qpid-proton.dir/src/object/record.c.o
[  7%] Building C object proton-c/CMakeFiles/qpid-proton.dir/src/log.c.o
[  8%] Building C object proton-c/CMakeFiles/qpid-proton.dir/src/util.c.o
[  8%] Building C object proton-c/CMakeFiles/qpid-proton.dir/src/url.c.o
[  9%] Building C object proton-c/CMakeFiles/qpid-proton.dir/src/error.c.o
[ 10%] Building C object proton-c/CMakeFiles/qpid-proton.dir/src/buffer.c.o
[ 10%] Building C object proton-c/CMakeFiles/qpid-proton.dir/src/parser.c.o
[ 11%] Building C object proton-c/CMakeFiles/qpid-proton.dir/src/scanner.c.o
[ 12%] Building C object proton-c/CMakeFiles/qpid-proton.dir/src/types.c.o
[ 12%] Building C object proton-c/CMakeFiles/qpid-proton.dir/src/framing/framing.c.o
[ 13%] Building C object proton-c/CMakeFiles/qpid-proton.dir/src/codec/codec.c.o
[ 13%] Building C object proton-c/CMakeFiles/qpid-proton.dir/src/codec/decoder.c.o
[ 14%] Building C object proton-c/CMakeFiles/qpid-proton.dir/src/codec/encoder.c.o
[ 15%] Building C object proton-c/CMakeFiles/qpid-proton.dir/src/dispatcher/dispatcher.c.o
[ 15%] Building C object proton-c/CMakeFiles/qpid-proton.dir/src/engine/engine.c.o
[ 16%] Building C object proton-c/CMakeFiles/qpid-proton.dir/src/events/event.c.o
[ 17%] Building C object proton-c/CMakeFiles/qpid-proton.dir/src/transport/autodetect.c.o
[ 17%] Building C object proton-c/CMakeFiles/qpid-proton.dir/src/transport/transport.c.o
[ 18%] Building C object proton-c/CMakeFiles/qpid-proton.dir/src/message/message.c.o
[ 19%] Building C object proton-c/CMakeFiles/qpid-proton.dir/src/reactor/reactor.c.o
[ 19%] Building C object proton-c/CMakeFiles/qpid-proton.dir/src/reactor/handler.c.o
[ 20%] Building C object proton-c/CMakeFiles/qpid-proton.dir/src/reactor/connection.c.o
[ 20%] Building C object proton-c/CMakeFiles/qpid-proton.dir/src/reactor/acceptor.c.o
[ 21%] Building C object proton-c/CMakeFiles/qpid-proton.dir/src/reactor/timer.c.o
[ 22%] Building C object proton-c/CMakeFiles/qpid-proton.dir/src/handlers/handshaker.c.o
[ 22%] Building C object proton-c/CMakeFiles/qpid-proton.dir/src/handlers/iohandler.c.o
[ 23%] Building C object proton-c/CMakeFiles/qpid-proton.dir/src/handlers/flowcontroller.c.o
[ 24%] Building C object proton-c/CMakeFiles/qpid-proton.dir/src/messenger/messenger.c.o
[ 24%] Building C object proton-c/CMakeFiles/qpid-proton.dir/src/messenger/subscription.c.o
[ 25%] Building C object proton-c/CMakeFiles/qpid-proton.dir/src/messenger/store.c.o
[ 26%] Building C object proton-c/CMakeFiles/qpid-proton.dir/src/messenger/transform.c.o
[ 26%] Building C object proton-c/CMakeFiles/qpid-proton.dir/src/selectable.c.o
[ 27%] Building C object proton-c/CMakeFiles/qpid-proton.dir/src/posix/io.c.o
[ 27%] Building C object proton-c/CMakeFiles/qpid-proton.dir/src/posix/selector.c.o
[ 28%] Building C object proton-c/CMakeFiles/qpid-proton.dir/src/platform.c.o
[ 29%] Building C object proton-c/CMakeFiles/qpid-proton.dir/src/sasl/sasl.c.o
[ 29%] Building C object proton-c/CMakeFiles/qpid-proton.dir/src/sasl/cyrus_sasl.c.o
[ 30%] Building C object proton-c/CMakeFiles/qpid-proton.dir/src/ssl/openssl.c.o
Linking C shared library libqpid-proton.so
[ 30%] Built target qpid-proton
Scanning dependencies of target proton-dump
[ 31%] Building C object proton-c/CMakeFiles/proton-dump.dir/src/proton-dump.c.o
Linking C executable proton-dump
[ 31%] Built target proton-dump
Scanning dependencies of target qpid-proton-cpp
[ 32%] Building CXX object proton-c/bindings/cpp/CMakeFiles/qpid-proton-cpp.dir/src/acceptor.cpp.o
[ 33%] Building CXX object proton-c/bindings/cpp/CMakeFiles/qpid-proton-cpp.dir/src/scalar.cpp.o
[ 33%] Building CXX object proton-c/bindings/cpp/CMakeFiles/qpid-proton-cpp.dir/src/blocking_connection.cpp.o
[ 34%] Building CXX object proton-c/bindings/cpp/CMakeFiles/qpid-proton-cpp.dir/src/blocking_connection_impl.cpp.o
[ 34%] Building CXX object proton-c/bindings/cpp/CMakeFiles/qpid-proton-cpp.dir/src/blocking_fetcher.cpp.o
[ 35%] Building CXX object proton-c/bindings/cpp/CMakeFiles/qpid-proton-cpp.dir/src/blocking_link.cpp.o
[ 36%] Building CXX object proton-c/bindings/cpp/CMakeFiles/qpid-proton-cpp.dir/src/blocking_receiver.cpp.o
[ 36%] Building CXX object proton-c/bindings/cpp/CMakeFiles/qpid-proton-cpp.dir/src/blocking_sender.cpp.o
[ 37%] Building CXX object proton-c/bindings/cpp/CMakeFiles/qpid-proton-cpp.dir/src/connection.cpp.o
[ 38%] Building CXX object proton-c/bindings/cpp/CMakeFiles/qpid-proton-cpp.dir/src/connection_options.cpp.o
[ 38%] Building CXX object proton-c/bindings/cpp/CMakeFiles/qpid-proton-cpp.dir/src/connector.cpp.o
[ 39%] Building CXX object proton-c/bindings/cpp/CMakeFiles/qpid-proton-cpp.dir/src/container.cpp.o
[ 40%] Building CXX object proton-c/bindings/cpp/CMakeFiles/qpid-proton-cpp.dir/src/container_impl.cpp.o
[ 40%] Building CXX object proton-c/bindings/cpp/CMakeFiles/qpid-proton-cpp.dir/src/contexts.cpp.o
[ 41%] Building CXX object proton-c/bindings/cpp/CMakeFiles/qpid-proton-cpp.dir/src/data.cpp.o
[ 41%] Building CXX object proton-c/bindings/cpp/CMakeFiles/qpid-proton-cpp.dir/src/decoder.cpp.o
[ 42%] Building CXX object proton-c/bindings/cpp/CMakeFiles/qpid-proton-cpp.dir/src/delivery.cpp.o
[ 43%] Building CXX object proton-c/bindings/cpp/CMakeFiles/qpid-proton-cpp.dir/src/duration.cpp.o
[ 43%] Building CXX object proton-c/bindings/cpp/CMakeFiles/qpid-proton-cpp.dir/src/encoder.cpp.o
[ 44%] Building CXX object proton-c/bindings/cpp/CMakeFiles/qpid-proton-cpp.dir/src/endpoint.cpp.o
[ 45%] Building CXX object proton-c/bindings/cpp/CMakeFiles/qpid-proton-cpp.dir/src/connection_engine.cpp.o
[ 45%] Building CXX object proton-c/bindings/cpp/CMakeFiles/qpid-proton-cpp.dir/src/error.cpp.o
[ 46%] Building CXX object proton-c/bindings/cpp/CMakeFiles/qpid-proton-cpp.dir/src/event.cpp.o
[ 47%] Building CXX object proton-c/bindings/cpp/CMakeFiles/qpid-proton-cpp.dir/src/id_generator.cpp.o
[ 47%] Building CXX object proton-c/bindings/cpp/CMakeFiles/qpid-proton-cpp.dir/src/link.cpp.o
[ 48%] Building CXX object proton-c/bindings/cpp/CMakeFiles/qpid-proton-cpp.dir/src/link_options.cpp.o
[ 48%] Building CXX object proton-c/bindings/cpp/CMakeFiles/qpid-proton-cpp.dir/src/message.cpp.o
[ 49%] Building CXX object proton-c/bindings/cpp/CMakeFiles/qpid-proton-cpp.dir/src/messaging_adapter.cpp.o
[ 50%] Building CXX object proton-c/bindings/cpp/CMakeFiles/qpid-proton-cpp.dir/src/messaging_event.cpp.o
[ 50%] Building CXX object proton-c/bindings/cpp/CMakeFiles/qpid-proton-cpp.dir/src/handler.cpp.o
[ 51%] Building CXX object proton-c/bindings/cpp/CMakeFiles/qpid-proton-cpp.dir/src/object.cpp.o
[ 52%] Building CXX object proton-c/bindings/cpp/CMakeFiles/qpid-proton-cpp.dir/src/proton_bits.cpp.o
[ 52%] Building CXX object proton-c/bindings/cpp/CMakeFiles/qpid-proton-cpp.dir/src/proton_event.cpp.o
[ 53%] Building CXX object proton-c/bindings/cpp/CMakeFiles/qpid-proton-cpp.dir/src/proton_handler.cpp.o
[ 54%] Building CXX object proton-c/bindings/cpp/CMakeFiles/qpid-proton-cpp.dir/src/reactor.cpp.o
[ 54%] Building CXX object proton-c/bindings/cpp/CMakeFiles/qpid-proton-cpp.dir/src/receiver.cpp.o
[ 55%] Building CXX object proton-c/bindings/cpp/CMakeFiles/qpid-proton-cpp.dir/src/reconnect_timer.cpp.o
[ 55%] Building CXX object proton-c/bindings/cpp/CMakeFiles/qpid-proton-cpp.dir/src/request_response.cpp.o
[ 56%] Building CXX object proton-c/bindings/cpp/CMakeFiles/qpid-proton-cpp.dir/src/sasl.cpp.o
[ 57%] Building CXX object proton-c/bindings/cpp/CMakeFiles/qpid-proton-cpp.dir/src/sender.cpp.o
[ 57%] Building CXX object proton-c/bindings/cpp/CMakeFiles/qpid-proton-cpp.dir/src/session.cpp.o
[ 58%] Building CXX object proton-c/bindings/cpp/CMakeFiles/qpid-proton-cpp.dir/src/ssl.cpp.o
[ 59%] Building CXX object proton-c/bindings/cpp/CMakeFiles/qpid-proton-cpp.dir/src/ssl_domain.cpp.o
[ 59%] Building CXX object proton-c/bindings/cpp/CMakeFiles/qpid-proton-cpp.dir/src/task.cpp.o
[ 60%] Building CXX object proton-c/bindings/cpp/CMakeFiles/qpid-proton-cpp.dir/src/terminus.cpp.o
[ 61%] Building CXX object proton-c/bindings/cpp/CMakeFiles/qpid-proton-cpp.dir/src/transport.cpp.o
[ 61%] Building CXX object proton-c/bindings/cpp/CMakeFiles/qpid-proton-cpp.dir/src/types.cpp.o
[ 62%] Building CXX object proton-c/bindings/cpp/CMakeFiles/qpid-proton-cpp.dir/src/url.cpp.o
[ 62%] Building CXX object proton-c/bindings/cpp/CMakeFiles/qpid-proton-cpp.dir/src/uuid.cpp.o
[ 63%] Building CXX object proton-c/bindings/cpp/CMakeFiles/qpid-proton-cpp.dir/src/value.cpp.o
[ 64%] Building CXX object proton-c/bindings/cpp/CMakeFiles/qpid-proton-cpp.dir/src/posix/io.cpp.o
Linking CXX shared library libqpid-proton-cpp.so
[ 64%] Built target qpid-proton-cpp
Scanning dependencies of target engine_test
[ 65%] Building CXX object proton-c/bindings/cpp/CMakeFiles/engine_test.dir/src/engine_test.cpp.o
/x1/jenkins/jenkins-slave/workspace/Qpid-proton-c/proton-c/bindings/cpp/src/engine_test.cpp:124:20:
error: template argument 1 is invalid
/x1/jenkins/jenkins-slave/workspace/Qpid-proton-c/proton-c/bindings/cpp/src/engine_test.cpp:124:20:
error: template argument 2 is invalid
/x1/jenkins/jenkins-slave/workspace/Qpid-proton-c/proton-c/bindings/cpp/src/engine_test.cpp:129:5:
error: reference to 'link' is ambiguous
/usr/include/unistd.h:813:12: error: candidates are: int link(const char*, const char*)
/x1/jenkins/jenkins-slave/workspace/Qpid-proton-c/proton-c/bindings/cpp/include/proton/link.hpp:40:7:
error:                 class proton::link
/x1/jenkins/jenkins-slave/workspace/Qpid-proton-c/proton-c/bindings/cpp/src/engine_test.cpp:129:5:
error: 'link' does not name a type
/x1/jenkins/jenkins-slave/workspace/Qpid-proton-c/proton-c/bindings/cpp/src/engine_test.cpp:
In member function 'virtual void link_handler::on_link_open(proton::event&)':
/x1/jenkins/jenkins-slave/workspace/Qpid-proton-c/proton-c/bindings/cpp/src/engine_test.cpp:126:15:
error: request for member 'push_back' in '((link_handler*)this)->link_handler::links',
which is of non-class type 'int'
/x1/jenkins/jenkins-slave/workspace/Qpid-proton-c/proton-c/bindings/cpp/src/engine_test.cpp:
In function 'void test_engine_prefix()':
/x1/jenkins/jenkins-slave/workspace/Qpid-proton-c/proton-c/bindings/cpp/src/engine_test.cpp:146:23:
error: request for member 'size' in 'e.engine_pair<link_handler, link_handler>::ha.link_handler::links',
which is of non-class type 'int'
/x1/jenkins/jenkins-slave/workspace/Qpid-proton-c/proton-c/bindings/cpp/src/engine_test.cpp:146:43:
error: request for member 'size' in 'e.engine_pair<link_handler, link_handler>::hb.link_handler::links',
which is of non-class type 'int'
/x1/jenkins/jenkins-slave/workspace/Qpid-proton-c/proton-c/bindings/cpp/src/engine_test.cpp:147:5:
error: 'struct link_handler' has no member named 'pop'
/x1/jenkins/jenkins-slave/workspace/Qpid-proton-c/proton-c/bindings/cpp/src/engine_test.cpp:147:5:
error: 'struct link_handler' has no member named 'pop'
/x1/jenkins/jenkins-slave/workspace/Qpid-proton-c/proton-c/bindings/cpp/src/engine_test.cpp:148:5:
error: 'struct link_handler' has no member named 'pop'
/x1/jenkins/jenkins-slave/workspace/Qpid-proton-c/proton-c/bindings/cpp/src/engine_test.cpp:148:5:
error: 'struct link_handler' has no member named 'pop'
/x1/jenkins/jenkins-slave/workspace/Qpid-proton-c/proton-c/bindings/cpp/src/engine_test.cpp:151:23:
error: request for member 'size' in 'e.engine_pair<link_handler, link_handler>::ha.link_handler::links',
which is of non-class type 'int'
/x1/jenkins/jenkins-slave/workspace/Qpid-proton-c/proton-c/bindings/cpp/src/engine_test.cpp:151:43:
error: request for member 'size' in 'e.engine_pair<link_handler, link_handler>::hb.link_handler::links',
which is of non-class type 'int'
/x1/jenkins/jenkins-slave/workspace/Qpid-proton-c/proton-c/bindings/cpp/src/engine_test.cpp:152:5:
error: 'struct link_handler' has no member named 'pop'
/x1/jenkins/jenkins-slave/workspace/Qpid-proton-c/proton-c/bindings/cpp/src/engine_test.cpp:152:5:
error: 'struct link_handler' has no member named 'pop'
/x1/jenkins/jenkins-slave/workspace/Qpid-proton-c/proton-c/bindings/cpp/src/engine_test.cpp:153:5:
error: 'struct link_handler' has no member named 'pop'
/x1/jenkins/jenkins-slave/workspace/Qpid-proton-c/proton-c/bindings/cpp/src/engine_test.cpp:153:5:
error: 'struct link_handler' has no member named 'pop'
/x1/jenkins/jenkins-slave/workspace/Qpid-proton-c/proton-c/bindings/cpp/src/engine_test.cpp:156:23:
error: request for member 'size' in 'e.engine_pair<link_handler, link_handler>::ha.link_handler::links',
which is of non-class type 'int'
/x1/jenkins/jenkins-slave/workspace/Qpid-proton-c/proton-c/bindings/cpp/src/engine_test.cpp:156:43:
error: request for member 'size' in 'e.engine_pair<link_handler, link_handler>::hb.link_handler::links',
which is of non-class type 'int'
/x1/jenkins/jenkins-slave/workspace/Qpid-proton-c/proton-c/bindings/cpp/src/engine_test.cpp:157:5:
error: 'struct link_handler' has no member named 'pop'
/x1/jenkins/jenkins-slave/workspace/Qpid-proton-c/proton-c/bindings/cpp/src/engine_test.cpp:157:5:
error: 'struct link_handler' has no member named 'pop'
/x1/jenkins/jenkins-slave/workspace/Qpid-proton-c/proton-c/bindings/cpp/src/engine_test.cpp:158:5:
error: 'struct link_handler' has no member named 'pop'
/x1/jenkins/jenkins-slave/workspace/Qpid-proton-c/proton-c/bindings/cpp/src/engine_test.cpp:158:5:
error: 'struct link_handler' has no member named 'pop'
/x1/jenkins/jenkins-slave/workspace/Qpid-proton-c/proton-c/bindings/cpp/src/engine_test.cpp:
In function 'void test_container_prefix()':
/x1/jenkins/jenkins-slave/workspace/Qpid-proton-c/proton-c/bindings/cpp/src/engine_test.cpp:166:23:
error: request for member 'size' in 'e.engine_pair<link_handler, link_handler>::ha.link_handler::links',
which is of non-class type 'int'
/x1/jenkins/jenkins-slave/workspace/Qpid-proton-c/proton-c/bindings/cpp/src/engine_test.cpp:166:43:
error: request for member 'size' in 'e.engine_pair<link_handler, link_handler>::hb.link_handler::links',
which is of non-class type 'int'
/x1/jenkins/jenkins-slave/workspace/Qpid-proton-c/proton-c/bindings/cpp/src/engine_test.cpp:167:5:
error: 'struct link_handler' has no member named 'pop'
/x1/jenkins/jenkins-slave/workspace/Qpid-proton-c/proton-c/bindings/cpp/src/engine_test.cpp:167:5:
error: 'struct link_handler' has no member named 'pop'
/x1/jenkins/jenkins-slave/workspace/Qpid-proton-c/proton-c/bindings/cpp/src/engine_test.cpp:168:5:
error: 'struct link_handler' has no member named 'pop'
/x1/jenkins/jenkins-slave/workspace/Qpid-proton-c/proton-c/bindings/cpp/src/engine_test.cpp:168:5:
error: 'struct link_handler' has no member named 'pop'
/x1/jenkins/jenkins-slave/workspace/Qpid-proton-c/proton-c/bindings/cpp/src/engine_test.cpp:171:23:
error: request for member 'size' in 'e.engine_pair<link_handler, link_handler>::ha.link_handler::links',
which is of non-class type 'int'
/x1/jenkins/jenkins-slave/workspace/Qpid-proton-c/proton-c/bindings/cpp/src/engine_test.cpp:171:43:
error: request for member 'size' in 'e.engine_pair<link_handler, link_handler>::hb.link_handler::links',
which is of non-class type 'int'
/x1/jenkins/jenkins-slave/workspace/Qpid-proton-c/proton-c/bindings/cpp/src/engine_test.cpp:172:5:
error: 'struct link_handler' has no member named 'pop'
/x1/jenkins/jenkins-slave/workspace/Qpid-proton-c/proton-c/bindings/cpp/src/engine_test.cpp:172:5:
error: 'struct link_handler' has no member named 'pop'
/x1/jenkins/jenkins-slave/workspace/Qpid-proton-c/proton-c/bindings/cpp/src/engine_test.cpp:173:5:
error: 'struct link_handler' has no member named 'pop'
/x1/jenkins/jenkins-slave/workspace/Qpid-proton-c/proton-c/bindings/cpp/src/engine_test.cpp:173:5:
error: 'struct link_handler' has no member named 'pop'
/x1/jenkins/jenkins-slave/workspace/Qpid-proton-c/proton-c/bindings/cpp/src/engine_test.cpp:176:23:
error: request for member 'size' in 'e.engine_pair<link_handler, link_handler>::ha.link_handler::links',
which is of non-class type 'int'
/x1/jenkins/jenkins-slave/workspace/Qpid-proton-c/proton-c/bindings/cpp/src/engine_test.cpp:176:43:
error: request for member 'size' in 'e.engine_pair<link_handler, link_handler>::hb.link_handler::links',
which is of non-class type 'int'
/x1/jenkins/jenkins-slave/workspace/Qpid-proton-c/proton-c/bindings/cpp/src/engine_test.cpp:177:5:
error: 'struct link_handler' has no member named 'pop'
/x1/jenkins/jenkins-slave/workspace/Qpid-proton-c/proton-c/bindings/cpp/src/engine_test.cpp:177:5:
error: 'struct link_handler' has no member named 'pop'
/x1/jenkins/jenkins-slave/workspace/Qpid-proton-c/proton-c/bindings/cpp/src/engine_test.cpp:178:5:
error: 'struct link_handler' has no member named 'pop'
/x1/jenkins/jenkins-slave/workspace/Qpid-proton-c/proton-c/bindings/cpp/src/engine_test.cpp:178:5:
error: 'struct link_handler' has no member named 'pop'
make[2]: *** [proton-c/bindings/cpp/CMakeFiles/engine_test.dir/src/engine_test.cpp.o] Error
1
make[1]: *** [proton-c/bindings/cpp/CMakeFiles/engine_test.dir/all] Error 2
make: *** [all] Error 2
Build step 'Execute shell' marked build as failure
Recording test results
ERROR: Publisher 'Publish JUnit test result report' failed: No test report files were found.
Configuration error?


Mime
View raw message