qpid-notifications mailing list archives

Site index · List index
Message view « Date » · « Thread »
Top « Date » · « Thread »
From Apache Jenkins Server <jenk...@builds.apache.org>
Subject Build failed in Jenkins: Qpid-JMS-Test-JDK7-Windows #11
Date Wed, 06 Jan 2016 14:45:49 GMT
See <https://builds.apache.org/job/Qpid-JMS-Test-JDK7-Windows/11/changes>

Changes:

[robbie] NO-JIRA: upload the junit xml results files such that the results

------------------------------------------
[...truncated 219 lines...]
Running org.apache.qpid.jms.producer.JmsMessageProducerTest
Tests run: 10, Failures: 0, Errors: 0, Skipped: 0, Time elapsed: 0.116 sec - in org.apache.qpid.jms.producer.JmsMessageProducerTest
Running org.apache.qpid.jms.producer.JmsQueueSenderClosedTest
Tests run: 7, Failures: 0, Errors: 0, Skipped: 0, Time elapsed: 0.02 sec - in org.apache.qpid.jms.producer.JmsQueueSenderClosedTest
Running org.apache.qpid.jms.producer.JmsTopicPublisherClosedTest
Tests run: 7, Failures: 0, Errors: 0, Skipped: 0, Time elapsed: 0.02 sec - in org.apache.qpid.jms.producer.JmsTopicPublisherClosedTest
Running org.apache.qpid.jms.provider.amqp.AmqpProviderFactoryTest
Tests run: 8, Failures: 0, Errors: 0, Skipped: 0, Time elapsed: 0.017 sec - in org.apache.qpid.jms.provider.amqp.AmqpProviderFactoryTest
Running org.apache.qpid.jms.provider.amqp.AmqpProviderTest
Tests run: 8, Failures: 0, Errors: 0, Skipped: 0, Time elapsed: 1.275 sec - in org.apache.qpid.jms.provider.amqp.AmqpProviderTest
Running org.apache.qpid.jms.provider.amqp.message.AmqpDestinationHelperTest
Tests run: 63, Failures: 0, Errors: 0, Skipped: 0, Time elapsed: 0.03 sec - in org.apache.qpid.jms.provider.amqp.message.AmqpDestinationHelperTest
Running org.apache.qpid.jms.provider.amqp.message.AmqpJmsBytesMessageFacadeTest
Tests run: 29, Failures: 0, Errors: 0, Skipped: 0, Time elapsed: 0.277 sec - in org.apache.qpid.jms.provider.amqp.message.AmqpJmsBytesMessageFacadeTest
Running org.apache.qpid.jms.provider.amqp.message.AmqpJmsMapMessageFacadeTest
Tests run: 15, Failures: 0, Errors: 0, Skipped: 0, Time elapsed: 0.015 sec - in org.apache.qpid.jms.provider.amqp.message.AmqpJmsMapMessageFacadeTest
Running org.apache.qpid.jms.provider.amqp.message.AmqpJmsMessageBuilderTest
Tests run: 33, Failures: 0, Errors: 0, Skipped: 0, Time elapsed: 0.051 sec - in org.apache.qpid.jms.provider.amqp.message.AmqpJmsMessageBuilderTest
Running org.apache.qpid.jms.provider.amqp.message.AmqpJmsMessageFacadeTest
Tests run: 117, Failures: 0, Errors: 0, Skipped: 0, Time elapsed: 0.151 sec - in org.apache.qpid.jms.provider.amqp.message.AmqpJmsMessageFacadeTest
Running org.apache.qpid.jms.provider.amqp.message.AmqpJmsMessageFactoryTest
Tests run: 11, Failures: 0, Errors: 0, Skipped: 0, Time elapsed: 0.012 sec - in org.apache.qpid.jms.provider.amqp.message.AmqpJmsMessageFactoryTest
Running org.apache.qpid.jms.provider.amqp.message.AmqpJmsMessagePropertyIntercepterTest
Tests run: 34, Failures: 0, Errors: 0, Skipped: 0, Time elapsed: 0.269 sec - in org.apache.qpid.jms.provider.amqp.message.AmqpJmsMessagePropertyIntercepterTest
Running org.apache.qpid.jms.provider.amqp.message.AmqpJmsObjectMessageFacadeTest
Tests run: 14, Failures: 0, Errors: 0, Skipped: 0, Time elapsed: 0.001 sec - in org.apache.qpid.jms.provider.amqp.message.AmqpJmsObjectMessageFacadeTest
Running org.apache.qpid.jms.provider.amqp.message.AmqpJmsStreamMessageFacadeTest
Tests run: 18, Failures: 0, Errors: 0, Skipped: 0, Time elapsed: 0.001 sec - in org.apache.qpid.jms.provider.amqp.message.AmqpJmsStreamMessageFacadeTest
Running org.apache.qpid.jms.provider.amqp.message.AmqpJmsTextMessageFacadeTest
Tests run: 16, Failures: 0, Errors: 0, Skipped: 0, Time elapsed: 0.001 sec - in org.apache.qpid.jms.provider.amqp.message.AmqpJmsTextMessageFacadeTest
Running org.apache.qpid.jms.provider.amqp.message.AmqpMessageIdHelperTest
Tests run: 31, Failures: 0, Errors: 0, Skipped: 0, Time elapsed: 0.002 sec - in org.apache.qpid.jms.provider.amqp.message.AmqpMessageIdHelperTest
Running org.apache.qpid.jms.provider.amqp.message.AmqpMessageSupportTest
Tests run: 11, Failures: 0, Errors: 0, Skipped: 0, Time elapsed: 0.001 sec - in org.apache.qpid.jms.provider.amqp.message.AmqpMessageSupportTest
Running org.apache.qpid.jms.provider.failover.FailoverIntegrationTest
Tests run: 12, Failures: 0, Errors: 0, Skipped: 0, Time elapsed: 1.156 sec - in org.apache.qpid.jms.provider.failover.FailoverIntegrationTest
Running org.apache.qpid.jms.provider.failover.FailoverProviderClosedTest
Tests run: 15, Failures: 0, Errors: 0, Skipped: 0, Time elapsed: 0.023 sec - in org.apache.qpid.jms.provider.failover.FailoverProviderClosedTest
Running org.apache.qpid.jms.provider.failover.FailoverProviderOfflineBehaviorTest
Tests run: 10, Failures: 0, Errors: 0, Skipped: 0, Time elapsed: 0.26 sec - in org.apache.qpid.jms.provider.failover.FailoverProviderOfflineBehaviorTest
Running org.apache.qpid.jms.provider.failover.FailoverProviderTest
Tests run: 19, Failures: 0, Errors: 0, Skipped: 0, Time elapsed: 0.437 sec - in org.apache.qpid.jms.provider.failover.FailoverProviderTest
Running org.apache.qpid.jms.provider.failover.FailoverRedirectTest
Tests run: 2, Failures: 0, Errors: 0, Skipped: 0, Time elapsed: 0.086 sec - in org.apache.qpid.jms.provider.failover.FailoverRedirectTest
Running org.apache.qpid.jms.provider.failover.FailoverUriPoolTest
Tests run: 26, Failures: 0, Errors: 0, Skipped: 0, Time elapsed: 0.627 sec - in org.apache.qpid.jms.provider.failover.FailoverUriPoolTest
Running org.apache.qpid.jms.provider.failover.FiloverProviderFactoryTest
Tests run: 5, Failures: 0, Errors: 0, Skipped: 0, Time elapsed: 0.065 sec - in org.apache.qpid.jms.provider.failover.FiloverProviderFactoryTest
Running org.apache.qpid.jms.sasl.AnonymousMechanismTest
Tests run: 8, Failures: 0, Errors: 0, Skipped: 0, Time elapsed: 0.001 sec - in org.apache.qpid.jms.sasl.AnonymousMechanismTest
Running org.apache.qpid.jms.sasl.CramMD5MechanismTest
Tests run: 8, Failures: 0, Errors: 0, Skipped: 0, Time elapsed: 0 sec - in org.apache.qpid.jms.sasl.CramMD5MechanismTest
Running org.apache.qpid.jms.sasl.ExternalMechanismTest
Tests run: 3, Failures: 0, Errors: 0, Skipped: 0, Time elapsed: 0 sec - in org.apache.qpid.jms.sasl.ExternalMechanismTest
Running org.apache.qpid.jms.sasl.PlainMechanismTest
Tests run: 8, Failures: 0, Errors: 0, Skipped: 0, Time elapsed: 0.001 sec - in org.apache.qpid.jms.sasl.PlainMechanismTest
Running org.apache.qpid.jms.selector.SelectorParserTest
Tests run: 21, Failures: 0, Errors: 0, Skipped: 0, Time elapsed: 0.001 sec - in org.apache.qpid.jms.selector.SelectorParserTest
Running org.apache.qpid.jms.session.JmsQueueSessionClosedTest
Tests run: 5, Failures: 0, Errors: 0, Skipped: 0, Time elapsed: 0.012 sec - in org.apache.qpid.jms.session.JmsQueueSessionClosedTest
Running org.apache.qpid.jms.session.JmsQueueSessionTest
Tests run: 18, Failures: 0, Errors: 0, Skipped: 0, Time elapsed: 0.047 sec - in org.apache.qpid.jms.session.JmsQueueSessionTest
Running org.apache.qpid.jms.session.JmsSessionClosedTest
Tests run: 35, Failures: 0, Errors: 0, Skipped: 0, Time elapsed: 0.134 sec - in org.apache.qpid.jms.session.JmsSessionClosedTest
Running org.apache.qpid.jms.session.JmsSessionFailedTest
Tests run: 35, Failures: 0, Errors: 0, Skipped: 0, Time elapsed: 0.166 sec - in org.apache.qpid.jms.session.JmsSessionFailedTest
Running org.apache.qpid.jms.session.JmsSessionTest
Tests run: 19, Failures: 0, Errors: 0, Skipped: 0, Time elapsed: 0.035 sec - in org.apache.qpid.jms.session.JmsSessionTest
Running org.apache.qpid.jms.session.JmsTopicSessionClosedTest
Tests run: 10, Failures: 0, Errors: 0, Skipped: 0, Time elapsed: 0.019 sec - in org.apache.qpid.jms.session.JmsTopicSessionClosedTest
Running org.apache.qpid.jms.session.JmsTopicSessionTest
Tests run: 15, Failures: 0, Errors: 0, Skipped: 0, Time elapsed: 0.086 sec - in org.apache.qpid.jms.session.JmsTopicSessionTest
Running org.apache.qpid.jms.transports.netty.NettySslTransportFactoryTest
Tests run: 4, Failures: 0, Errors: 0, Skipped: 0, Time elapsed: 0 sec - in org.apache.qpid.jms.transports.netty.NettySslTransportFactoryTest
Running org.apache.qpid.jms.transports.netty.NettySslTransportTest
Tests run: 21, Failures: 0, Errors: 0, Skipped: 0, Time elapsed: 2.498 sec - in org.apache.qpid.jms.transports.netty.NettySslTransportTest
Running org.apache.qpid.jms.transports.netty.NettyTcpTransportFactoryTest
Tests run: 7, Failures: 0, Errors: 0, Skipped: 0, Time elapsed: 0.005 sec - in org.apache.qpid.jms.transports.netty.NettyTcpTransportFactoryTest
Running org.apache.qpid.jms.transports.netty.NettyTcpTransportTest
Tests run: 14, Failures: 0, Errors: 0, Skipped: 0, Time elapsed: 1.885 sec - in org.apache.qpid.jms.transports.netty.NettyTcpTransportTest
Running org.apache.qpid.jms.transports.TransportOptionsTest
Tests run: 6, Failures: 0, Errors: 0, Skipped: 0, Time elapsed: 0 sec - in org.apache.qpid.jms.transports.TransportOptionsTest
Running org.apache.qpid.jms.transports.TransportSslOptionsTest
Tests run: 3, Failures: 0, Errors: 0, Skipped: 0, Time elapsed: 0.001 sec - in org.apache.qpid.jms.transports.TransportSslOptionsTest
Running org.apache.qpid.jms.transports.TransportSupportTest
Tests run: 26, Failures: 0, Errors: 0, Skipped: 0, Time elapsed: 0.069 sec - in org.apache.qpid.jms.transports.TransportSupportTest
Running org.apache.qpid.jms.transports.X509AliasKeyManagerTest
Tests run: 9, Failures: 0, Errors: 0, Skipped: 0, Time elapsed: 0.033 sec - in org.apache.qpid.jms.transports.X509AliasKeyManagerTest
Running org.apache.qpid.jms.util.ContentTypeSupportTest
Tests run: 31, Failures: 0, Errors: 0, Skipped: 0, Time elapsed: 0.07 sec - in org.apache.qpid.jms.util.ContentTypeSupportTest
Running org.apache.qpid.jms.util.FactoryFinderTest
Tests run: 4, Failures: 0, Errors: 0, Skipped: 0, Time elapsed: 0.007 sec - in org.apache.qpid.jms.util.FactoryFinderTest
Running org.apache.qpid.jms.util.FifoMessageQueueTest
Tests run: 22, Failures: 0, Errors: 0, Skipped: 0, Time elapsed: 1.146 sec - in org.apache.qpid.jms.util.FifoMessageQueueTest
Running org.apache.qpid.jms.util.IdGeneratorTest
Tests run: 2, Failures: 0, Errors: 0, Skipped: 0, Time elapsed: 0.001 sec - in org.apache.qpid.jms.util.IdGeneratorTest
Running org.apache.qpid.jms.util.IOExceptionSupportTest
Tests run: 5, Failures: 0, Errors: 0, Skipped: 0, Time elapsed: 0.001 sec - in org.apache.qpid.jms.util.IOExceptionSupportTest
Running org.apache.qpid.jms.util.LRUCacheTest
Tests run: 3, Failures: 0, Errors: 0, Skipped: 0, Time elapsed: 2.366 sec - in org.apache.qpid.jms.util.LRUCacheTest
Running org.apache.qpid.jms.util.PriorityMessageQueueTest
Tests run: 25, Failures: 0, Errors: 0, Skipped: 0, Time elapsed: 0.773 sec - in org.apache.qpid.jms.util.PriorityMessageQueueTest
Running org.apache.qpid.jms.util.PropertyUtilTest
Tests run: 54, Failures: 0, Errors: 0, Skipped: 0, Time elapsed: 0.004 sec - in org.apache.qpid.jms.util.PropertyUtilTest
Running org.apache.qpid.jms.util.StopWatchTest
Tests run: 4, Failures: 0, Errors: 0, Skipped: 0, Time elapsed: 0.892 sec - in org.apache.qpid.jms.util.StopWatchTest
Running org.apache.qpid.jms.util.StringArrayConverterTest
Tests run: 3, Failures: 0, Errors: 0, Skipped: 0, Time elapsed: 0.004 sec - in org.apache.qpid.jms.util.StringArrayConverterTest
Running org.apache.qpid.jms.util.ThreadPoolUtilsTest
Tests run: 11, Failures: 0, Errors: 0, Skipped: 0, Time elapsed: 0.122 sec - in org.apache.qpid.jms.util.ThreadPoolUtilsTest
Running org.apache.qpid.jms.util.URISupportTest
Tests run: 19, Failures: 0, Errors: 0, Skipped: 0, Time elapsed: 0.001 sec - in org.apache.qpid.jms.util.URISupportTest

Results :

Tests run: 2044, Failures: 0, Errors: 0, Skipped: 0

[JENKINS] Archiving disabled
[INFO]                                                                         
[INFO] ------------------------------------------------------------------------
[INFO] Skipping QpidJMS Discovery Library
[INFO] This project has been banned from the build due to previous failures.
[INFO] ------------------------------------------------------------------------
[INFO]                                                                         
[INFO] ------------------------------------------------------------------------
[INFO] Building QpidJMS Broker Interop Tests 0.8.0-SNAPSHOT
[INFO] ------------------------------------------------------------------------
[INFO] 
[INFO] --- maven-clean-plugin:2.5:clean (default-clean) @ qpid-jms-interop-tests ---
[INFO] 
[INFO] --- jacoco-maven-plugin:0.7.5.201505241946:prepare-agent (default) @ qpid-jms-interop-tests
---
[INFO] Skipping JaCoCo execution because property jacoco.skip is set.
[INFO] jacoco-config set to empty
[INFO] 
[INFO] --- maven-remote-resources-plugin:1.5:process (default) @ qpid-jms-interop-tests ---
[INFO] 
[INFO] --- maven-site-plugin:3.4:attach-descriptor (attach-descriptor) @ qpid-jms-interop-tests
---
[JENKINS] Archiving disabled
[INFO]                                                                         
[INFO] ------------------------------------------------------------------------
[INFO] Skipping QpidJMS ActiveMQ Interop Tests
[INFO] This project has been banned from the build due to previous failures.
[INFO] ------------------------------------------------------------------------
[INFO]                                                                         
[INFO] ------------------------------------------------------------------------
[INFO] Skipping QpidJMS Examples
[INFO] This project has been banned from the build due to previous failures.
[INFO] ------------------------------------------------------------------------
[INFO]                                                                         
[INFO] ------------------------------------------------------------------------
[INFO] Building QpidJMS Docs 0.8.0-SNAPSHOT
[INFO] ------------------------------------------------------------------------
[INFO] 
[INFO] --- maven-clean-plugin:2.5:clean (default-clean) @ qpid-jms-docs ---
[INFO] 
[INFO] --- jacoco-maven-plugin:0.7.5.201505241946:prepare-agent (default) @ qpid-jms-docs
---
[INFO] Skipping JaCoCo execution because property jacoco.skip is set.
[INFO] jacoco-config set to empty
[INFO] 
[INFO] --- maven-remote-resources-plugin:1.5:process (default) @ qpid-jms-docs ---
[INFO] 
[INFO] --- maven-site-plugin:3.4:attach-descriptor (attach-descriptor) @ qpid-jms-docs ---
[JENKINS] Archiving disabled
[INFO]                                                                         
[INFO] ------------------------------------------------------------------------
[INFO] Skipping Apache Qpid JMS
[INFO] This project has been banned from the build due to previous failures.
[INFO] ------------------------------------------------------------------------
[INFO] ------------------------------------------------------------------------
[INFO] Reactor Summary:
[INFO] 
[INFO] QpidJMS ........................................... SUCCESS [4.282s]
[INFO] QpidJMS Client .................................... FAILURE [1:10.788s]
[INFO] QpidJMS Discovery Library ......................... SKIPPED
[INFO] QpidJMS Broker Interop Tests ...................... SUCCESS [0.154s]
[INFO] QpidJMS ActiveMQ Interop Tests .................... SKIPPED
[INFO] QpidJMS Examples .................................. SKIPPED
[INFO] QpidJMS Docs ...................................... SUCCESS [0.171s]
[INFO] Apache Qpid JMS ................................... SKIPPED
[INFO] ------------------------------------------------------------------------
[INFO] BUILD FAILURE
[INFO] ------------------------------------------------------------------------
[INFO] Total time: 1:16.829s
[INFO] Finished at: Wed Jan 06 06:45:22 PST 2016
[INFO] Final Memory: 27M/989M
[INFO] ------------------------------------------------------------------------
[JENKINS] Archiving disabled
[JENKINS] Archiving disabled
[JENKINS] Archiving disabled
[JENKINS] Archiving disabled
[JENKINS] Archiving disabled
[JENKINS] Archiving disabled
[JENKINS] Archiving disabled
[JENKINS] Archiving disabled
Sending e-mails to: notifications@qpid.apache.org
ERROR: Failed to parse POMs
hudson.util.IOException2: java.util.MissingResourceException: Unable to load resource jar:file:/C:/.jenkins/cache/jars/E1/2CFD76F12D93953A10911C2505CB59.jar!/hudson/maven/Messages.properties
	at hudson.maven.Maven3Builder.call(Maven3Builder.java:184)
	at hudson.maven.Maven3Builder.call(Maven3Builder.java:71)
	at hudson.remoting.UserRequest.perform(UserRequest.java:118)
	at hudson.remoting.UserRequest.perform(UserRequest.java:48)
	at hudson.remoting.Request$2.run(Request.java:328)
	at hudson.remoting.InterceptingExecutorService$1.call(InterceptingExecutorService.java:72)
	at java.util.concurrent.FutureTask.run(FutureTask.java:262)
	at java.util.concurrent.ThreadPoolExecutor.runWorker(ThreadPoolExecutor.java:1145)
	at java.util.concurrent.ThreadPoolExecutor$Worker.run(ThreadPoolExecutor.java:615)
	at java.lang.Thread.run(Thread.java:744)
	at ......remote call to Channel to Maven [f:\jenkins\jenkins-slave\tools\hudson.model.JDK\jdk-1.7u51/bin/java,
-XX:MaxPermSize=500m, -Xmx2G, -Xms1G, -Djava.awt.headless=true, -cp, f:\jenkins\jenkins-slave\maven3-agent.jar;f:\jenkins\jenkins-slave\tools\hudson.tasks.Maven_MavenInstallation\Maven_3.0.5\boot\plexus-classworlds-2.4.jar,
org.jvnet.hudson.maven3.agent.Maven3Main, f:\jenkins\jenkins-slave\tools\hudson.tasks.Maven_MavenInstallation\Maven_3.0.5,
F:\jenkins\jenkins-slave\slave.jar, f:\jenkins\jenkins-slave\maven3-interceptor.jar, f:\jenkins\jenkins-slave\maven3-interceptor-commons.jar,
50918](Native Method)
	at hudson.remoting.Channel.attachCallSiteStackTrace(Channel.java:1413)
	at hudson.remoting.UserResponse.retrieve(UserRequest.java:221)
	at hudson.remoting.Channel.call(Channel.java:778)
	at hudson.maven.ProcessCache$MavenProcess.call(ProcessCache.java:161)
	at hudson.maven.MavenModuleSetBuild$MavenModuleSetBuildExecution.doRun(MavenModuleSetBuild.java:853)
	at hudson.model.AbstractBuild$AbstractBuildExecution.run(AbstractBuild.java:536)
	at hudson.model.Run.execute(Run.java:1738)
	at hudson.maven.MavenModuleSetBuild.run(MavenModuleSetBuild.java:531)
	at hudson.model.ResourceController.execute(ResourceController.java:98)
	at hudson.model.Executor.run(Executor.java:381)
Caused by: java.util.MissingResourceException: Unable to load resource jar:file:/C:/.jenkins/cache/jars/E1/2CFD76F12D93953A10911C2505CB59.jar!/hudson/maven/Messages.properties
	at org.jvnet.localizer.ResourceBundleHolder.get(ResourceBundleHolder.java:121)
	at org.jvnet.localizer.ResourceBundleHolder.get(ResourceBundleHolder.java:128)
	at org.jvnet.localizer.ResourceBundleHolder.get(ResourceBundleHolder.java:128)
	at org.jvnet.localizer.ResourceBundleHolder.format(ResourceBundleHolder.java:170)
	at hudson.maven.Messages.MavenBuilder_Waiting(Messages.java:475)
	at hudson.maven.AbstractMavenBuilder.waitForAsynchronousExecutions(AbstractMavenBuilder.java:184)
	at hudson.maven.Maven3Builder.call(Maven3Builder.java:143)
	at hudson.maven.Maven3Builder.call(Maven3Builder.java:71)
	at hudson.remoting.UserRequest.perform(UserRequest.java:118)
	at hudson.remoting.UserRequest.perform(UserRequest.java:48)
	at hudson.remoting.Request$2.run(Request.java:328)
	at hudson.remoting.InterceptingExecutorService$1.call(InterceptingExecutorService.java:72)
	at java.util.concurrent.FutureTask.run(FutureTask.java:262)
	at java.util.concurrent.ThreadPoolExecutor.runWorker(ThreadPoolExecutor.java:1145)
	at java.util.concurrent.ThreadPoolExecutor$Worker.run(ThreadPoolExecutor.java:615)
	at java.lang.Thread.run(Thread.java:744)
Caused by: java.util.zip.ZipException: zip file is empty
	at java.util.zip.ZipFile.open(Native Method)
	at java.util.zip.ZipFile.<init>(ZipFile.java:215)
	at java.util.zip.ZipFile.<init>(ZipFile.java:145)
	at java.util.jar.JarFile.<init>(JarFile.java:153)
	at java.util.jar.JarFile.<init>(JarFile.java:90)
	at sun.net.www.protocol.jar.URLJarFile.<init>(URLJarFile.java:93)
	at sun.net.www.protocol.jar.URLJarFile.getJarFile(URLJarFile.java:69)
	at sun.net.www.protocol.jar.JarFileFactory.get(JarFileFactory.java:109)
	at sun.net.www.protocol.jar.JarURLConnection.connect(JarURLConnection.java:122)
	at sun.net.www.protocol.jar.JarURLConnection.getInputStream(JarURLConnection.java:150)
	at org.jvnet.localizer.ResourceBundleHolder.get(ResourceBundleHolder.java:113)
	... 15 more
channel stopped

Mime
View raw message