qpid-notifications mailing list archives

Site index · List index
Message view « Date » · « Thread »
Top « Date » · « Thread »
From Apache Jenkins Server <jenk...@builds.apache.org>
Subject Build failed in Jenkins: Qpid-Java-Cpp-Test #2851
Date Wed, 09 Sep 2015 15:48:59 GMT
See <https://builds.apache.org/job/Qpid-Java-Cpp-Test/2851/changes>

Changes:

[kwall] QPID-6637: [Java Performance Tests] Replace GSON with Jackson

* Also fixed malformed Json in test scripts.

------------------------------------------
[...truncated 6123 lines...]
	at junit.framework.Assert.assertTrue(Assert.java:31)
	at junit.framework.TestCase.assertTrue(TestCase.java:201)
	at org.apache.qpid.server.store.berkeleydb.replication.MultiNodeTest.setUp(MultiNodeTest.java:83)

testLossOfReplicaNodeDoesNotCauseClientToFailover(org.apache.qpid.server.store.berkeleydb.replication.MultiNodeTest)
 Time elapsed: 0.001 sec  <<< FAILURE!
junit.framework.AssertionFailedError: null
	at junit.framework.Assert.fail(Assert.java:55)
	at junit.framework.Assert.assertTrue(Assert.java:22)
	at junit.framework.Assert.assertTrue(Assert.java:31)
	at junit.framework.TestCase.assertTrue(TestCase.java:201)
	at org.apache.qpid.server.store.berkeleydb.replication.MultiNodeTest.setUp(MultiNodeTest.java:83)

testPersistentMessagesAvailableAfterFailover(org.apache.qpid.server.store.berkeleydb.replication.MultiNodeTest)
 Time elapsed: 0.002 sec  <<< FAILURE!
junit.framework.AssertionFailedError: null
	at junit.framework.Assert.fail(Assert.java:55)
	at junit.framework.Assert.assertTrue(Assert.java:22)
	at junit.framework.Assert.assertTrue(Assert.java:31)
	at junit.framework.TestCase.assertTrue(TestCase.java:201)
	at org.apache.qpid.server.store.berkeleydb.replication.MultiNodeTest.setUp(MultiNodeTest.java:83)

Running org.apache.qpid.server.store.berkeleydb.replication.TwoNodeTest
Tests run: 7, Failures: 7, Errors: 0, Skipped: 0, Time elapsed: 0.021 sec <<< FAILURE!
- in org.apache.qpid.server.store.berkeleydb.replication.TwoNodeTest
testMasterDesignatedPrimaryCanBeRestartedWithoutReplica(org.apache.qpid.server.store.berkeleydb.replication.TwoNodeTest)
 Time elapsed: 0 sec  <<< FAILURE!
junit.framework.AssertionFailedError: null
	at junit.framework.Assert.fail(Assert.java:55)
	at junit.framework.Assert.assertTrue(Assert.java:22)
	at junit.framework.Assert.assertTrue(Assert.java:31)
	at junit.framework.TestCase.assertTrue(TestCase.java:201)
	at org.apache.qpid.server.store.berkeleydb.replication.TwoNodeTest.setUp(TwoNodeTest.java:53)

testSecondaryDesignatedAsPrimaryAfterOriginalPrimaryStopped(org.apache.qpid.server.store.berkeleydb.replication.TwoNodeTest)
 Time elapsed: 0 sec  <<< FAILURE!
junit.framework.AssertionFailedError: null
	at junit.framework.Assert.fail(Assert.java:55)
	at junit.framework.Assert.assertTrue(Assert.java:22)
	at junit.framework.Assert.assertTrue(Assert.java:31)
	at junit.framework.TestCase.assertTrue(TestCase.java:201)
	at org.apache.qpid.server.store.berkeleydb.replication.TwoNodeTest.setUp(TwoNodeTest.java:53)

testClusterRestartWithoutDesignatedPrimary(org.apache.qpid.server.store.berkeleydb.replication.TwoNodeTest)
 Time elapsed: 0.009 sec  <<< FAILURE!
junit.framework.AssertionFailedError: null
	at junit.framework.Assert.fail(Assert.java:55)
	at junit.framework.Assert.assertTrue(Assert.java:22)
	at junit.framework.Assert.assertTrue(Assert.java:31)
	at junit.framework.TestCase.assertTrue(TestCase.java:201)
	at org.apache.qpid.server.store.berkeleydb.replication.TwoNodeTest.setUp(TwoNodeTest.java:53)

testDesignatedPrimaryContinuesAfterSecondaryStopped(org.apache.qpid.server.store.berkeleydb.replication.TwoNodeTest)
 Time elapsed: 0.003 sec  <<< FAILURE!
junit.framework.AssertionFailedError: null
	at junit.framework.Assert.fail(Assert.java:55)
	at junit.framework.Assert.assertTrue(Assert.java:22)
	at junit.framework.Assert.assertTrue(Assert.java:31)
	at junit.framework.TestCase.assertTrue(TestCase.java:201)
	at org.apache.qpid.server.store.berkeleydb.replication.TwoNodeTest.setUp(TwoNodeTest.java:53)

testPersistentOperationsFailOnNonDesignatedPrimaryAfterSecondaryStopped(org.apache.qpid.server.store.berkeleydb.replication.TwoNodeTest)
 Time elapsed: 0.005 sec  <<< FAILURE!
junit.framework.AssertionFailedError: null
	at junit.framework.Assert.fail(Assert.java:55)
	at junit.framework.Assert.assertTrue(Assert.java:22)
	at junit.framework.Assert.assertTrue(Assert.java:31)
	at junit.framework.TestCase.assertTrue(TestCase.java:201)
	at org.apache.qpid.server.store.berkeleydb.replication.TwoNodeTest.setUp(TwoNodeTest.java:53)

testInitialDesignatedPrimaryStateOfNodes(org.apache.qpid.server.store.berkeleydb.replication.TwoNodeTest)
 Time elapsed: 0.002 sec  <<< FAILURE!
junit.framework.AssertionFailedError: null
	at junit.framework.Assert.fail(Assert.java:55)
	at junit.framework.Assert.assertTrue(Assert.java:22)
	at junit.framework.Assert.assertTrue(Assert.java:31)
	at junit.framework.TestCase.assertTrue(TestCase.java:201)
	at org.apache.qpid.server.store.berkeleydb.replication.TwoNodeTest.setUp(TwoNodeTest.java:53)

testSecondaryDoesNotBecomePrimaryWhenDesignatedPrimaryStopped(org.apache.qpid.server.store.berkeleydb.replication.TwoNodeTest)
 Time elapsed: 0.002 sec  <<< FAILURE!
junit.framework.AssertionFailedError: null
	at junit.framework.Assert.fail(Assert.java:55)
	at junit.framework.Assert.assertTrue(Assert.java:22)
	at junit.framework.Assert.assertTrue(Assert.java:31)
	at junit.framework.TestCase.assertTrue(TestCase.java:201)
	at org.apache.qpid.server.store.berkeleydb.replication.TwoNodeTest.setUp(TwoNodeTest.java:53)

Running org.apache.qpid.server.store.berkeleydb.BDBBackupTest
Tests run: 0, Failures: 0, Errors: 0, Skipped: 0, Time elapsed: 0 sec - in org.apache.qpid.server.store.berkeleydb.BDBBackupTest

Results :

Failed tests: 
  MultiNodeTest>QpidTestCase.run:156->QpidBrokerTestCase.runBare:332->setUp:83 null
  MultiNodeTest>QpidTestCase.run:156->QpidBrokerTestCase.runBare:332->setUp:83 null
  MultiNodeTest>QpidTestCase.run:156->QpidBrokerTestCase.runBare:332->setUp:83 null
  MultiNodeTest>QpidTestCase.run:156->QpidBrokerTestCase.runBare:332->setUp:83 null
  MultiNodeTest>QpidTestCase.run:156->QpidBrokerTestCase.runBare:332->setUp:83 null
  MultiNodeTest>QpidTestCase.run:156->QpidBrokerTestCase.runBare:332->setUp:83 null
  MultiNodeTest>QpidTestCase.run:156->QpidBrokerTestCase.runBare:332->setUp:83 null
  MultiNodeTest>QpidTestCase.run:156->QpidBrokerTestCase.runBare:332->setUp:83 null
  MultiNodeTest>QpidTestCase.run:156->QpidBrokerTestCase.runBare:332->setUp:83 null
  MultiNodeTest>QpidTestCase.run:156->QpidBrokerTestCase.runBare:332->setUp:83 null
  TwoNodeTest>QpidTestCase.run:156->QpidBrokerTestCase.runBare:332->setUp:53 null
  TwoNodeTest>QpidTestCase.run:156->QpidBrokerTestCase.runBare:332->setUp:53 null
  TwoNodeTest>QpidTestCase.run:156->QpidBrokerTestCase.runBare:332->setUp:53 null
  TwoNodeTest>QpidTestCase.run:156->QpidBrokerTestCase.runBare:332->setUp:53 null
  TwoNodeTest>QpidTestCase.run:156->QpidBrokerTestCase.runBare:332->setUp:53 null
  TwoNodeTest>QpidTestCase.run:156->QpidBrokerTestCase.runBare:332->setUp:53 null
  TwoNodeTest>QpidTestCase.run:156->QpidBrokerTestCase.runBare:332->setUp:53 null

Tests in error: 
  BDBHAVirtualHostNodeRestTest>QpidTestCase.run:156->QpidBrokerTestCase.runBare:332->QpidTestCase.runTest:171->testNewMasterElectedWhenVirtualHostIsStopped:143->createHANode:325
» Connect
  BDBHAVirtualHostNodeRestTest>QpidTestCase.run:156->QpidBrokerTestCase.runBare:332->QpidTestCase.runTest:171->testMutateStateOfOneNode:103->createHANode:325
» Connect
  BDBHAVirtualHostNodeRestTest>QpidTestCase.run:156->QpidBrokerTestCase.runBare:332->QpidTestCase.runTest:171->testIntruderProtection:260->createHANode:325
» Connect
  BDBHAVirtualHostNodeRestTest>QpidTestCase.run:156->QpidBrokerTestCase.runBare:332->QpidTestCase.runTest:171->testDeleteMasterNode:200->createHANode:325
» Connect
  BDBHAVirtualHostNodeRestTest>QpidTestCase.run:156->QpidBrokerTestCase.runBare:332->QpidTestCase.runTest:171->testCreate3NodeGroup:92->createHANode:325
» Connect
  BDBHAVirtualHostNodeRestTest>QpidTestCase.run:156->QpidBrokerTestCase.runBare:332->QpidTestCase.runTest:171->testDeleteReplicaNode:174->createHANode:325
» Connect
  BDBHAVirtualHostNodeRestTest>QpidTestCase.run:156->QpidBrokerTestCase.runBare:332->QpidTestCase.runTest:171->testIntruderBDBHAVHNNotAllowedToConnect:240->createHANode:325
» Connect
  BDBHAVirtualHostRestTest>QpidTestCase.run:156->QpidBrokerTestCase.runBare:332->QpidTestCase.runTest:171->testSetLocalTransactionSynchronizationPolicy:115->QpidRestTestCase.waitForAttributeChanged:108->QpidRestTestCase.getAttributesIgnoringNotFound:126
» Connect
  BDBHAVirtualHostRestTest>QpidTestCase.run:156->QpidBrokerTestCase.runBare:332->QpidTestCase.runTest:171->testMutateState:139->QpidRestTestCase.waitForAttributeChanged:108->QpidRestTestCase.getAttributesIgnoringNotFound:126
» Connect
  BDBHAVirtualHostRestTest>QpidTestCase.run:156->QpidBrokerTestCase.runBare:332->QpidTestCase.runTest:171->testSetRemoteTransactionSynchronizationPolicy:127->QpidRestTestCase.waitForAttributeChanged:108->QpidRestTestCase.getAttributesIgnoringNotFound:126
» Connect
  JMXManagementTest>QpidTestCase.run:156->QpidBrokerTestCase.runBare:332->QpidTestCase.runTest:171->testRemoveRemoteNodeFromGroup:165->getStoreBeanForNodeAtBrokerPort:286
» IO
  JMXManagementTest>QpidTestCase.run:156->QpidBrokerTestCase.runBare:332->QpidTestCase.runTest:171->testVirtualHostOperationsDeniedForNonMasterNode:188->getManagedBrokerBeanForNodeAtBrokerPort:293
» IO
  JMXManagementTest>QpidTestCase.run:156->QpidBrokerTestCase.runBare:332->QpidTestCase.runTest:171->testStateOfNonActiveBrokerIsNotMaster:134->getStoreBeanForNodeAtBrokerPort:286
» IO
  JMXManagementTest>QpidTestCase.run:156->QpidBrokerTestCase.runBare:332->QpidTestCase.runTest:171->testStateOfActiveBrokerIsMaster:126->getStoreBeanForNodeAtBrokerPort:286
» IO
  JMXManagementTest>QpidTestCase.run:156->QpidBrokerTestCase.runBare:332->QpidTestCase.runTest:171->testVirtualHostMbeanOnMasterTransfer:226->getManagedBrokerBeanForNodeAtBrokerPort:293
» IO
  JMXManagementTest>QpidTestCase.run:156->QpidBrokerTestCase.runBare:332->QpidTestCase.runTest:171->testGroupMembers:143->getStoreBeanForNodeAtBrokerPort:286
» IO
  JMXManagementTest>QpidTestCase.run:156->QpidBrokerTestCase.runBare:332->QpidTestCase.runTest:171->testReadonlyMBeanAttributes:112->getStoreBeanForNodeAtBrokerPort:286
» IO

Tests run: 42, Failures: 17, Errors: 17, Skipped: 0

[INFO]                                                                         
[INFO] ------------------------------------------------------------------------
[INFO] Building joramtests 6.0.0-SNAPSHOT
[INFO] ------------------------------------------------------------------------
[INFO] 
[INFO] --- maven-clean-plugin:2.5:clean (default-clean) @ joramtests ---
[INFO] 
[INFO] --- maven-antrun-plugin:1.7:run (output-test-properties) @ joramtests ---
[INFO] Executing tasks

main:
     [echo] Joram Integration Tests: To run define system property -Djoramtests to a name
of a JMS client e.g. qpid-jms-client
[INFO] Executed tasks
[INFO] 
[INFO] --- maven-enforcer-plugin:1.3.1:enforce (enforce-minimum-versions) @ joramtests ---
[INFO] 
[INFO] --- maven-enforcer-plugin:1.3.1:enforce (enforce-versions-standard-properties) @ joramtests
---
[INFO] 
[INFO] --- maven-enforcer-plugin:1.3.1:enforce (enforce-cpp-broker-dir-defined) @ joramtests
---
[INFO] 
[INFO] --- jacoco-maven-plugin:0.7.0.201403182114:prepare-agent (default-prepare-agent) @
joramtests ---
[INFO] argLine set to -javaagent:/home/jenkins/.m2/repository/org/jacoco/org.jacoco.agent/0.7.0.201403182114/org.jacoco.agent-0.7.0.201403182114-runtime.jar=destfile=<https://builds.apache.org/job/Qpid-Java-Cpp-Test/ws/qpid-java/joramtests/target/jacoco.exec>
-Xmx512m
[INFO] 
[INFO] --- maven-remote-resources-plugin:1.5:process (default) @ joramtests ---
[INFO] 
[INFO] --- maven-resources-plugin:2.6:resources (default-resources) @ joramtests ---
[INFO] Using 'UTF-8' encoding to copy filtered resources.
[INFO] skip non existing resourceDirectory <https://builds.apache.org/job/Qpid-Java-Cpp-Test/ws/qpid-java/joramtests/src/main/resources>
[INFO] Copying 3 resources
[INFO] 
[INFO] --- maven-compiler-plugin:3.1:compile (default-compile) @ joramtests ---
[INFO] Changes detected - recompiling the module!
[INFO] Compiling 1 source file to <https://builds.apache.org/job/Qpid-Java-Cpp-Test/ws/qpid-java/joramtests/target/classes>
[WARNING] <https://builds.apache.org/job/Qpid-Java-Cpp-Test/ws/qpid-java/joramtests/src/main/java/org/apache/qpid/joramtests/admin/JavaBrokerAdmin.java>:[258,52]
authenticate(org.apache.http.auth.Credentials,org.apache.http.HttpRequest) in org.apache.http.impl.auth.BasicScheme
has been deprecated
[INFO] 
[INFO] --- maven-resources-plugin:2.6:testResources (default-testResources) @ joramtests ---
[INFO] Using 'UTF-8' encoding to copy filtered resources.
[INFO] Copying 6 resources
[INFO] Copying 3 resources
[INFO] 
[INFO] --- maven-compiler-plugin:3.1:testCompile (default-testCompile) @ joramtests ---
[INFO] No sources to compile
[INFO] 
[INFO] --- maven-surefire-plugin:2.16:test (default-test) @ joramtests ---
[INFO] 
[INFO] --- maven-jar-plugin:2.4:jar (default-jar) @ joramtests ---
[INFO] Building jar: <https://builds.apache.org/job/Qpid-Java-Cpp-Test/ws/qpid-java/joramtests/target/joramtests-6.0.0-SNAPSHOT.jar>
[INFO] 
[INFO] --- maven-site-plugin:3.3:attach-descriptor (attach-descriptor) @ joramtests ---
[INFO] 
[INFO] --- maven-antrun-plugin:1.7:run (create-qbtc-output-dir) @ joramtests ---
[INFO] Executing tasks

main:
    [mkdir] Created dir: <https://builds.apache.org/job/Qpid-Java-Cpp-Test/ws/qpid-java/joramtests/target/qbtc-test-config>
[INFO] Executed tasks
[INFO] 
[INFO] --- maven-failsafe-plugin:2.18.1:integration-test (default) @ joramtests ---
[INFO] Tests are skipped.
[INFO] 
[INFO] --- maven-failsafe-plugin:2.18.1:verify (default) @ joramtests ---
[INFO] Tests are skipped.
[INFO] ------------------------------------------------------------------------
[INFO] Reactor Summary:
[INFO] 
[INFO] Qpid Java Build ................................... SUCCESS [2.352s]
[INFO] Qpid Broker Code Generation ....................... SUCCESS [2.170s]
[INFO] Qpid Test Utilities ............................... SUCCESS [0.497s]
[INFO] Qpid Common ....................................... SUCCESS [3:56.662s]
[INFO] Qpid Management Common ............................ SUCCESS [2.392s]
[INFO] Qpid Java Broker Core ............................. SUCCESS [1:43.267s]
[INFO] Qpid Access Control Broker Plug-in ................ SUCCESS [6.440s]
[INFO] Qpid AMQP 0-8 Protocol Broker Plug-in ............. SUCCESS [3.492s]
[INFO] Qpid AMQP 0-10 Protocol Plug-in ................... SUCCESS [6.667s]
[INFO] Qpid AMQP 1-0 Protocol Broker Plug-in ............. SUCCESS [7.825s]
[INFO] Qpid AMQP 0-8 to 0-10 Message Conversion Broker Plug-in  SUCCESS [0.344s]
[INFO] Qpid AMQP 0-8 to 1-0 Message Conversion Broker Plug-in  SUCCESS [0.295s]
[INFO] Qpid AMQP 0-10 to 1-0 Message Conversion Broker Plug-in  SUCCESS [0.270s]
[INFO] Qpid Derby Message Store .......................... SUCCESS [19.885s]
[INFO] Qpid JDBC Message Store Connection Pooling Plug-in  SUCCESS [0.925s]
[INFO] Qpid JDBC Message Store Broker Plug-in ............ SUCCESS [9.607s]
[INFO] Qpid HTTP Management Broker Plug-in ............... SUCCESS [5.749s]
[INFO] Qpid JMX Management Broker Plug-in ................ SUCCESS [2.833s]
[INFO] Qpid Memory Message Store Broker Plug-in .......... SUCCESS [0.405s]
[INFO] Qpid WebSocket Broker Plug-in ..................... SUCCESS [0.363s]
[INFO] Qpid AMQP 0-x JMS Client .......................... SUCCESS [9.734s]
[INFO] Qpid BDB Message Store ............................ SUCCESS [2:15.794s]
[INFO] Qpid BDB Message Store JMX ........................ SUCCESS [3.338s]
[INFO] Qpid Java Broker .................................. SUCCESS [7.319s]
[INFO] Qpid AMQP Management Protocol Broker Plug-in ...... SUCCESS [0.340s]
[INFO] Qpid AMQP 0-x JMS Client Examples ................. SUCCESS [0.220s]
[INFO] Qpid JCA .......................................... SUCCESS [2.834s]
[INFO] Qpid Resource Adaptor ............................. SUCCESS [0.653s]
[INFO] Qpid Tools ........................................ SUCCESS [0.568s]
[INFO] Qpid Management Examples .......................... SUCCESS [0.211s]
[INFO] Qpid Java System Test Parent ...................... SUCCESS [1.049s]
[INFO] Qpid System Tests ................................. SUCCESS [6:02.072s]
[INFO] Qpid Performance Tests ............................ SUCCESS [14.427s]
[INFO] Qpid Performance Test System Tests ................ SUCCESS [17.142s]
[INFO] Qpid Performance Tests Visualisation JFC .......... SUCCESS [5.166s]
[INFO] Qpid BDB Store System Tests ....................... FAILURE [5.709s]
[INFO] joramtests ........................................ SUCCESS [0.598s]
[INFO] ------------------------------------------------------------------------
[INFO] BUILD FAILURE
[INFO] ------------------------------------------------------------------------
[INFO] Total time: 16:20.660s
[INFO] Finished at: Wed Sep 09 15:49:01 UTC 2015
[INFO] Final Memory: 74M/412M
[INFO] ------------------------------------------------------------------------
[ERROR] Failed to execute goal org.apache.maven.plugins:maven-surefire-plugin:2.16:test (integration-test)
on project qpid-bdbstore-systests: There are test failures.
[ERROR] 
[ERROR] Please refer to <https://builds.apache.org/job/Qpid-Java-Cpp-Test/ws/qpid-java/bdbstore/systests/target/surefire-reports>
for the individual test results.
[ERROR] -> [Help 1]
[ERROR] 
[ERROR] To see the full stack trace of the errors, re-run Maven with the -e switch.
[ERROR] Re-run Maven using the -X switch to enable full debug logging.
[ERROR] 
[ERROR] For more information about the errors and possible solutions, please read the following
articles:
[ERROR] [Help 1] http://cwiki.apache.org/confluence/display/MAVEN/MojoFailureException
[ERROR] 
[ERROR] After correcting the problems, you can resume the build with the command
[ERROR]   mvn <goals> -rf :qpid-bdbstore-systests
Build step 'Invoke top-level Maven targets' marked build as failure
[locks-and-latches] Releasing all the locks
[locks-and-latches] All the locks released
Recording test results

Mime
View raw message