qpid-notifications mailing list archives

Site index · List index
Message view « Date » · « Thread »
Top « Date » · « Thread »
From Apache Jenkins Server <jenk...@builds.apache.org>
Subject Build failed in Jenkins: Qpid-Java-Java-Test-JDK1.8 #1219
Date Tue, 01 Sep 2015 22:15:13 GMT
See <https://builds.apache.org/job/Qpid-Java-Java-Test-JDK1.8/1219/changes>

Changes:

[kwall] QPID-6724: [Java Broker] Stop writing all usernames within an external password database
to the log

* Also moderated some logging from INFO down to DEBUG

------------------------------------------
[...truncated 30936 lines...]
471/478 KB   1145/1393 KB   
471/478 KB   1149/1393 KB   
475/478 KB   1149/1393 KB   
475/478 KB   1153/1393 KB   
478/478 KB   1153/1393 KB   
478/478 KB   1157/1393 KB   
478/478 KB   1161/1393 KB   
478/478 KB   1165/1393 KB   
478/478 KB   1169/1393 KB   
478/478 KB   1173/1393 KB   
478/478 KB   1177/1393 KB   
478/478 KB   1181/1393 KB   
478/478 KB   1185/1393 KB   
478/478 KB   1189/1393 KB   
478/478 KB   1193/1393 KB   
478/478 KB   1197/1393 KB   
478/478 KB   1201/1393 KB   
478/478 KB   1205/1393 KB   
478/478 KB   1209/1393 KB   
478/478 KB   1213/1393 KB   
478/478 KB   1217/1393 KB   
478/478 KB   1221/1393 KB   
478/478 KB   1225/1393 KB   
478/478 KB   1229/1393 KB   
478/478 KB   1233/1393 KB   
478/478 KB   1237/1393 KB   
478/478 KB   1241/1393 KB   
478/478 KB   1245/1393 KB   
478/478 KB   1249/1393 KB   
478/478 KB   1253/1393 KB   
478/478 KB   1257/1393 KB   
478/478 KB   1261/1393 KB   
478/478 KB   1265/1393 KB   
478/478 KB   1269/1393 KB   
478/478 KB   1273/1393 KB   
478/478 KB   1277/1393 KB   
478/478 KB   1281/1393 KB   
478/478 KB   1285/1393 KB   
478/478 KB   1289/1393 KB   
478/478 KB   1293/1393 KB   
478/478 KB   1297/1393 KB   
478/478 KB   1301/1393 KB   
478/478 KB   1305/1393 KB   
478/478 KB   1309/1393 KB   
478/478 KB   1313/1393 KB   
478/478 KB   1317/1393 KB   
478/478 KB   1321/1393 KB   
478/478 KB   1325/1393 KB   
478/478 KB   1329/1393 KB   
478/478 KB   1333/1393 KB   
478/478 KB   1337/1393 KB   
478/478 KB   1341/1393 KB   
478/478 KB   1345/1393 KB   
478/478 KB   1349/1393 KB   
478/478 KB   1353/1393 KB   
478/478 KB   1357/1393 KB   
478/478 KB   1361/1393 KB   
478/478 KB   1365/1393 KB   
478/478 KB   1369/1393 KB   
478/478 KB   1373/1393 KB   
478/478 KB   1377/1393 KB   
478/478 KB   1381/1393 KB   
478/478 KB   1385/1393 KB   
478/478 KB   1389/1393 KB   
478/478 KB   1393/1393 KB   
478/478 KB   1393/1393 KB   
                            
Downloaded: http://repo.maven.apache.org/maven2/jfree/jcommon/1.0.16/jcommon-1.0.16.jar (478
KB at 3671.0 KB/sec)
                            
Downloaded: http://repo.maven.apache.org/maven2/jfree/jfreechart/1.0.13/jfreechart-1.0.13.jar
(1393 KB at 9602.2 KB/sec)
[INFO] 
[INFO] --- maven-clean-plugin:2.5:clean (default-clean) @ qpid-perftests-visualisation-jfc
---
[INFO] 
[INFO] --- maven-antrun-plugin:1.7:run (output-test-properties) @ qpid-perftests-visualisation-jfc
---
[INFO] Executing tasks

main:
     [echo] Qpid Test Profile Properties
     [echo] [profile] java-mms.0-10
     [echo] [profile.broker.language] java
     [echo] [profile.broker.type] internal
     [echo] [profile.broker.command] "<https://builds.apache.org/job/Qpid-Java-Java-Test-JDK1.8/ws/trunk/perftests/visualisation-jfc/bin/qpid-server">
-sp @STORE_PATH -st @STORE_TYPE
     [echo] [profile.specific.excludes] JavaTransientExcludes Java010Excludes
     [echo] [profile.test.excludes] Excludes JavaExcludes java-mms.0-10.excludes JavaTransientExcludes
Java010Excludes
     [echo] [profile.broker.version] v0_10
     [echo] [profile.test.amqp_port_protocols] ["AMQP_0_8","AMQP_0_9","AMQP_0_9_1","AMQP_0_10"]
     [echo] [profile.broker.persistent] false
     [echo] [profile.virtualhostnode.type] Memory
     [echo] [profile.virtualhostnode.context.blueprint] {"type":"ProvidedStore","globalAddressDomains":"${qpid.globalAddressDomains}"}
     [echo] [profile.test_receive_timeout] 1000
[INFO] Executed tasks
[INFO] 
[INFO] --- maven-enforcer-plugin:1.3.1:enforce (enforce-minimum-versions) @ qpid-perftests-visualisation-jfc
---
[INFO] 
[INFO] --- maven-enforcer-plugin:1.3.1:enforce (enforce-versions-standard-properties) @ qpid-perftests-visualisation-jfc
---
[INFO] 
[INFO] --- jacoco-maven-plugin:0.7.0.201403182114:prepare-agent (default-prepare-agent) @
qpid-perftests-visualisation-jfc ---
[INFO] argLine set to -javaagent:/home/jenkins/.m2/repository/org/jacoco/org.jacoco.agent/0.7.0.201403182114/org.jacoco.agent-0.7.0.201403182114-runtime.jar=destfile=<https://builds.apache.org/job/Qpid-Java-Java-Test-JDK1.8/ws/trunk/perftests/visualisation-jfc/target/jacoco.exec>
-Xmx512m
[INFO] 
[INFO] --- maven-remote-resources-plugin:1.5:process (default) @ qpid-perftests-visualisation-jfc
---
[INFO] 
[INFO] --- maven-resources-plugin:2.6:resources (default-resources) @ qpid-perftests-visualisation-jfc
---
[INFO] Using 'UTF-8' encoding to copy filtered resources.
[INFO] skip non existing resourceDirectory <https://builds.apache.org/job/Qpid-Java-Java-Test-JDK1.8/ws/trunk/perftests/visualisation-jfc/src/main/resources>
[INFO] Copying 0 resource
[INFO] Copying 3 resources
[INFO] 
[INFO] --- maven-compiler-plugin:3.1:compile (default-compile) @ qpid-perftests-visualisation-jfc
---
[INFO] Changes detected - recompiling the module!
[INFO] Compiling 30 source files to <https://builds.apache.org/job/Qpid-Java-Java-Test-JDK1.8/ws/trunk/perftests/visualisation-jfc/target/classes>
[WARNING] bootstrap class path not set in conjunction with -source 1.7
[INFO] 
[INFO] --- maven-resources-plugin:2.6:testResources (default-testResources) @ qpid-perftests-visualisation-jfc
---
[INFO] Using 'UTF-8' encoding to copy filtered resources.
[INFO] Copying 1 resource
[INFO] skip non existing resourceDirectory <https://builds.apache.org/job/Qpid-Java-Java-Test-JDK1.8/ws/trunk/perftests/visualisation-jfc/src/test/resources>
[INFO] Copying 3 resources
[INFO] 
[INFO] --- maven-compiler-plugin:3.1:testCompile (default-testCompile) @ qpid-perftests-visualisation-jfc
---
[INFO] Changes detected - recompiling the module!
[INFO] Compiling 11 source files to <https://builds.apache.org/job/Qpid-Java-Java-Test-JDK1.8/ws/trunk/perftests/visualisation-jfc/target/test-classes>
[WARNING] bootstrap class path not set in conjunction with -source 1.7
[INFO] 
[INFO] --- maven-surefire-plugin:2.16:test (default-test) @ qpid-perftests-visualisation-jfc
---
[INFO] Surefire report directory: <https://builds.apache.org/job/Qpid-Java-Java-Test-JDK1.8/ws/trunk/perftests/visualisation-jfc/target/surefire-reports>

-------------------------------------------------------
 T E S T S
-------------------------------------------------------
Running org.apache.qpid.disttest.charting.writer.ChartWriterTest
Tests run: 3, Failures: 0, Errors: 0, Skipped: 0, Time elapsed: 2.92 sec - in org.apache.qpid.disttest.charting.writer.ChartWriterTest
Running org.apache.qpid.disttest.charting.definition.SeriesDefinitionCreatorTest
Tests run: 4, Failures: 0, Errors: 0, Skipped: 0, Time elapsed: 0.032 sec - in org.apache.qpid.disttest.charting.definition.SeriesDefinitionCreatorTest
Running org.apache.qpid.disttest.charting.definition.ChartingDefinitionCreatorTest
Tests run: 4, Failures: 0, Errors: 0, Skipped: 0, Time elapsed: 0.03 sec - in org.apache.qpid.disttest.charting.definition.ChartingDefinitionCreatorTest
Running org.apache.qpid.disttest.charting.chartbuilder.ColorFactoryTest
Tests run: 2, Failures: 0, Errors: 0, Skipped: 0, Time elapsed: 0.011 sec - in org.apache.qpid.disttest.charting.chartbuilder.ColorFactoryTest
Running org.apache.qpid.disttest.charting.chartbuilder.ChartProductionTest
Tests run: 8, Failures: 0, Errors: 0, Skipped: 0, Time elapsed: 0.798 sec - in org.apache.qpid.disttest.charting.chartbuilder.ChartProductionTest
Running org.apache.qpid.disttest.charting.chartbuilder.BaseChartBuilderTest
Tests run: 1, Failures: 0, Errors: 0, Skipped: 0, Time elapsed: 0.075 sec - in org.apache.qpid.disttest.charting.chartbuilder.BaseChartBuilderTest
Running org.apache.qpid.disttest.charting.chartbuilder.TimeSeriesBuilderCallbackTest
Tests run: 1, Failures: 0, Errors: 0, Skipped: 0, Time elapsed: 0.005 sec - in org.apache.qpid.disttest.charting.chartbuilder.TimeSeriesBuilderCallbackTest
Running org.apache.qpid.disttest.charting.chartbuilder.ChartBuilderFactoryTest
Tests run: 6, Failures: 0, Errors: 0, Skipped: 0, Time elapsed: 0.021 sec - in org.apache.qpid.disttest.charting.chartbuilder.ChartBuilderFactoryTest
Running org.apache.qpid.disttest.charting.seriesbuilder.JdbcSeriesBuilderTest
Tests run: 1, Failures: 0, Errors: 0, Skipped: 0, Time elapsed: 0.123 sec - in org.apache.qpid.disttest.charting.seriesbuilder.JdbcSeriesBuilderTest
Running org.apache.qpid.disttest.charting.seriesbuilder.JdbcUrlGeneratorTest
Tests run: 4, Failures: 0, Errors: 0, Skipped: 0, Time elapsed: 0.016 sec - in org.apache.qpid.disttest.charting.seriesbuilder.JdbcUrlGeneratorTest
Running org.apache.qpid.disttest.charting.seriesbuilder.SeriesRowTest
Tests run: 5, Failures: 0, Errors: 0, Skipped: 0, Time elapsed: 0.016 sec - in org.apache.qpid.disttest.charting.seriesbuilder.SeriesRowTest

Results :

Tests run: 39, Failures: 0, Errors: 0, Skipped: 0

[INFO] 
[INFO] --- maven-jar-plugin:2.4:jar (default-jar) @ qpid-perftests-visualisation-jfc ---
[INFO] Building jar: <https://builds.apache.org/job/Qpid-Java-Java-Test-JDK1.8/ws/trunk/perftests/visualisation-jfc/target/qpid-perftests-visualisation-jfc-6.0.0-SNAPSHOT.jar>
[INFO] 
[INFO] --- maven-site-plugin:3.3:attach-descriptor (attach-descriptor) @ qpid-perftests-visualisation-jfc
---
[INFO] 
[INFO] --- maven-assembly-plugin:2.4:single (make-assembly) @ qpid-perftests-visualisation-jfc
---
[INFO] Reading assembly descriptor: src/main/assembly/qpid-perftests-visualisation-jfc-bin.xml
[INFO] Building tar: <https://builds.apache.org/job/Qpid-Java-Java-Test-JDK1.8/ws/trunk/perftests/visualisation-jfc/target/qpid-perftests-visualisation-jfc-6.0.0-SNAPSHOT-bin.tar.gz>
[WARNING] Entry: qpid-perftests-visualisation-jfc/6.0.0-SNAPSHOT/lib/qpid-perftests-visualisation-jfc-6.0.0-SNAPSHOT.jar
longer than 100 characters.
[WARNING] Resulting tar file can only be processed successfully by GNU compatible tar commands
[INFO] 
[INFO] --- maven-antrun-plugin:1.7:run (create-qbtc-output-dir) @ qpid-perftests-visualisation-jfc
---
[INFO] Executing tasks

main:
    [mkdir] Created dir: <https://builds.apache.org/job/Qpid-Java-Java-Test-JDK1.8/ws/trunk/perftests/visualisation-jfc/target/qbtc-test-config>
[INFO] Executed tasks
[INFO]                                                                         
[INFO] ------------------------------------------------------------------------
[INFO] Skipping Qpid BDB Store System Tests
[INFO] This project has been banned from the build due to previous failures.
[INFO] ------------------------------------------------------------------------
[INFO] ------------------------------------------------------------------------
[INFO] Reactor Summary:
[INFO] 
[INFO] Qpid Java Build ................................... SUCCESS [21.891s]
[INFO] Qpid Broker Code Generation ....................... SUCCESS [4.322s]
[INFO] Qpid Test Utilities ............................... SUCCESS [21.178s]
[INFO] Qpid Common ....................................... SUCCESS [23.966s]
[INFO] Qpid Management Common ............................ SUCCESS [2.118s]
[INFO] Qpid Java Broker Core ............................. SUCCESS [2:04.583s]
[INFO] Qpid Access Control Broker Plug-in ................ SUCCESS [5.369s]
[INFO] Qpid AMQP 0-8 Protocol Broker Plug-in ............. SUCCESS [5.426s]
[INFO] Qpid AMQP 0-10 Protocol Plug-in ................... SUCCESS [4.802s]
[INFO] Qpid AMQP 1-0 Protocol Broker Plug-in ............. SUCCESS [5.992s]
[INFO] Qpid AMQP 0-8 to 0-10 Message Conversion Broker Plug-in  SUCCESS [0.309s]
[INFO] Qpid AMQP 0-8 to 1-0 Message Conversion Broker Plug-in  SUCCESS [0.290s]
[INFO] Qpid AMQP 0-10 to 1-0 Message Conversion Broker Plug-in  SUCCESS [0.359s]
[INFO] Qpid Derby Message Store .......................... SUCCESS [24.528s]
[INFO] Qpid JDBC Message Store Connection Pooling Plug-in  SUCCESS [4.751s]
[INFO] Qpid JDBC Message Store Broker Plug-in ............ SUCCESS [9.352s]
[INFO] Qpid HTTP Management Broker Plug-in ............... SUCCESS [27.210s]
[INFO] Qpid JMX Management Broker Plug-in ................ SUCCESS [4.171s]
[INFO] Qpid Memory Message Store Broker Plug-in .......... SUCCESS [0.402s]
[INFO] Qpid WebSocket Broker Plug-in ..................... SUCCESS [2.932s]
[INFO] Qpid AMQP 0-x JMS Client .......................... SUCCESS [9.816s]
[INFO] Qpid BDB Message Store ............................ SUCCESS [7.357s]
[INFO] Qpid BDB Message Store JMX ........................ SUCCESS [2.587s]
[INFO] Qpid Java Broker .................................. SUCCESS [4.588s]
[INFO] Qpid AMQP Management Protocol Broker Plug-in ...... SUCCESS [0.293s]
[INFO] Qpid AMQP 0-x JMS Client Examples ................. SUCCESS [0.230s]
[INFO] Qpid JCA .......................................... SUCCESS [14.775s]
[INFO] Qpid Resource Adaptor ............................. SUCCESS [0.563s]
[INFO] Qpid Tools ........................................ SUCCESS [0.416s]
[INFO] Qpid Management Examples .......................... SUCCESS [0.176s]
[INFO] Qpid Java System Test Parent ...................... SUCCESS [1.874s]
[INFO] Qpid System Tests ................................. FAILURE [18:32.780s]
[INFO] Qpid Performance Tests ............................ SUCCESS [17.579s]
[INFO] Qpid Performance Test System Tests ................ SKIPPED
[INFO] Qpid Performance Tests Visualisation JFC .......... SUCCESS [8.779s]
[INFO] Qpid BDB Store System Tests ....................... SKIPPED
[INFO] ------------------------------------------------------------------------
[INFO] BUILD FAILURE
[INFO] ------------------------------------------------------------------------
[INFO] Total time: 24:39.419s
[INFO] Finished at: Tue Sep 01 22:14:20 UTC 2015
[INFO] Final Memory: 81M/338M
[INFO] ------------------------------------------------------------------------
[ERROR] Failed to execute goal org.apache.maven.plugins:maven-surefire-plugin:2.16:test (integration-test)
on project qpid-systests: There are test failures.
[ERROR] 
[ERROR] Please refer to <https://builds.apache.org/job/Qpid-Java-Java-Test-JDK1.8/ws/trunk/systests/target/surefire-reports>
for the individual test results.
[ERROR] -> [Help 1]
[ERROR] 
[ERROR] To see the full stack trace of the errors, re-run Maven with the -e switch.
[ERROR] Re-run Maven using the -X switch to enable full debug logging.
[ERROR] 
[ERROR] For more information about the errors and possible solutions, please read the following
articles:
[ERROR] [Help 1] http://cwiki.apache.org/confluence/display/MAVEN/MojoFailureException
[ERROR] 
[ERROR] After correcting the problems, you can resume the build with the command
[ERROR]   mvn <goals> -rf :qpid-systests
Build step 'Invoke top-level Maven targets' marked build as failure
[locks-and-latches] Releasing all the locks
[locks-and-latches] All the locks released
Archiving artifacts
Sending artifact delta relative to Qpid-Java-Java-Test-JDK1.8 #1216
Archived 4826 artifacts
Archive block size is 32768
Received 0 blocks and 318957171 bytes
Compression is 0.0%
Took 1 min 18 sec
Recording test results

Mime
View raw message