qpid-notifications mailing list archives

Site index · List index
Message view « Date » · « Thread »
Top « Date » · « Thread »
From Apache Jenkins Server <jenk...@builds.apache.org>
Subject Build failed in Jenkins: Qpid-Java-Cpp-Test #2838
Date Fri, 04 Sep 2015 16:51:49 GMT
See <https://builds.apache.org/job/Qpid-Java-Cpp-Test/2838/changes>

Changes:

[orudyy] QPID-6727: Introduce context variable for network buffer size, use it to set max
frame size, send and receive buffer sizes and remove port attributes for send and receive
buffers sizes

           (work by Lorenz Quack <quack.lorenz@gmail.com> and Alex Rudyy <orudyy@apache.org>)

------------------------------------------
[...truncated 10371 lines...]
Running org.apache.qpid.disttest.controller.ControllerTest
Tests run: 6, Failures: 0, Errors: 0, Skipped: 0, Time elapsed: 0.09 sec - in org.apache.qpid.disttest.controller.ControllerTest
Running org.apache.qpid.disttest.controller.ClientRegistryTest
Tests run: 8, Failures: 0, Errors: 0, Skipped: 0, Time elapsed: 2.584 sec - in org.apache.qpid.disttest.controller.ClientRegistryTest
Running org.apache.qpid.disttest.controller.TestRunnerTest
Tests run: 6, Failures: 0, Errors: 0, Skipped: 0, Time elapsed: 1.154 sec - in org.apache.qpid.disttest.controller.TestRunnerTest
Running org.apache.qpid.disttest.ArgumentParserTest
Tests run: 3, Failures: 0, Errors: 0, Skipped: 0, Time elapsed: 0.004 sec - in org.apache.qpid.disttest.ArgumentParserTest
Running org.apache.qpid.disttest.db.ResultsDbWriterTest
Tests run: 2, Failures: 0, Errors: 0, Skipped: 0, Time elapsed: 2.057 sec - in org.apache.qpid.disttest.db.ResultsDbWriterTest
Running org.apache.qpid.disttest.client.ParticipantRegistryTest
Tests run: 2, Failures: 0, Errors: 0, Skipped: 0, Time elapsed: 0.014 sec - in org.apache.qpid.disttest.client.ParticipantRegistryTest
Running org.apache.qpid.disttest.client.utils.ExecutorWithNoLimitsTest
Tests run: 2, Failures: 0, Errors: 0, Skipped: 0, Time elapsed: 0.011 sec - in org.apache.qpid.disttest.client.utils.ExecutorWithNoLimitsTest
Running org.apache.qpid.disttest.client.utils.ExecutorWithTimeLimitTest
Tests run: 4, Failures: 0, Errors: 0, Skipped: 0, Time elapsed: 0.52 sec - in org.apache.qpid.disttest.client.utils.ExecutorWithTimeLimitTest
Running org.apache.qpid.disttest.client.property.PropertyValueFactoryTest
Tests run: 5, Failures: 0, Errors: 0, Skipped: 0, Time elapsed: 0.011 sec - in org.apache.qpid.disttest.client.property.PropertyValueFactoryTest
Running org.apache.qpid.disttest.client.property.RangePropertyValueTest
Tests run: 8, Failures: 0, Errors: 0, Skipped: 0, Time elapsed: 0.017 sec - in org.apache.qpid.disttest.client.property.RangePropertyValueTest
Running org.apache.qpid.disttest.client.property.RandomPropertyValueTest
Tests run: 5, Failures: 0, Errors: 0, Skipped: 0, Time elapsed: 0.01 sec - in org.apache.qpid.disttest.client.property.RandomPropertyValueTest
Running org.apache.qpid.disttest.client.property.ListPropertyValueTest
Tests run: 3, Failures: 0, Errors: 0, Skipped: 0, Time elapsed: 0.007 sec - in org.apache.qpid.disttest.client.property.ListPropertyValueTest
Running org.apache.qpid.disttest.client.property.SimplePropertyValueTest
Tests run: 1, Failures: 0, Errors: 0, Skipped: 0, Time elapsed: 0.003 sec - in org.apache.qpid.disttest.client.property.SimplePropertyValueTest
Running org.apache.qpid.disttest.client.ParticipantExecutorTest
Tests run: 4, Failures: 0, Errors: 0, Skipped: 0, Time elapsed: 0.056 sec - in org.apache.qpid.disttest.client.ParticipantExecutorTest
Running org.apache.qpid.disttest.client.ConsumerParticipantTest
Tests run: 7, Failures: 0, Errors: 0, Skipped: 0, Time elapsed: 0.221 sec - in org.apache.qpid.disttest.client.ConsumerParticipantTest
Running org.apache.qpid.disttest.client.MessageProviderTest
Tests run: 3, Failures: 0, Errors: 0, Skipped: 0, Time elapsed: 0.05 sec - in org.apache.qpid.disttest.client.MessageProviderTest
Running org.apache.qpid.disttest.client.ClientCommandVisitorTest
Tests run: 8, Failures: 0, Errors: 0, Skipped: 0, Time elapsed: 0.02 sec - in org.apache.qpid.disttest.client.ClientCommandVisitorTest
Running org.apache.qpid.disttest.client.ClientTest
Tests run: 8, Failures: 0, Errors: 0, Skipped: 0, Time elapsed: 0.538 sec - in org.apache.qpid.disttest.client.ClientTest
Running org.apache.qpid.disttest.client.ParticipantResultFactoryTest
Tests run: 3, Failures: 0, Errors: 0, Skipped: 0, Time elapsed: 0.006 sec - in org.apache.qpid.disttest.client.ParticipantResultFactoryTest
Running org.apache.qpid.disttest.client.ProducerParticipantTest
Tests run: 9, Failures: 0, Errors: 0, Skipped: 0, Time elapsed: 1.506 sec - in org.apache.qpid.disttest.client.ProducerParticipantTest

Results :

Tests run: 180, Failures: 0, Errors: 0, Skipped: 0

[INFO] 
[INFO] --- maven-jar-plugin:2.4:jar (default-jar) @ qpid-perftests ---
[INFO] Building jar: <https://builds.apache.org/job/Qpid-Java-Cpp-Test/ws/qpid-java/perftests/target/qpid-perftests-6.0.0-SNAPSHOT.jar>
[INFO] 
[INFO] --- maven-site-plugin:3.3:attach-descriptor (attach-descriptor) @ qpid-perftests ---
[INFO] 
[INFO] --- maven-assembly-plugin:2.4:single (make-assembly) @ qpid-perftests ---
[INFO] Reading assembly descriptor: src/main/assembly/qpid-perftests-bin.xml
[INFO] Building tar: <https://builds.apache.org/job/Qpid-Java-Cpp-Test/ws/qpid-java/perftests/target/qpid-perftests-6.0.0-SNAPSHOT-bin.tar.gz>
[WARNING] Entry: qpid-perftests/6.0.0-SNAPSHOT/etc/chartdefs/1050-VaryingNumberOfProducerSessionsSingleConnection.chartdef
longer than 100 characters.
[WARNING] Resulting tar file can only be processed successfully by GNU compatible tar commands
[WARNING] Entry: qpid-perftests/6.0.0-SNAPSHOT/etc/chartdefs/1300-QueueConsumersWithNonOverlappingSelectors-Transient.chartdef
longer than 100 characters.
[WARNING] Entry: qpid-perftests/6.0.0-SNAPSHOT/etc/chartdefs/timeseries/1011-MultipleProducersAndConsumers-Persistent.chartdef
longer than 100 characters.
[WARNING] Entry: qpid-perftests/6.0.0-SNAPSHOT/etc/chartdefs/1302-QueueConsumersWithOverlappingSelectors-Transient.chartdef
longer than 100 characters.
[WARNING] Entry: qpid-perftests/6.0.0-SNAPSHOT/etc/chartdefs/1301-QueueConsumersWithNonOverlappingSelectors-Persistent.chartdef
longer than 100 characters.
[WARNING] Entry: qpid-perftests/6.0.0-SNAPSHOT/etc/chartdefs/1303-QueueConsumersWithOverlappingSelectors-Persistent.chartdef
longer than 100 characters.
[INFO] 
[INFO] --- maven-antrun-plugin:1.7:run (create-qbtc-output-dir) @ qpid-perftests ---
[INFO] Executing tasks

main:
    [mkdir] Created dir: <https://builds.apache.org/job/Qpid-Java-Cpp-Test/ws/qpid-java/perftests/target/qbtc-test-config>
[INFO] Executed tasks
[INFO]                                                                         
[INFO] ------------------------------------------------------------------------
[INFO] Skipping Qpid Performance Test System Tests
[INFO] This project has been banned from the build due to previous failures.
[INFO] ------------------------------------------------------------------------
[INFO]                                                                         
[INFO] ------------------------------------------------------------------------
[INFO] Building Qpid Performance Tests Visualisation JFC 6.0.0-SNAPSHOT
[INFO] ------------------------------------------------------------------------
[INFO] 
[INFO] --- maven-clean-plugin:2.5:clean (default-clean) @ qpid-perftests-visualisation-jfc
---
[INFO] 
[INFO] --- maven-antrun-plugin:1.7:run (output-test-properties) @ qpid-perftests-visualisation-jfc
---
[INFO] Executing tasks

main:
     [echo] Qpid Test Profile Properties
     [echo] [profile] cpp
     [echo] [profile.broker.language] cpp
     [echo] [profile.broker.type] spawned
     [echo] [profile.broker.command] "<https://builds.apache.org/job/Qpid-Java-Cpp-Test/ws/qpid/cpp-build/src/qpidd">
-p @PORT --data-dir "<https://builds.apache.org/job/Qpid-Java-Cpp-Test/ws/qpid-java/perftests/visualisation-jfc/target/QPID_WORK/@PORT">
-t --auth no --no-module-dir
     [echo] [profile.specific.excludes] CPPPrefetchExcludes CPPTransientExcludes
     [echo] [profile.test.excludes] Excludes CPPExcludes cpp.excludes CPPPrefetchExcludes
CPPTransientExcludes cpp.excludes
     [echo] [profile.broker.version] v0_10
     [echo] [profile.test.amqp_port_protocols] ["AMQP_0_8","AMQP_0_9","AMQP_0_9_1","AMQP_0_10"]
     [echo] [profile.broker.persistent] false
     [echo] [profile.virtualhostnode.type] Memory
     [echo] [profile.virtualhostnode.context.blueprint] ${profile.virtualhostnode.context.blueprint}
     [echo] [profile.test_receive_timeout] 1000
[INFO] Executed tasks
[INFO] 
[INFO] --- maven-enforcer-plugin:1.3.1:enforce (enforce-minimum-versions) @ qpid-perftests-visualisation-jfc
---
[INFO] 
[INFO] --- maven-enforcer-plugin:1.3.1:enforce (enforce-versions-standard-properties) @ qpid-perftests-visualisation-jfc
---
[INFO] 
[INFO] --- maven-enforcer-plugin:1.3.1:enforce (enforce-cpp-broker-dir-defined) @ qpid-perftests-visualisation-jfc
---
[INFO] 
[INFO] --- jacoco-maven-plugin:0.7.0.201403182114:prepare-agent (default-prepare-agent) @
qpid-perftests-visualisation-jfc ---
[INFO] argLine set to -javaagent:/home/jenkins/.m2/repository/org/jacoco/org.jacoco.agent/0.7.0.201403182114/org.jacoco.agent-0.7.0.201403182114-runtime.jar=destfile=<https://builds.apache.org/job/Qpid-Java-Cpp-Test/ws/qpid-java/perftests/visualisation-jfc/target/jacoco.exec>
-Xmx512m
[INFO] 
[INFO] --- maven-remote-resources-plugin:1.5:process (default) @ qpid-perftests-visualisation-jfc
---
[INFO] 
[INFO] --- maven-resources-plugin:2.6:resources (default-resources) @ qpid-perftests-visualisation-jfc
---
[INFO] Using 'UTF-8' encoding to copy filtered resources.
[INFO] skip non existing resourceDirectory <https://builds.apache.org/job/Qpid-Java-Cpp-Test/ws/qpid-java/perftests/visualisation-jfc/src/main/resources>
[INFO] Copying 0 resource
[INFO] Copying 3 resources
[INFO] 
[INFO] --- maven-compiler-plugin:3.1:compile (default-compile) @ qpid-perftests-visualisation-jfc
---
[INFO] Changes detected - recompiling the module!
[INFO] Compiling 30 source files to <https://builds.apache.org/job/Qpid-Java-Cpp-Test/ws/qpid-java/perftests/visualisation-jfc/target/classes>
[INFO] 
[INFO] --- maven-resources-plugin:2.6:testResources (default-testResources) @ qpid-perftests-visualisation-jfc
---
[INFO] Using 'UTF-8' encoding to copy filtered resources.
[INFO] Copying 1 resource
[INFO] skip non existing resourceDirectory <https://builds.apache.org/job/Qpid-Java-Cpp-Test/ws/qpid-java/perftests/visualisation-jfc/src/test/resources>
[INFO] Copying 3 resources
[INFO] 
[INFO] --- maven-compiler-plugin:3.1:testCompile (default-testCompile) @ qpid-perftests-visualisation-jfc
---
[INFO] Changes detected - recompiling the module!
[INFO] Compiling 11 source files to <https://builds.apache.org/job/Qpid-Java-Cpp-Test/ws/qpid-java/perftests/visualisation-jfc/target/test-classes>
[INFO] 
[INFO] --- maven-surefire-plugin:2.16:test (default-test) @ qpid-perftests-visualisation-jfc
---
[INFO] Surefire report directory: <https://builds.apache.org/job/Qpid-Java-Cpp-Test/ws/qpid-java/perftests/visualisation-jfc/target/surefire-reports>

-------------------------------------------------------
 T E S T S
-------------------------------------------------------
Running org.apache.qpid.disttest.charting.writer.ChartWriterTest
Tests run: 3, Failures: 0, Errors: 0, Skipped: 0, Time elapsed: 2.077 sec - in org.apache.qpid.disttest.charting.writer.ChartWriterTest
Running org.apache.qpid.disttest.charting.seriesbuilder.JdbcUrlGeneratorTest
Tests run: 4, Failures: 0, Errors: 0, Skipped: 0, Time elapsed: 0.026 sec - in org.apache.qpid.disttest.charting.seriesbuilder.JdbcUrlGeneratorTest
Running org.apache.qpid.disttest.charting.seriesbuilder.JdbcSeriesBuilderTest
Tests run: 1, Failures: 0, Errors: 0, Skipped: 0, Time elapsed: 0.139 sec - in org.apache.qpid.disttest.charting.seriesbuilder.JdbcSeriesBuilderTest
Running org.apache.qpid.disttest.charting.seriesbuilder.SeriesRowTest
Tests run: 5, Failures: 0, Errors: 0, Skipped: 0, Time elapsed: 0.014 sec - in org.apache.qpid.disttest.charting.seriesbuilder.SeriesRowTest
Running org.apache.qpid.disttest.charting.definition.SeriesDefinitionCreatorTest
Tests run: 4, Failures: 0, Errors: 0, Skipped: 0, Time elapsed: 0.027 sec - in org.apache.qpid.disttest.charting.definition.SeriesDefinitionCreatorTest
Running org.apache.qpid.disttest.charting.definition.ChartingDefinitionCreatorTest
Tests run: 4, Failures: 0, Errors: 0, Skipped: 0, Time elapsed: 0.023 sec - in org.apache.qpid.disttest.charting.definition.ChartingDefinitionCreatorTest
Running org.apache.qpid.disttest.charting.chartbuilder.TimeSeriesBuilderCallbackTest
Tests run: 1, Failures: 0, Errors: 0, Skipped: 0, Time elapsed: 0.031 sec - in org.apache.qpid.disttest.charting.chartbuilder.TimeSeriesBuilderCallbackTest
Running org.apache.qpid.disttest.charting.chartbuilder.ChartProductionTest
Tests run: 8, Failures: 0, Errors: 0, Skipped: 0, Time elapsed: 0.885 sec - in org.apache.qpid.disttest.charting.chartbuilder.ChartProductionTest
Running org.apache.qpid.disttest.charting.chartbuilder.BaseChartBuilderTest
Tests run: 1, Failures: 0, Errors: 0, Skipped: 0, Time elapsed: 0.041 sec - in org.apache.qpid.disttest.charting.chartbuilder.BaseChartBuilderTest
Running org.apache.qpid.disttest.charting.chartbuilder.ColorFactoryTest
Tests run: 2, Failures: 0, Errors: 0, Skipped: 0, Time elapsed: 0.005 sec - in org.apache.qpid.disttest.charting.chartbuilder.ColorFactoryTest
Running org.apache.qpid.disttest.charting.chartbuilder.ChartBuilderFactoryTest
Tests run: 6, Failures: 0, Errors: 0, Skipped: 0, Time elapsed: 0.014 sec - in org.apache.qpid.disttest.charting.chartbuilder.ChartBuilderFactoryTest

Results :

Tests run: 39, Failures: 0, Errors: 0, Skipped: 0

[INFO] 
[INFO] --- maven-jar-plugin:2.4:jar (default-jar) @ qpid-perftests-visualisation-jfc ---
[INFO] Building jar: <https://builds.apache.org/job/Qpid-Java-Cpp-Test/ws/qpid-java/perftests/visualisation-jfc/target/qpid-perftests-visualisation-jfc-6.0.0-SNAPSHOT.jar>
[INFO] 
[INFO] --- maven-site-plugin:3.3:attach-descriptor (attach-descriptor) @ qpid-perftests-visualisation-jfc
---
[INFO] 
[INFO] --- maven-assembly-plugin:2.4:single (make-assembly) @ qpid-perftests-visualisation-jfc
---
[INFO] Reading assembly descriptor: src/main/assembly/qpid-perftests-visualisation-jfc-bin.xml
[INFO] Building tar: <https://builds.apache.org/job/Qpid-Java-Cpp-Test/ws/qpid-java/perftests/visualisation-jfc/target/qpid-perftests-visualisation-jfc-6.0.0-SNAPSHOT-bin.tar.gz>
[WARNING] Entry: qpid-perftests-visualisation-jfc/6.0.0-SNAPSHOT/lib/qpid-perftests-visualisation-jfc-6.0.0-SNAPSHOT.jar
longer than 100 characters.
[WARNING] Resulting tar file can only be processed successfully by GNU compatible tar commands
[INFO] 
[INFO] --- maven-antrun-plugin:1.7:run (create-qbtc-output-dir) @ qpid-perftests-visualisation-jfc
---
[INFO] Executing tasks

main:
    [mkdir] Created dir: <https://builds.apache.org/job/Qpid-Java-Cpp-Test/ws/qpid-java/perftests/visualisation-jfc/target/qbtc-test-config>
[INFO] Executed tasks
[INFO]                                                                         
[INFO] ------------------------------------------------------------------------
[INFO] Skipping Qpid BDB Store System Tests
[INFO] This project has been banned from the build due to previous failures.
[INFO] ------------------------------------------------------------------------
[INFO] ------------------------------------------------------------------------
[INFO] Reactor Summary:
[INFO] 
[INFO] Qpid Java Build ................................... SUCCESS [2.213s]
[INFO] Qpid Broker Code Generation ....................... SUCCESS [2.111s]
[INFO] Qpid Test Utilities ............................... SUCCESS [0.557s]
[INFO] Qpid Common ....................................... SUCCESS [3:46.853s]
[INFO] Qpid Management Common ............................ SUCCESS [1.809s]
[INFO] Qpid Java Broker Core ............................. SUCCESS [1:31.133s]
[INFO] Qpid Access Control Broker Plug-in ................ SUCCESS [4.767s]
[INFO] Qpid AMQP 0-8 Protocol Broker Plug-in ............. FAILURE [6.495s]
[INFO] Qpid AMQP 0-10 Protocol Plug-in ................... SUCCESS [4.933s]
[INFO] Qpid AMQP 1-0 Protocol Broker Plug-in ............. SUCCESS [5.787s]
[INFO] Qpid AMQP 0-8 to 0-10 Message Conversion Broker Plug-in  SKIPPED
[INFO] Qpid AMQP 0-8 to 1-0 Message Conversion Broker Plug-in  SKIPPED
[INFO] Qpid AMQP 0-10 to 1-0 Message Conversion Broker Plug-in  SUCCESS [0.342s]
[INFO] Qpid Derby Message Store .......................... SUCCESS [18.017s]
[INFO] Qpid JDBC Message Store Connection Pooling Plug-in  SUCCESS [0.372s]
[INFO] Qpid JDBC Message Store Broker Plug-in ............ SUCCESS [10.010s]
[INFO] Qpid HTTP Management Broker Plug-in ............... SUCCESS [6.396s]
[INFO] Qpid JMX Management Broker Plug-in ................ SUCCESS [2.895s]
[INFO] Qpid Memory Message Store Broker Plug-in .......... SUCCESS [0.409s]
[INFO] Qpid WebSocket Broker Plug-in ..................... SUCCESS [0.339s]
[INFO] Qpid AMQP 0-x JMS Client .......................... SUCCESS [8.930s]
[INFO] Qpid BDB Message Store ............................ SKIPPED
[INFO] Qpid BDB Message Store JMX ........................ SKIPPED
[INFO] Qpid Java Broker .................................. SKIPPED
[INFO] Qpid AMQP Management Protocol Broker Plug-in ...... SUCCESS [0.240s]
[INFO] Qpid AMQP 0-x JMS Client Examples ................. SUCCESS [0.166s]
[INFO] Qpid JCA .......................................... SUCCESS [2.130s]
[INFO] Qpid Resource Adaptor ............................. SUCCESS [0.476s]
[INFO] Qpid Tools ........................................ SUCCESS [0.513s]
[INFO] Qpid Management Examples .......................... SUCCESS [0.170s]
[INFO] Qpid Java System Test Parent ...................... SUCCESS [2.915s]
[INFO] Qpid System Tests ................................. SKIPPED
[INFO] Qpid Performance Tests ............................ SUCCESS [14.113s]
[INFO] Qpid Performance Test System Tests ................ SKIPPED
[INFO] Qpid Performance Tests Visualisation JFC .......... SUCCESS [4.970s]
[INFO] Qpid BDB Store System Tests ....................... SKIPPED
[INFO] ------------------------------------------------------------------------
[INFO] BUILD FAILURE
[INFO] ------------------------------------------------------------------------
[INFO] Total time: 7:01.079s
[INFO] Finished at: Fri Sep 04 16:53:06 UTC 2015
[INFO] Final Memory: 63M/308M
[INFO] ------------------------------------------------------------------------
[ERROR] Failed to execute goal org.apache.maven.plugins:maven-surefire-plugin:2.16:test (default-test)
on project qpid-broker-plugins-amqp-0-8-protocol: There are test failures.
[ERROR] 
[ERROR] Please refer to <https://builds.apache.org/job/Qpid-Java-Cpp-Test/ws/qpid-java/broker-plugins/amqp-0-8-protocol/target/surefire-reports>
for the individual test results.
[ERROR] -> [Help 1]
[ERROR] 
[ERROR] To see the full stack trace of the errors, re-run Maven with the -e switch.
[ERROR] Re-run Maven using the -X switch to enable full debug logging.
[ERROR] 
[ERROR] For more information about the errors and possible solutions, please read the following
articles:
[ERROR] [Help 1] http://cwiki.apache.org/confluence/display/MAVEN/MojoFailureException
[ERROR] 
[ERROR] After correcting the problems, you can resume the build with the command
[ERROR]   mvn <goals> -rf :qpid-broker-plugins-amqp-0-8-protocol
Build step 'Invoke top-level Maven targets' marked build as failure
[locks-and-latches] Releasing all the locks
[locks-and-latches] All the locks released
Recording test results

Mime
View raw message