qpid-notifications mailing list archives

Site index · List index
Message view « Date » · « Thread »
Top « Date » · « Thread »
From Apache Jenkins Server <jenk...@builds.apache.org>
Subject Build failed in Jenkins: Qpid-Java-Java-Test-IBMJDK1.7 #1227
Date Fri, 18 Sep 2015 19:17:25 GMT
See <https://builds.apache.org/job/Qpid-Java-Java-Test-IBMJDK1.7/1227/changes>

Changes:

[kwall] QPID-6743: [Java Client] Avoid premature attempt to verify peer hostname

[orudyy] QPID-6742: Saves Qpid Broker version and build revision in test results

------------------------------------------
[...truncated 3959 lines...]
[INFO] Executing tasks

main:
     [echo] Qpid Test Profile Properties
     [echo] [profile] java-mms.0-10
     [echo] [profile.broker.language] java
     [echo] [profile.broker.type] internal
     [echo] [profile.broker.command] "<https://builds.apache.org/job/Qpid-Java-Java-Test-IBMJDK1.7/ws/bdbstore/systests/target/qpid-broker/6.0.0-SNAPSHOT/bin/qpid-server">
-sp @STORE_PATH -st @STORE_TYPE
     [echo] [profile.specific.excludes] JavaTransientExcludes Java010Excludes IBMJDKExcludes
     [echo] [profile.test.excludes] Excludes JavaExcludes java-mms.0-10.excludes JavaTransientExcludes
Java010Excludes IBMJDKExcludes
     [echo] [profile.broker.version] v0_10
     [echo] [profile.test.amqp_port_protocols] ["AMQP_0_8","AMQP_0_9","AMQP_0_9_1","AMQP_0_10"]
     [echo] [profile.broker.persistent] false
     [echo] [profile.virtualhostnode.type] Memory
     [echo] [profile.virtualhostnode.context.blueprint] {"type":"ProvidedStore","globalAddressDomains":"${qpid.globalAddressDomains}"}
     [echo] [profile.test_receive_timeout] 1000
[INFO] Executed tasks
[INFO] 
[INFO] --- maven-enforcer-plugin:1.3.1:enforce (enforce-minimum-versions) @ qpid-bdbstore-systests
---
[INFO] 
[INFO] --- maven-enforcer-plugin:1.3.1:enforce (enforce-versions-standard-properties) @ qpid-bdbstore-systests
---
[INFO] 
[INFO] --- jacoco-maven-plugin:0.7.0.201403182114:prepare-agent (default-prepare-agent) @
qpid-bdbstore-systests ---
[INFO] Skipping JaCoCo execution because property jacoco.skip is set.
[INFO] argLine set to empty
[INFO] 
[INFO] --- maven-remote-resources-plugin:1.5:process (default) @ qpid-bdbstore-systests ---
[INFO] 
[INFO] --- maven-resources-plugin:2.6:copy-resources (copy-systests-etc-resources) @ qpid-bdbstore-systests
---
[INFO] Using 'UTF-8' encoding to copy filtered resources.
[INFO] Copying 4 resources
[INFO] 
[INFO] --- maven-resources-plugin:2.6:copy-resources (copy-test-profile-resources) @ qpid-bdbstore-systests
---
[INFO] Using 'UTF-8' encoding to copy filtered resources.
[INFO] Copying 46 resources
[INFO] 
[INFO] --- maven-resources-plugin:2.6:copy-resources (copy-bdbstore-bin-resources) @ qpid-bdbstore-systests
---
[INFO] Using 'UTF-8' encoding to copy filtered resources.
[INFO] Copying 1 resource
[INFO] 
[INFO] --- maven-resources-plugin:2.6:resources (default-resources) @ qpid-bdbstore-systests
---
[INFO] Using 'UTF-8' encoding to copy filtered resources.
[INFO] skip non existing resourceDirectory <https://builds.apache.org/job/Qpid-Java-Java-Test-IBMJDK1.7/ws/bdbstore/systests/src/main/resources>
[INFO] Copying 3 resources
[INFO] 
[INFO] --- maven-compiler-plugin:3.1:compile (default-compile) @ qpid-bdbstore-systests ---
[INFO] No sources to compile
[INFO] 
[INFO] --- maven-resources-plugin:2.6:testResources (default-testResources) @ qpid-bdbstore-systests
---
[INFO] Using 'UTF-8' encoding to copy filtered resources.
[INFO] skip non existing resourceDirectory <https://builds.apache.org/job/Qpid-Java-Java-Test-IBMJDK1.7/ws/bdbstore/systests/src/test/resources>
[INFO] Copying 3 resources
[INFO] 
[INFO] --- maven-compiler-plugin:3.1:testCompile (default-testCompile) @ qpid-bdbstore-systests
---
[INFO] Changes detected - recompiling the module!
[INFO] Compiling 8 source files to <https://builds.apache.org/job/Qpid-Java-Java-Test-IBMJDK1.7/ws/bdbstore/systests/target/test-classes>
[INFO] 
[INFO] --- maven-surefire-plugin:2.16:test (default-test) @ qpid-bdbstore-systests ---
[INFO] Tests are skipped.
[INFO] 
[INFO] --- maven-jar-plugin:2.4:jar (default-jar) @ qpid-bdbstore-systests ---
[INFO] Building jar: <https://builds.apache.org/job/Qpid-Java-Java-Test-IBMJDK1.7/ws/bdbstore/systests/target/qpid-bdbstore-systests-6.0.0-SNAPSHOT.jar>
[INFO] 
[INFO] --- maven-site-plugin:3.3:attach-descriptor (attach-descriptor) @ qpid-bdbstore-systests
---
[INFO] 
[INFO] --- maven-antrun-plugin:1.7:run (fix-bdb-script-permissions) @ qpid-bdbstore-systests
---
[INFO] Executing tasks

main:
[INFO] Executed tasks
[INFO] 
[INFO] --- maven-antrun-plugin:1.7:run (create-qbtc-output-dir) @ qpid-bdbstore-systests ---
[INFO] Executing tasks

main:
    [mkdir] Created dir: <https://builds.apache.org/job/Qpid-Java-Java-Test-IBMJDK1.7/ws/bdbstore/systests/target/qpid-broker/6.0.0-SNAPSHOT/qbtc-test-config>
[INFO] Executed tasks
[INFO] 
[INFO] --- maven-dependency-plugin:2.8:unpack (extract-broker-distribution) @ qpid-bdbstore-systests
---
[INFO] Configured Artifact: org.apache.qpid:qpid-broker:bin:6.0.0-SNAPSHOT:tar.gz
[INFO] Unpacking <https://builds.apache.org/job/Qpid-Java-Java-Test-IBMJDK1.7/ws/broker/target/qpid-broker-6.0.0-SNAPSHOT-bin.tar.gz>
to <https://builds.apache.org/job/Qpid-Java-Java-Test-IBMJDK1.7/ws/bdbstore/systests/target>
with includes "" and excludes ""
[INFO] Expanding: <https://builds.apache.org/job/Qpid-Java-Java-Test-IBMJDK1.7/ws/broker/target/qpid-broker-6.0.0-SNAPSHOT-bin.tar.gz>
into <https://builds.apache.org/job/Qpid-Java-Java-Test-IBMJDK1.7/ws/bdbstore/systests/target>
[INFO] 
[INFO] --- maven-dependency-plugin:2.8:copy (copy-sleepycat-jar-for-bdb-tests) @ qpid-bdbstore-systests
---
[INFO] Configured Artifact: com.sleepycat:je:5.0.104:jar
[INFO] Copying je-5.0.104.jar to <https://builds.apache.org/job/Qpid-Java-Java-Test-IBMJDK1.7/ws/bdbstore/systests/target/qpid-broker/6.0.0-SNAPSHOT/lib/je-5.0.104.jar>
[INFO] 
[INFO] --- maven-surefire-plugin:2.16:test (integration-test) @ qpid-bdbstore-systests ---
[INFO] Surefire report directory: <https://builds.apache.org/job/Qpid-Java-Java-Test-IBMJDK1.7/ws/bdbstore/systests/target/surefire-reports>

-------------------------------------------------------
 T E S T S
-------------------------------------------------------
Running org.apache.qpid.server.store.berkeleydb.BDBUpgradeTest
Tests run: 8, Failures: 0, Errors: 0, Skipped: 0, Time elapsed: 0.506 sec - in org.apache.qpid.server.store.berkeleydb.BDBUpgradeTest
Running org.apache.qpid.server.store.berkeleydb.replication.TwoNodeTest
Tests run: 7, Failures: 0, Errors: 0, Skipped: 0, Time elapsed: 0.088 sec - in org.apache.qpid.server.store.berkeleydb.replication.TwoNodeTest
Running org.apache.qpid.server.store.berkeleydb.replication.MultiNodeTest
Tests run: 10, Failures: 0, Errors: 0, Skipped: 0, Time elapsed: 0.064 sec - in org.apache.qpid.server.store.berkeleydb.replication.MultiNodeTest
Running org.apache.qpid.server.store.berkeleydb.replication.JMXManagementTest
Tests run: 7, Failures: 0, Errors: 0, Skipped: 0, Time elapsed: 0.05 sec - in org.apache.qpid.server.store.berkeleydb.replication.JMXManagementTest
Running org.apache.qpid.server.store.berkeleydb.replication.BDBHAVirtualHostRestTest
Tests run: 3, Failures: 0, Errors: 0, Skipped: 0, Time elapsed: 0.014 sec - in org.apache.qpid.server.store.berkeleydb.replication.BDBHAVirtualHostRestTest
Running org.apache.qpid.server.store.berkeleydb.replication.BDBHAVirtualHostNodeRestTest
Tests run: 7, Failures: 0, Errors: 0, Skipped: 0, Time elapsed: 0.02 sec - in org.apache.qpid.server.store.berkeleydb.replication.BDBHAVirtualHostNodeRestTest
Running org.apache.qpid.server.store.berkeleydb.BDBBackupTest
Tests run: 1, Failures: 0, Errors: 0, Skipped: 0, Time elapsed: 0.004 sec - in org.apache.qpid.server.store.berkeleydb.BDBBackupTest

Results :

Tests run: 43, Failures: 0, Errors: 0, Skipped: 0

[INFO]                                                                         
[INFO] ------------------------------------------------------------------------
[INFO] Building joramtests 6.0.0-SNAPSHOT
[INFO] ------------------------------------------------------------------------
[INFO] 
[INFO] --- maven-clean-plugin:2.5:clean (default-clean) @ joramtests ---
[INFO] Deleting <https://builds.apache.org/job/Qpid-Java-Java-Test-IBMJDK1.7/ws/joramtests/target>
[INFO] 
[INFO] --- maven-antrun-plugin:1.7:run (output-test-properties) @ joramtests ---
[INFO] Executing tasks

main:
     [echo] Joram Integration Tests: To run define system property -Djoramtests to a name
of a JMS client e.g. qpid-jms-client
[INFO] Executed tasks
[INFO] 
[INFO] --- maven-enforcer-plugin:1.3.1:enforce (enforce-minimum-versions) @ joramtests ---
[INFO] 
[INFO] --- maven-enforcer-plugin:1.3.1:enforce (enforce-versions-standard-properties) @ joramtests
---
[INFO] 
[INFO] --- jacoco-maven-plugin:0.7.0.201403182114:prepare-agent (default-prepare-agent) @
joramtests ---
[INFO] argLine set to -javaagent:/home/jenkins/.m2/repository/org/jacoco/org.jacoco.agent/0.7.0.201403182114/org.jacoco.agent-0.7.0.201403182114-runtime.jar=destfile=<https://builds.apache.org/job/Qpid-Java-Java-Test-IBMJDK1.7/ws/joramtests/target/jacoco.exec>
-Xmx512m
[INFO] 
[INFO] --- maven-remote-resources-plugin:1.5:process (default) @ joramtests ---
[INFO] 
[INFO] --- maven-resources-plugin:2.6:resources (default-resources) @ joramtests ---
[INFO] Using 'UTF-8' encoding to copy filtered resources.
[INFO] skip non existing resourceDirectory <https://builds.apache.org/job/Qpid-Java-Java-Test-IBMJDK1.7/ws/joramtests/src/main/resources>
[INFO] Copying 3 resources
[INFO] 
[INFO] --- maven-compiler-plugin:3.1:compile (default-compile) @ joramtests ---
[INFO] Changes detected - recompiling the module!
[INFO] Compiling 1 source file to <https://builds.apache.org/job/Qpid-Java-Java-Test-IBMJDK1.7/ws/joramtests/target/classes>
[WARNING] <https://builds.apache.org/job/Qpid-Java-Java-Test-IBMJDK1.7/ws/joramtests/src/main/java/org/apache/qpid/joramtests/admin/JavaBrokerAdmin.java>:[258,52]
authenticate(org.apache.http.auth.Credentials,org.apache.http.HttpRequest) in org.apache.http.impl.auth.BasicScheme
has been deprecated
[INFO] 
[INFO] --- maven-resources-plugin:2.6:testResources (default-testResources) @ joramtests ---
[INFO] Using 'UTF-8' encoding to copy filtered resources.
[INFO] Copying 6 resources
[INFO] Copying 3 resources
[INFO] 
[INFO] --- maven-compiler-plugin:3.1:testCompile (default-testCompile) @ joramtests ---
[INFO] No sources to compile
[INFO] 
[INFO] --- maven-surefire-plugin:2.16:test (default-test) @ joramtests ---
[INFO] 
[INFO] --- maven-jar-plugin:2.4:jar (default-jar) @ joramtests ---
[INFO] Building jar: <https://builds.apache.org/job/Qpid-Java-Java-Test-IBMJDK1.7/ws/joramtests/target/joramtests-6.0.0-SNAPSHOT.jar>
[INFO] 
[INFO] --- maven-site-plugin:3.3:attach-descriptor (attach-descriptor) @ joramtests ---
[INFO] 
[INFO] --- maven-antrun-plugin:1.7:run (create-qbtc-output-dir) @ joramtests ---
[INFO] Executing tasks

main:
    [mkdir] Created dir: <https://builds.apache.org/job/Qpid-Java-Java-Test-IBMJDK1.7/ws/joramtests/target/qbtc-test-config>
[INFO] Executed tasks
[INFO] 
[INFO] --- maven-failsafe-plugin:2.18.1:integration-test (default) @ joramtests ---
[INFO] Tests are skipped.
[INFO] 
[INFO] --- maven-failsafe-plugin:2.18.1:verify (default) @ joramtests ---
[INFO] Tests are skipped.
[INFO] ------------------------------------------------------------------------
[INFO] Reactor Summary:
[INFO] 
[INFO] Qpid Java Build ................................... SUCCESS [2.274s]
[INFO] Qpid Broker Code Generation ....................... SUCCESS [1.773s]
[INFO] Qpid Test Utilities ............................... SUCCESS [0.480s]
[INFO] Qpid Common ....................................... SUCCESS [28.418s]
[INFO] Qpid Management Common ............................ SUCCESS [2.523s]
[INFO] Qpid Java Broker Core ............................. SUCCESS [1:44.879s]
[INFO] Qpid Access Control Broker Plug-in ................ SUCCESS [5.271s]
[INFO] Qpid AMQP 0-8 Protocol Broker Plug-in ............. SUCCESS [5.420s]
[INFO] Qpid AMQP 0-10 Protocol Plug-in ................... SUCCESS [5.360s]
[INFO] Qpid AMQP 1-0 Protocol Broker Plug-in ............. SUCCESS [6.678s]
[INFO] Qpid AMQP 0-8 to 0-10 Message Conversion Broker Plug-in  SUCCESS [0.377s]
[INFO] Qpid AMQP 0-8 to 1-0 Message Conversion Broker Plug-in  SUCCESS [0.326s]
[INFO] Qpid AMQP 0-10 to 1-0 Message Conversion Broker Plug-in  SUCCESS [0.295s]
[INFO] Qpid Derby Message Store .......................... SUCCESS [16.903s]
[INFO] Qpid JDBC Message Store Connection Pooling Plug-in  SUCCESS [0.410s]
[INFO] Qpid JDBC Message Store Broker Plug-in ............ SUCCESS [9.990s]
[INFO] Qpid HTTP Management Broker Plug-in ............... SUCCESS [6.565s]
[INFO] Qpid JMX Management Broker Plug-in ................ SUCCESS [4.481s]
[INFO] Qpid Memory Message Store Broker Plug-in .......... SUCCESS [0.456s]
[INFO] Qpid WebSocket Broker Plug-in ..................... SUCCESS [0.355s]
[INFO] Qpid AMQP 0-x JMS Client .......................... SUCCESS [10.088s]
[INFO] Qpid BDB Message Store ............................ SUCCESS [6.131s]
[INFO] Qpid BDB Message Store JMX ........................ SUCCESS [2.661s]
[INFO] Qpid Java Broker .................................. SUCCESS [5.253s]
[INFO] Qpid AMQP Management Protocol Broker Plug-in ...... SUCCESS [0.289s]
[INFO] Qpid AMQP 0-x JMS Client Examples ................. SUCCESS [0.173s]
[INFO] Qpid JCA .......................................... SUCCESS [2.718s]
[INFO] Qpid Resource Adaptor ............................. SUCCESS [0.374s]
[INFO] Qpid Tools ........................................ FAILURE [0.272s]
[INFO] Qpid Management Examples .......................... SUCCESS [0.171s]
[INFO] Qpid Java System Test Parent ...................... SUCCESS [0.707s]
[INFO] Qpid System Tests ................................. SUCCESS [18:38.469s]
[INFO] Qpid Performance Tests ............................ SUCCESS [13.447s]
[INFO] Qpid Performance Test System Tests ................ SUCCESS [19.337s]
[INFO] Qpid Performance Tests Visualisation JFC .......... SUCCESS [6.039s]
[INFO] Qpid BDB Store System Tests ....................... SUCCESS [2.852s]
[INFO] joramtests ........................................ SUCCESS [0.459s]
[INFO] ------------------------------------------------------------------------
[INFO] BUILD FAILURE
[INFO] ------------------------------------------------------------------------
[INFO] Total time: 23:13.518s
[INFO] Finished at: Fri Sep 18 19:15:43 UTC 2015
[INFO] Final Memory: 93M/236M
[INFO] ------------------------------------------------------------------------
[ERROR] Failed to execute goal org.apache.maven.plugins:maven-compiler-plugin:3.1:compile
(default-compile) on project qpid-tools: Compilation failure: Compilation failure:
[ERROR] <https://builds.apache.org/job/Qpid-Java-Java-Test-IBMJDK1.7/ws/tools/src/main/java/org/apache/qpid/tools/MemoryConsumptionTestClient.java>:[56,26]
package com.sun.management does not exist
[ERROR] <https://builds.apache.org/job/Qpid-Java-Java-Test-IBMJDK1.7/ws/tools/src/main/java/org/apache/qpid/tools/MemoryConsumptionTestClient.java>:[352,59]
cannot find symbol
[ERROR] symbol: variable GarbageCollectionNotificationInfo
[ERROR] <https://builds.apache.org/job/Qpid-Java-Java-Test-IBMJDK1.7/ws/tools/src/main/java/org/apache/qpid/tools/MemoryConsumptionTestClient.java>:[354,29]
cannot find symbol
[ERROR] symbol: class GarbageCollectionNotificationInfo
[ERROR] <https://builds.apache.org/job/Qpid-Java-Java-Test-IBMJDK1.7/ws/tools/src/main/java/org/apache/qpid/tools/MemoryConsumptionTestClient.java>:[354,70]
cannot find symbol
[ERROR] symbol: variable GarbageCollectionNotificationInfo
[ERROR] -> [Help 1]
[ERROR] 
[ERROR] To see the full stack trace of the errors, re-run Maven with the -e switch.
[ERROR] Re-run Maven using the -X switch to enable full debug logging.
[ERROR] 
[ERROR] For more information about the errors and possible solutions, please read the following
articles:
[ERROR] [Help 1] http://cwiki.apache.org/confluence/display/MAVEN/MojoFailureException
[ERROR] 
[ERROR] After correcting the problems, you can resume the build with the command
[ERROR]   mvn <goals> -rf :qpid-tools
Build step 'Invoke top-level Maven targets' marked build as failure
[locks-and-latches] Releasing all the locks
[locks-and-latches] All the locks released
Archiving artifacts
Sending artifact delta relative to Qpid-Java-Java-Test-IBMJDK1.7 #1221
Archived 4633 artifacts
Archive block size is 32768
Received 0 blocks and 396165936 bytes
Compression is 0.0%
Took 1 min 41 sec
Recording test results

Mime
View raw message