qpid-notifications mailing list archives

Site index · List index
Message view « Date » · « Thread »
Top « Date » · « Thread »
From Apache Jenkins Server <jenk...@builds.apache.org>
Subject Build failed in Jenkins: Qpid-Java-Cpp-Test #2770
Date Wed, 05 Aug 2015 16:31:29 GMT
See <https://builds.apache.org/job/Qpid-Java-Cpp-Test/2770/changes>

Changes:

[orudyy] QPID-3521: [Java Client] Stop using dispatcher to clear pre-dispatch queue on 0.8/0.9.x
client in order to avoid dead locks.
           Address review comments.

[kwall] QPID-6670: [Java Broker] Delete future for queue/exchange must chain binding deletion
too

* Changed Queue/Exchange doDelete so that the future returned completes only when the binding
  children are also deleted too. Uses established doAfter/Async patterns already adopted elsewhere
* On the 0-8..0-91 paths, close the session model object explicitly (like 0-10/1.0 paths)
so that
  io thread blocks until session close (rather than running asynchronously).

------------------------------------------
[...truncated 9673 lines...]
23053/23633 KB   
23057/23633 KB   
23061/23633 KB   
23065/23633 KB   
23069/23633 KB   
23073/23633 KB   
23077/23633 KB   
23081/23633 KB   
23085/23633 KB   
23089/23633 KB   
23093/23633 KB   
23097/23633 KB   
23101/23633 KB   
23105/23633 KB   
23109/23633 KB   
23113/23633 KB   
23117/23633 KB   
23121/23633 KB   
23125/23633 KB   
23129/23633 KB   
23133/23633 KB   
23137/23633 KB   
23141/23633 KB   
23145/23633 KB   
23149/23633 KB   
23153/23633 KB   
23157/23633 KB   
23161/23633 KB   
23165/23633 KB   
23169/23633 KB   
23173/23633 KB   
23177/23633 KB   
23181/23633 KB   
23185/23633 KB   
23189/23633 KB   
23193/23633 KB   
23197/23633 KB   
23201/23633 KB   
23205/23633 KB   
23209/23633 KB   
23213/23633 KB   
23217/23633 KB   
23221/23633 KB   
23225/23633 KB   
23229/23633 KB   
23233/23633 KB   
23237/23633 KB   
23241/23633 KB   
23245/23633 KB   
23249/23633 KB   
23253/23633 KB   
23257/23633 KB   
23261/23633 KB   
23265/23633 KB   
23269/23633 KB   
23273/23633 KB   
23277/23633 KB   
23281/23633 KB   
23285/23633 KB   
23289/23633 KB   
23293/23633 KB   
23297/23633 KB   
23301/23633 KB   
23305/23633 KB   
23309/23633 KB   
23313/23633 KB   
23317/23633 KB   
23321/23633 KB   
23325/23633 KB   
23329/23633 KB   
23333/23633 KB   
23337/23633 KB   
23341/23633 KB   
23345/23633 KB   
23349/23633 KB   
23353/23633 KB   
23357/23633 KB   
23361/23633 KB   
23365/23633 KB   
23369/23633 KB   
23373/23633 KB   
23377/23633 KB   
23381/23633 KB   
23385/23633 KB   
23389/23633 KB   
23393/23633 KB   
23397/23633 KB   
23401/23633 KB   
23405/23633 KB   
23409/23633 KB   
23413/23633 KB   
23417/23633 KB   
23421/23633 KB   
23425/23633 KB   
23429/23633 KB   
23433/23633 KB   
23437/23633 KB   
23441/23633 KB   
23445/23633 KB   
23449/23633 KB   
23453/23633 KB   
23457/23633 KB   
23461/23633 KB   
23465/23633 KB   
23469/23633 KB   
23473/23633 KB   
23477/23633 KB   
23481/23633 KB   
23485/23633 KB   
23489/23633 KB   
23493/23633 KB   
23497/23633 KB   
23501/23633 KB   
23505/23633 KB   
23509/23633 KB   
23513/23633 KB   
23517/23633 KB   
23521/23633 KB   
23525/23633 KB   
23529/23633 KB   
23533/23633 KB   
23537/23633 KB   
23541/23633 KB   
23545/23633 KB   
23549/23633 KB   
23553/23633 KB   
23557/23633 KB   
23561/23633 KB   
23565/23633 KB   
23569/23633 KB   
23573/23633 KB   
23577/23633 KB   
23581/23633 KB   
23585/23633 KB   
23589/23633 KB   
23593/23633 KB   
23597/23633 KB   
23601/23633 KB   
23605/23633 KB   
23609/23633 KB   
23613/23633 KB   
23617/23633 KB   
23621/23633 KB   
23625/23633 KB   
23629/23633 KB   
23633/23633 KB   
                 
Downloaded: http://repository.apache.org/snapshots/org/apache/qpid/qpid-broker/6.0.0-SNAPSHOT/qpid-broker-6.0.0-20150805.003201-107-bin.tar.gz
(23633 KB at 26200.1 KB/sec)
[INFO] Unpacking /home/jenkins/.m2/repository/org/apache/qpid/qpid-broker/6.0.0-SNAPSHOT/qpid-broker-6.0.0-SNAPSHOT-bin.tar.gz
to <https://builds.apache.org/job/Qpid-Java-Cpp-Test/ws/qpid-java/qpid-systests-parent/target>
with includes "" and excludes ""
[INFO] Expanding: /home/jenkins/.m2/repository/org/apache/qpid/qpid-broker/6.0.0-SNAPSHOT/qpid-broker-6.0.0-SNAPSHOT-bin.tar.gz
into <https://builds.apache.org/job/Qpid-Java-Cpp-Test/ws/qpid-java/qpid-systests-parent/target>
[INFO] 
[INFO] --- maven-dependency-plugin:2.8:copy (copy-sleepycat-jar-for-bdb-tests) @ qpid-systests-parent
---
[INFO] Configured Artifact: com.sleepycat:je:5.0.104:jar
[INFO] Copying je-5.0.104.jar to <https://builds.apache.org/job/Qpid-Java-Cpp-Test/ws/qpid-java/qpid-systests-parent/target/qpid-broker/6.0.0-SNAPSHOT/lib/je-5.0.104.jar>
[INFO] 
[INFO] --- maven-surefire-plugin:2.16:test (integration-test) @ qpid-systests-parent ---
[INFO] No tests to run.
[INFO]                                                                         
[INFO] ------------------------------------------------------------------------
[INFO] Skipping Qpid System Tests
[INFO] This project has been banned from the build due to previous failures.
[INFO] ------------------------------------------------------------------------
[INFO]                                                                         
[INFO] ------------------------------------------------------------------------
[INFO] Skipping Qpid Performance Tests
[INFO] This project has been banned from the build due to previous failures.
[INFO] ------------------------------------------------------------------------
[INFO]                                                                         
[INFO] ------------------------------------------------------------------------
[INFO] Skipping Qpid Performance Test System Tests
[INFO] This project has been banned from the build due to previous failures.
[INFO] ------------------------------------------------------------------------
[INFO]                                                                         
[INFO] ------------------------------------------------------------------------
[INFO] Skipping Qpid Performance Tests Visualisation JFC
[INFO] This project has been banned from the build due to previous failures.
[INFO] ------------------------------------------------------------------------
[INFO]                                                                         
[INFO] ------------------------------------------------------------------------
[INFO] Skipping Qpid BDB Store System Tests
[INFO] This project has been banned from the build due to previous failures.
[INFO] ------------------------------------------------------------------------
[INFO] ------------------------------------------------------------------------
[INFO] Reactor Summary:
[INFO] 
[INFO] Qpid Java Build ................................... SUCCESS [2.388s]
[INFO] Qpid Broker Code Generation ....................... SUCCESS [2.035s]
[INFO] Qpid Test Utilities ............................... SUCCESS [0.672s]
[INFO] Qpid Common ....................................... SUCCESS [3:50.051s]
[INFO] Qpid Management Common ............................ SUCCESS [1.945s]
[INFO] Qpid Java Broker Core ............................. SUCCESS [1:34.127s]
[INFO] Qpid Access Control Broker Plug-in ................ SUCCESS [5.176s]
[INFO] Qpid AMQP 0-8 Protocol Broker Plug-in ............. FAILURE [6.768s]
[INFO] Qpid AMQP 0-10 Protocol Plug-in ................... SUCCESS [4.953s]
[INFO] Qpid AMQP 1-0 Protocol Broker Plug-in ............. SUCCESS [5.986s]
[INFO] Qpid AMQP 0-8 to 0-10 Message Conversion Broker Plug-in  SKIPPED
[INFO] Qpid AMQP 0-8 to 1-0 Message Conversion Broker Plug-in  SKIPPED
[INFO] Qpid AMQP 0-10 to 1-0 Message Conversion Broker Plug-in  SUCCESS [0.275s]
[INFO] Qpid Derby Message Store .......................... SUCCESS [17.098s]
[INFO] Qpid JDBC Message Store Connection Pooling Plug-in  SUCCESS [0.377s]
[INFO] Qpid JDBC Message Store Broker Plug-in ............ SUCCESS [10.912s]
[INFO] Qpid HTTP Management Broker Plug-in ............... SUCCESS [5.951s]
[INFO] Qpid JMX Management Broker Plug-in ................ SUCCESS [3.184s]
[INFO] Qpid Memory Message Store Broker Plug-in .......... SUCCESS [0.444s]
[INFO] Qpid WebSocket Broker Plug-in ..................... SUCCESS [0.440s]
[INFO] Qpid AMQP 0-x JMS Client .......................... FAILURE [8.653s]
[INFO] Qpid BDB Message Store ............................ SKIPPED
[INFO] Qpid BDB Message Store JMX ........................ SKIPPED
[INFO] Qpid Java Broker .................................. SKIPPED
[INFO] Qpid AMQP Management Protocol Broker Plug-in ...... SUCCESS [0.284s]
[INFO] Qpid AMQP 0-x JMS Client Examples ................. SKIPPED
[INFO] Qpid JCA .......................................... SKIPPED
[INFO] Qpid Resource Adaptor ............................. SKIPPED
[INFO] Qpid Tools ........................................ SKIPPED
[INFO] Qpid Management Examples .......................... SUCCESS [0.570s]
[INFO] Qpid Java System Test Parent ...................... SUCCESS [2.528s]
[INFO] Qpid System Tests ................................. SKIPPED
[INFO] Qpid Performance Tests ............................ SKIPPED
[INFO] Qpid Performance Test System Tests ................ SKIPPED
[INFO] Qpid Performance Tests Visualisation JFC .......... SKIPPED
[INFO] Qpid BDB Store System Tests ....................... SKIPPED
[INFO] ------------------------------------------------------------------------
[INFO] BUILD FAILURE
[INFO] ------------------------------------------------------------------------
[INFO] Total time: 6:45.902s
[INFO] Finished at: Wed Aug 05 16:32:09 UTC 2015
[INFO] Final Memory: 60M/286M
[INFO] ------------------------------------------------------------------------
[ERROR] Failed to execute goal org.apache.maven.plugins:maven-surefire-plugin:2.16:test (default-test)
on project qpid-broker-plugins-amqp-0-8-protocol: There are test failures.
[ERROR] 
[ERROR] Please refer to <https://builds.apache.org/job/Qpid-Java-Cpp-Test/ws/qpid-java/broker-plugins/amqp-0-8-protocol/target/surefire-reports>
for the individual test results.
[ERROR] -> [Help 1]
[ERROR] Failed to execute goal org.apache.maven.plugins:maven-surefire-plugin:2.16:test (default-test)
on project qpid-client: There are test failures.
[ERROR] 
[ERROR] Please refer to <https://builds.apache.org/job/Qpid-Java-Cpp-Test/ws/qpid-java/client/target/surefire-reports>
for the individual test results.
[ERROR] -> [Help 1]
[ERROR] 
[ERROR] To see the full stack trace of the errors, re-run Maven with the -e switch.
[ERROR] Re-run Maven using the -X switch to enable full debug logging.
[ERROR] 
[ERROR] For more information about the errors and possible solutions, please read the following
articles:
[ERROR] [Help 1] http://cwiki.apache.org/confluence/display/MAVEN/MojoFailureException
[ERROR] 
[ERROR] After correcting the problems, you can resume the build with the command
[ERROR]   mvn <goals> -rf :qpid-broker-plugins-amqp-0-8-protocol
Build step 'Invoke top-level Maven targets' marked build as failure
[locks-and-latches] Releasing all the locks
[locks-and-latches] All the locks released
Recording test results

Mime
View raw message