qpid-notifications mailing list archives

Site index · List index
Message view « Date » · « Thread »
Top « Date » · « Thread »
From Apache Jenkins Server <jenk...@builds.apache.org>
Subject Build failed in Jenkins: Qpid-Java-Java-Test-JDK1.8 #1193
Date Wed, 12 Aug 2015 02:37:40 GMT
See <https://builds.apache.org/job/Qpid-Java-Java-Test-JDK1.8/1193/changes>

Changes:

[orudyy] QPID-6689: Stop registering QpidLoggerTurboFilter on appender registration

[kwall] QPID-6683: [Java Broker] Give HTTP management ports separate individually configurable
thread pools

* Acceptor threads no longer defaults to a value derived from the number of cores.

Work by Lorenz Quack <quack.lorenz@gmail.com> and Keith Wall <kwall@apache.org>

[orudyy] QPID-6688: [Java Broker] Add port state check in HTTP and JMX management plugins
whilst iterating through ports in order to avoid NPE thrown for Ports in ERRORED state having
uninitialized protocols

[orudyy] QPID-6687: Fix NPE on stopping logging for Broker and VirtualHost file loggers in
ERRORED state

------------------------------------------
[...truncated 8524 lines...]
[INFO] Copying 3 resources
[INFO] 
[INFO] --- maven-compiler-plugin:3.1:testCompile (default-testCompile) @ qpid-perftests-visualisation-jfc
---
[INFO] Changes detected - recompiling the module!
[INFO] Compiling 11 source files to /x1/jenkins/jenkins-slave/workspace/Qpid-Java-Java-Test-JDK1.8/trunk/perftests/visualisation-jfc/target/test-classes
[WARNING] bootstrap class path not set in conjunction with -source 1.7
[INFO] 
[INFO] --- maven-surefire-plugin:2.16:test (default-test) @ qpid-perftests-visualisation-jfc
---
[INFO] Surefire report directory: /x1/jenkins/jenkins-slave/workspace/Qpid-Java-Java-Test-JDK1.8/trunk/perftests/visualisation-jfc/target/surefire-reports

-------------------------------------------------------
 T E S T S
-------------------------------------------------------
Running org.apache.qpid.disttest.charting.seriesbuilder.SeriesRowTest
Tests run: 5, Failures: 0, Errors: 0, Skipped: 0, Time elapsed: 0.512 sec - in org.apache.qpid.disttest.charting.seriesbuilder.SeriesRowTest
Running org.apache.qpid.disttest.charting.seriesbuilder.JdbcSeriesBuilderTest
Tests run: 1, Failures: 0, Errors: 0, Skipped: 0, Time elapsed: 0.436 sec - in org.apache.qpid.disttest.charting.seriesbuilder.JdbcSeriesBuilderTest
Running org.apache.qpid.disttest.charting.seriesbuilder.JdbcUrlGeneratorTest
Tests run: 4, Failures: 0, Errors: 0, Skipped: 0, Time elapsed: 0.03 sec - in org.apache.qpid.disttest.charting.seriesbuilder.JdbcUrlGeneratorTest
Running org.apache.qpid.disttest.charting.chartbuilder.ColorFactoryTest
Tests run: 2, Failures: 0, Errors: 0, Skipped: 0, Time elapsed: 1.488 sec - in org.apache.qpid.disttest.charting.chartbuilder.ColorFactoryTest
Running org.apache.qpid.disttest.charting.chartbuilder.BaseChartBuilderTest
Tests run: 1, Failures: 0, Errors: 0, Skipped: 0, Time elapsed: 0.65 sec - in org.apache.qpid.disttest.charting.chartbuilder.BaseChartBuilderTest
Running org.apache.qpid.disttest.charting.chartbuilder.ChartBuilderFactoryTest
Tests run: 6, Failures: 0, Errors: 0, Skipped: 0, Time elapsed: 0.035 sec - in org.apache.qpid.disttest.charting.chartbuilder.ChartBuilderFactoryTest
Running org.apache.qpid.disttest.charting.chartbuilder.TimeSeriesBuilderCallbackTest
Tests run: 1, Failures: 0, Errors: 0, Skipped: 0, Time elapsed: 0.114 sec - in org.apache.qpid.disttest.charting.chartbuilder.TimeSeriesBuilderCallbackTest
Running org.apache.qpid.disttest.charting.chartbuilder.ChartProductionTest
Tests run: 8, Failures: 0, Errors: 0, Skipped: 0, Time elapsed: 2.08 sec - in org.apache.qpid.disttest.charting.chartbuilder.ChartProductionTest
Running org.apache.qpid.disttest.charting.definition.SeriesDefinitionCreatorTest
Tests run: 4, Failures: 0, Errors: 0, Skipped: 0, Time elapsed: 0.02 sec - in org.apache.qpid.disttest.charting.definition.SeriesDefinitionCreatorTest
Running org.apache.qpid.disttest.charting.definition.ChartingDefinitionCreatorTest
Tests run: 4, Failures: 0, Errors: 0, Skipped: 0, Time elapsed: 0.024 sec - in org.apache.qpid.disttest.charting.definition.ChartingDefinitionCreatorTest
Running org.apache.qpid.disttest.charting.writer.ChartWriterTest
Tests run: 3, Failures: 0, Errors: 0, Skipped: 0, Time elapsed: 0.383 sec - in org.apache.qpid.disttest.charting.writer.ChartWriterTest

Results :

Tests run: 39, Failures: 0, Errors: 0, Skipped: 0

[INFO] 
[INFO] --- maven-jar-plugin:2.4:jar (default-jar) @ qpid-perftests-visualisation-jfc ---
[INFO] Building jar: /x1/jenkins/jenkins-slave/workspace/Qpid-Java-Java-Test-JDK1.8/trunk/perftests/visualisation-jfc/target/qpid-perftests-visualisation-jfc-6.0.0-SNAPSHOT.jar
[INFO] 
[INFO] --- maven-site-plugin:3.3:attach-descriptor (attach-descriptor) @ qpid-perftests-visualisation-jfc
---
[INFO] 
[INFO] --- maven-assembly-plugin:2.4:single (make-assembly) @ qpid-perftests-visualisation-jfc
---
[INFO] Reading assembly descriptor: src/main/assembly/qpid-perftests-visualisation-jfc-bin.xml
[INFO] Building tar: /x1/jenkins/jenkins-slave/workspace/Qpid-Java-Java-Test-JDK1.8/trunk/perftests/visualisation-jfc/target/qpid-perftests-visualisation-jfc-6.0.0-SNAPSHOT-bin.tar.gz
[WARNING] Entry: qpid-perftests-visualisation-jfc/6.0.0-SNAPSHOT/lib/qpid-perftests-visualisation-jfc-6.0.0-SNAPSHOT.jar
longer than 100 characters.
[WARNING] Resulting tar file can only be processed successfully by GNU compatible tar commands
[INFO] 
[INFO] --- maven-antrun-plugin:1.7:run (create-qbtc-output-dir) @ qpid-perftests-visualisation-jfc
---
[INFO] Executing tasks

main:
    [mkdir] Created dir: /x1/jenkins/jenkins-slave/workspace/Qpid-Java-Java-Test-JDK1.8/trunk/perftests/visualisation-jfc/target/qbtc-test-config
[INFO] Executed tasks
[INFO]                                                                         
[INFO] ------------------------------------------------------------------------
[INFO] Building Qpid BDB Store System Tests 6.0.0-SNAPSHOT
[INFO] ------------------------------------------------------------------------
[INFO] 
[INFO] --- maven-clean-plugin:2.5:clean (default-clean) @ qpid-bdbstore-systests ---
[INFO] 
[INFO] --- maven-antrun-plugin:1.7:run (output-test-properties) @ qpid-bdbstore-systests ---
[INFO] Executing tasks

main:
     [echo] Qpid Test Profile Properties
     [echo] [profile] java-mms.0-10
     [echo] [profile.broker.language] java
     [echo] [profile.broker.type] internal
     [echo] [profile.broker.command] "/x1/jenkins/jenkins-slave/workspace/Qpid-Java-Java-Test-JDK1.8/trunk/bdbstore/systests/target/qpid-broker/6.0.0-SNAPSHOT/bin/qpid-server"
-sp @STORE_PATH -st @STORE_TYPE
     [echo] [profile.specific.excludes] JavaTransientExcludes Java010Excludes
     [echo] [profile.test.excludes] Excludes JavaExcludes java-mms.0-10.excludes JavaTransientExcludes
Java010Excludes
     [echo] [profile.broker.version] v0_10
     [echo] [profile.test.amqp_port_protocols] ["AMQP_0_8","AMQP_0_9","AMQP_0_9_1","AMQP_0_10"]
     [echo] [profile.broker.persistent] false
     [echo] [profile.virtualhostnode.type] Memory
     [echo] [profile.virtualhostnode.context.blueprint] {"type":"ProvidedStore","globalAddressDomains":"${qpid.globalAddressDomains}"}
     [echo] [profile.test_receive_timeout] 1000
[INFO] Executed tasks
[INFO] 
[INFO] --- maven-enforcer-plugin:1.3.1:enforce (enforce-minimum-versions) @ qpid-bdbstore-systests
---
[INFO] 
[INFO] --- maven-enforcer-plugin:1.3.1:enforce (enforce-versions-standard-properties) @ qpid-bdbstore-systests
---
[INFO] 
[INFO] --- jacoco-maven-plugin:0.7.0.201403182114:prepare-agent (default-prepare-agent) @
qpid-bdbstore-systests ---
[INFO] Skipping JaCoCo execution because property jacoco.skip is set.
[INFO] argLine set to empty
[INFO] 
[INFO] --- maven-remote-resources-plugin:1.5:process (default) @ qpid-bdbstore-systests ---
[INFO] 
[INFO] --- maven-resources-plugin:2.6:copy-resources (copy-systests-etc-resources) @ qpid-bdbstore-systests
---
[INFO] Using 'UTF-8' encoding to copy filtered resources.
[INFO] Copying 4 resources
[INFO] 
[INFO] --- maven-resources-plugin:2.6:copy-resources (copy-test-profile-resources) @ qpid-bdbstore-systests
---
[INFO] Using 'UTF-8' encoding to copy filtered resources.
[INFO] Copying 46 resources
[INFO] 
[INFO] --- maven-resources-plugin:2.6:copy-resources (copy-bdbstore-bin-resources) @ qpid-bdbstore-systests
---
[INFO] Using 'UTF-8' encoding to copy filtered resources.
[INFO] Copying 1 resource
[INFO] 
[INFO] --- maven-resources-plugin:2.6:resources (default-resources) @ qpid-bdbstore-systests
---
[INFO] Using 'UTF-8' encoding to copy filtered resources.
[INFO] skip non existing resourceDirectory /x1/jenkins/jenkins-slave/workspace/Qpid-Java-Java-Test-JDK1.8/trunk/bdbstore/systests/src/main/resources
[INFO] Copying 3 resources
[INFO] 
[INFO] --- maven-compiler-plugin:3.1:compile (default-compile) @ qpid-bdbstore-systests ---
[INFO] No sources to compile
[INFO] 
[INFO] --- maven-resources-plugin:2.6:testResources (default-testResources) @ qpid-bdbstore-systests
---
[INFO] Using 'UTF-8' encoding to copy filtered resources.
[INFO] skip non existing resourceDirectory /x1/jenkins/jenkins-slave/workspace/Qpid-Java-Java-Test-JDK1.8/trunk/bdbstore/systests/src/test/resources
[INFO] Copying 3 resources
[INFO] 
[INFO] --- maven-compiler-plugin:3.1:testCompile (default-testCompile) @ qpid-bdbstore-systests
---
[INFO] Changes detected - recompiling the module!
[INFO] Compiling 8 source files to /x1/jenkins/jenkins-slave/workspace/Qpid-Java-Java-Test-JDK1.8/trunk/bdbstore/systests/target/test-classes
[WARNING] bootstrap class path not set in conjunction with -source 1.7
[INFO] 
[INFO] --- maven-surefire-plugin:2.16:test (default-test) @ qpid-bdbstore-systests ---
[INFO] Tests are skipped.
[INFO] 
[INFO] --- maven-jar-plugin:2.4:jar (default-jar) @ qpid-bdbstore-systests ---
[INFO] Building jar: /x1/jenkins/jenkins-slave/workspace/Qpid-Java-Java-Test-JDK1.8/trunk/bdbstore/systests/target/qpid-bdbstore-systests-6.0.0-SNAPSHOT.jar
[INFO] 
[INFO] --- maven-site-plugin:3.3:attach-descriptor (attach-descriptor) @ qpid-bdbstore-systests
---
[INFO] 
[INFO] --- maven-antrun-plugin:1.7:run (fix-bdb-script-permissions) @ qpid-bdbstore-systests
---
[INFO] Executing tasks

main:
[INFO] Executed tasks
[INFO] 
[INFO] --- maven-antrun-plugin:1.7:run (create-qbtc-output-dir) @ qpid-bdbstore-systests ---
[INFO] Executing tasks

main:
    [mkdir] Created dir: /x1/jenkins/jenkins-slave/workspace/Qpid-Java-Java-Test-JDK1.8/trunk/bdbstore/systests/target/qpid-broker/6.0.0-SNAPSHOT/qbtc-test-config
[INFO] Executed tasks
[INFO] 
[INFO] --- maven-dependency-plugin:2.8:unpack (extract-broker-distribution) @ qpid-bdbstore-systests
---
[INFO] Configured Artifact: org.apache.qpid:qpid-broker:bin:6.0.0-SNAPSHOT:tar.gz
[INFO] Unpacking /x1/jenkins/jenkins-slave/workspace/Qpid-Java-Java-Test-JDK1.8/trunk/broker/target/qpid-broker-6.0.0-SNAPSHOT-bin.tar.gz
to /x1/jenkins/jenkins-slave/workspace/Qpid-Java-Java-Test-JDK1.8/trunk/bdbstore/systests/target
with includes "" and excludes ""
[INFO] Expanding: /x1/jenkins/jenkins-slave/workspace/Qpid-Java-Java-Test-JDK1.8/trunk/broker/target/qpid-broker-6.0.0-SNAPSHOT-bin.tar.gz
into /x1/jenkins/jenkins-slave/workspace/Qpid-Java-Java-Test-JDK1.8/trunk/bdbstore/systests/target
[INFO] 
[INFO] --- maven-dependency-plugin:2.8:copy (copy-sleepycat-jar-for-bdb-tests) @ qpid-bdbstore-systests
---
[INFO] Configured Artifact: com.sleepycat:je:5.0.104:jar
[INFO] Copying je-5.0.104.jar to /x1/jenkins/jenkins-slave/workspace/Qpid-Java-Java-Test-JDK1.8/trunk/bdbstore/systests/target/qpid-broker/6.0.0-SNAPSHOT/lib/je-5.0.104.jar
[INFO] 
[INFO] --- maven-surefire-plugin:2.16:test (integration-test) @ qpid-bdbstore-systests ---
[INFO] Surefire report directory: /x1/jenkins/jenkins-slave/workspace/Qpid-Java-Java-Test-JDK1.8/trunk/bdbstore/systests/target/surefire-reports

-------------------------------------------------------
 T E S T S
-------------------------------------------------------
Running org.apache.qpid.server.store.berkeleydb.BDBUpgradeTest
Tests run: 8, Failures: 0, Errors: 0, Skipped: 0, Time elapsed: 0.519 sec - in org.apache.qpid.server.store.berkeleydb.BDBUpgradeTest
Running org.apache.qpid.server.store.berkeleydb.BDBBackupTest
Tests run: 1, Failures: 0, Errors: 0, Skipped: 0, Time elapsed: 0.005 sec - in org.apache.qpid.server.store.berkeleydb.BDBBackupTest
Running org.apache.qpid.server.store.berkeleydb.replication.BDBHAVirtualHostNodeRestTest
Tests run: 7, Failures: 0, Errors: 0, Skipped: 0, Time elapsed: 0.041 sec - in org.apache.qpid.server.store.berkeleydb.replication.BDBHAVirtualHostNodeRestTest
Running org.apache.qpid.server.store.berkeleydb.replication.JMXManagementTest
Tests run: 7, Failures: 0, Errors: 0, Skipped: 0, Time elapsed: 0.093 sec - in org.apache.qpid.server.store.berkeleydb.replication.JMXManagementTest
Running org.apache.qpid.server.store.berkeleydb.replication.MultiNodeTest
Tests run: 10, Failures: 0, Errors: 0, Skipped: 0, Time elapsed: 0.056 sec - in org.apache.qpid.server.store.berkeleydb.replication.MultiNodeTest
Running org.apache.qpid.server.store.berkeleydb.replication.TwoNodeTest
Tests run: 7, Failures: 0, Errors: 0, Skipped: 0, Time elapsed: 0.035 sec - in org.apache.qpid.server.store.berkeleydb.replication.TwoNodeTest
Running org.apache.qpid.server.store.berkeleydb.replication.BDBHAVirtualHostRestTest
Tests run: 3, Failures: 0, Errors: 0, Skipped: 0, Time elapsed: 0.008 sec - in org.apache.qpid.server.store.berkeleydb.replication.BDBHAVirtualHostRestTest

Results :

Tests run: 43, Failures: 0, Errors: 0, Skipped: 0

[INFO] ------------------------------------------------------------------------
[INFO] Reactor Summary:
[INFO] 
[INFO] Qpid Java Build ................................... SUCCESS [2.746s]
[INFO] Qpid Broker Code Generation ....................... SUCCESS [2.395s]
[INFO] Qpid Test Utilities ............................... SUCCESS [0.854s]
[INFO] Qpid Common ....................................... SUCCESS [25.548s]
[INFO] Qpid Management Common ............................ SUCCESS [2.687s]
[INFO] Qpid Java Broker Core ............................. SUCCESS [2:06.928s]
[INFO] Qpid Access Control Broker Plug-in ................ SUCCESS [4.088s]
[INFO] Qpid AMQP 0-8 Protocol Broker Plug-in ............. SUCCESS [4.074s]
[INFO] Qpid AMQP 0-10 Protocol Plug-in ................... SUCCESS [4.259s]
[INFO] Qpid AMQP 1-0 Protocol Broker Plug-in ............. SUCCESS [5.282s]
[INFO] Qpid AMQP 0-8 to 0-10 Message Conversion Broker Plug-in  SUCCESS [0.314s]
[INFO] Qpid AMQP 0-8 to 1-0 Message Conversion Broker Plug-in  SUCCESS [0.398s]
[INFO] Qpid AMQP 0-10 to 1-0 Message Conversion Broker Plug-in  SUCCESS [0.276s]
[INFO] Qpid Derby Message Store .......................... SUCCESS [1:54.784s]
[INFO] Qpid JDBC Message Store Connection Pooling Plug-in  SUCCESS [0.384s]
[INFO] Qpid JDBC Message Store Broker Plug-in ............ SUCCESS [8.111s]
[INFO] Qpid HTTP Management Broker Plug-in ............... SUCCESS [5.185s]
[INFO] Qpid JMX Management Broker Plug-in ................ SUCCESS [3.853s]
[INFO] Qpid Memory Message Store Broker Plug-in .......... SUCCESS [0.595s]
[INFO] Qpid WebSocket Broker Plug-in ..................... SUCCESS [0.725s]
[INFO] Qpid AMQP 0-x JMS Client .......................... SUCCESS [10.588s]
[INFO] Qpid BDB Message Store ............................ SUCCESS [7.337s]
[INFO] Qpid BDB Message Store JMX ........................ SUCCESS [2.149s]
[INFO] Qpid Java Broker .................................. SUCCESS [7.257s]
[INFO] Qpid AMQP Management Protocol Broker Plug-in ...... SUCCESS [0.229s]
[INFO] Qpid AMQP 0-x JMS Client Examples ................. SUCCESS [0.156s]
[INFO] Qpid JCA .......................................... SUCCESS [2.243s]
[INFO] Qpid Resource Adaptor ............................. SUCCESS [0.627s]
[INFO] Qpid Tools ........................................ SUCCESS [0.579s]
[INFO] Qpid Management Examples .......................... SUCCESS [0.169s]
[INFO] Qpid Java System Test Parent ...................... SUCCESS [1.197s]
[INFO] Qpid System Tests ................................. SUCCESS [19:19.929s]
[INFO] Qpid Performance Tests ............................ SUCCESS [21.898s]
[INFO] Qpid Performance Test System Tests ................ FAILURE [29.469s]
[INFO] Qpid Performance Tests Visualisation JFC .......... SUCCESS [10.817s]
[INFO] Qpid BDB Store System Tests ....................... SUCCESS [2.971s]
[INFO] ------------------------------------------------------------------------
[INFO] BUILD FAILURE
[INFO] ------------------------------------------------------------------------
[INFO] Total time: 26:11.587s
[INFO] Finished at: Wed Aug 12 02:35:51 UTC 2015
[INFO] Final Memory: 81M/290M
[INFO] ------------------------------------------------------------------------
[ERROR] Failed to execute goal org.apache.maven.plugins:maven-surefire-plugin:2.16:test (integration-test)
on project qpid-perftests-systests: There are test failures.
[ERROR] 
[ERROR] Please refer to /x1/jenkins/jenkins-slave/workspace/Qpid-Java-Java-Test-JDK1.8/trunk/qpid-perftests-systests/target/surefire-reports
for the individual test results.
[ERROR] -> [Help 1]
[ERROR] 
[ERROR] To see the full stack trace of the errors, re-run Maven with the -e switch.
[ERROR] Re-run Maven using the -X switch to enable full debug logging.
[ERROR] 
[ERROR] For more information about the errors and possible solutions, please read the following
articles:
[ERROR] [Help 1] http://cwiki.apache.org/confluence/display/MAVEN/MojoFailureException
[ERROR] 
[ERROR] After correcting the problems, you can resume the build with the command
[ERROR]   mvn <goals> -rf :qpid-perftests-systests
Build step 'Invoke top-level Maven targets' marked build as failure
[locks-and-latches] Releasing all the locks
[locks-and-latches] All the locks released
Archiving artifacts
Sending artifact delta relative to Qpid-Java-Java-Test-JDK1.8 #1192
Archived 4931 artifacts
Archive block size is 32768
Received 0 blocks and 517804800 bytes
Compression is 0.0%
Took 2 min 30 sec
Recording test results

Mime
View raw message