qpid-notifications mailing list archives

Site index · List index
Message view « Date » · « Thread »
Top « Date » · « Thread »
From Apache Jenkins Server <jenk...@builds.apache.org>
Subject Build failed in Jenkins: Qpid-proton-c #771
Date Tue, 18 Aug 2015 14:18:42 GMT
See <https://builds.apache.org/job/Qpid-proton-c/771/changes>

Changes:

[bozzo] PROTON-964: Proton-J extensible event types

[bozzo] NO-JIRA: Event.getTransport(): Missing accessor variant

[bozzo] NO-JIRA: Add missing proton-j binding shims

------------------------------------------
[...truncated 3829 lines...]
1: barfOnSchedule[1](org.apache.qpid.proton.reactor.ReactorTest)  Time elapsed: 0.008 sec
 <<< FAILURE!
1: junit.framework.AssertionFailedError: Resources leaked
1: 	at org.apache.qpid.proton.reactor.impl.LeakTestReactor$TestIO.assertNoLeaks(LeakTestReactor.java:101)
1: 	at org.apache.qpid.proton.reactor.impl.LeakTestReactor.assertNoLeaks(LeakTestReactor.java:115)
1: 	at org.apache.qpid.proton.reactor.ReactorTest.checkForLeaks(ReactorTest.java:96)
1: 	at org.apache.qpid.proton.reactor.ReactorTest.after(ReactorTest.java:102)
1: 	at sun.reflect.GeneratedMethodAccessor2.invoke(Unknown Source)
1: 	at sun.reflect.DelegatingMethodAccessorImpl.invoke(DelegatingMethodAccessorImpl.java:43)
1: 	at java.lang.reflect.Method.invoke(Method.java:606)
1: 	at org.junit.runners.model.FrameworkMethod$1.runReflectiveCall(FrameworkMethod.java:45)
1: 	at org.junit.internal.runners.model.ReflectiveCallable.run(ReflectiveCallable.java:15)
1: 	at org.junit.runners.model.FrameworkMethod.invokeExplosively(FrameworkMethod.java:42)
1: 	at org.junit.internal.runners.statements.RunAfters.evaluate(RunAfters.java:36)
1: 	at org.junit.runners.ParentRunner.runLeaf(ParentRunner.java:263)
1: 	at org.junit.runners.BlockJUnit4ClassRunner.runChild(BlockJUnit4ClassRunner.java:68)
1: 	at org.junit.runners.BlockJUnit4ClassRunner.runChild(BlockJUnit4ClassRunner.java:47)
1: 	at org.junit.runners.ParentRunner$3.run(ParentRunner.java:231)
1: 	at org.junit.runners.ParentRunner$1.schedule(ParentRunner.java:60)
1: 	at org.junit.runners.ParentRunner.runChildren(ParentRunner.java:229)
1: 	at org.junit.runners.ParentRunner.access$000(ParentRunner.java:50)
1: 	at org.junit.runners.ParentRunner$2.evaluate(ParentRunner.java:222)
1: 	at org.junit.runners.ParentRunner.run(ParentRunner.java:300)
1: 	at org.junit.runners.Suite.runChild(Suite.java:128)
1: 	at org.junit.runners.Suite.runChild(Suite.java:24)
1: 	at org.junit.runners.ParentRunner$3.run(ParentRunner.java:231)
1: 	at org.junit.runners.ParentRunner$1.schedule(ParentRunner.java:60)
1: 	at org.junit.runners.ParentRunner.runChildren(ParentRunner.java:229)
1: 	at org.junit.runners.ParentRunner.access$000(ParentRunner.java:50)
1: 	at org.junit.runners.ParentRunner$2.evaluate(ParentRunner.java:222)
1: 	at org.junit.runners.ParentRunner.run(ParentRunner.java:300)
1: 	at org.apache.maven.surefire.junit4.JUnit4Provider.execute(JUnit4Provider.java:252)
1: 	at org.apache.maven.surefire.junit4.JUnit4Provider.executeTestSet(JUnit4Provider.java:141)
1: 	at org.apache.maven.surefire.junit4.JUnit4Provider.invoke(JUnit4Provider.java:112)
1: 	at sun.reflect.NativeMethodAccessorImpl.invoke0(Native Method)
1: 	at sun.reflect.NativeMethodAccessorImpl.invoke(NativeMethodAccessorImpl.java:57)
1: 	at sun.reflect.DelegatingMethodAccessorImpl.invoke(DelegatingMethodAccessorImpl.java:43)
1: 	at java.lang.reflect.Method.invoke(Method.java:606)
1: 	at org.apache.maven.surefire.util.ReflectionUtils.invokeMethodWithArray(ReflectionUtils.java:189)
1: 	at org.apache.maven.surefire.booter.ProviderFactory$ProviderProxy.invoke(ProviderFactory.java:165)
1: 	at org.apache.maven.surefire.booter.ProviderFactory.invokeProvider(ProviderFactory.java:85)
1: 	at org.apache.maven.surefire.booter.ForkedBooter.runSuitesInProcess(ForkedBooter.java:115)
1: 	at org.apache.maven.surefire.booter.ForkedBooter.main(ForkedBooter.java:75)
1: 
1: connectionRefused[1](org.apache.qpid.proton.reactor.ReactorTest)  Time elapsed: 0.005 sec
 <<< ERROR!
1: java.lang.NoSuchMethodError: org.apache.qpid.proton.engine.impl.CollectorImpl.put(Lorg/apache/qpid/proton/engine/Event$Type;Ljava/lang/Object;)Lorg/apache/qpid/proton/engine/impl/EventImpl;
1: 	at org.apache.qpid.proton.engine.impl.ConnectionImpl.put(ConnectionImpl.java:644)
1: 	at org.apache.qpid.proton.engine.impl.ConnectionImpl.collect(ConnectionImpl.java:626)
1: 	at org.apache.qpid.proton.reactor.impl.ReactorImpl.connection(ReactorImpl.java:416)
1: 	at org.apache.qpid.proton.reactor.ReactorTest.connectionRefused(ReactorTest.java:590)
1: 	at sun.reflect.NativeMethodAccessorImpl.invoke0(Native Method)
1: 	at sun.reflect.NativeMethodAccessorImpl.invoke(NativeMethodAccessorImpl.java:57)
1: 	at sun.reflect.DelegatingMethodAccessorImpl.invoke(DelegatingMethodAccessorImpl.java:43)
1: 	at java.lang.reflect.Method.invoke(Method.java:606)
1: 	at org.junit.runners.model.FrameworkMethod$1.runReflectiveCall(FrameworkMethod.java:45)
1: 	at org.junit.internal.runners.model.ReflectiveCallable.run(ReflectiveCallable.java:15)
1: 	at org.junit.runners.model.FrameworkMethod.invokeExplosively(FrameworkMethod.java:42)
1: 	at org.junit.internal.runners.statements.InvokeMethod.evaluate(InvokeMethod.java:20)
1: 	at org.junit.internal.runners.statements.RunBefores.evaluate(RunBefores.java:28)
1: 	at org.junit.internal.runners.statements.RunAfters.evaluate(RunAfters.java:30)
1: 	at org.junit.runners.ParentRunner.runLeaf(ParentRunner.java:263)
1: 	at org.junit.runners.BlockJUnit4ClassRunner.runChild(BlockJUnit4ClassRunner.java:68)
1: 	at org.junit.runners.BlockJUnit4ClassRunner.runChild(BlockJUnit4ClassRunner.java:47)
1: 	at org.junit.runners.ParentRunner$3.run(ParentRunner.java:231)
1: 	at org.junit.runners.ParentRunner$1.schedule(ParentRunner.java:60)
1: 	at org.junit.runners.ParentRunner.runChildren(ParentRunner.java:229)
1: 	at org.junit.runners.ParentRunner.access$000(ParentRunner.java:50)
1: 	at org.junit.runners.ParentRunner$2.evaluate(ParentRunner.java:222)
1: 	at org.junit.runners.ParentRunner.run(ParentRunner.java:300)
1: 	at org.junit.runners.Suite.runChild(Suite.java:128)
1: 	at org.junit.runners.Suite.runChild(Suite.java:24)
1: 	at org.junit.runners.ParentRunner$3.run(ParentRunner.java:231)
1: 	at org.junit.runners.ParentRunner$1.schedule(ParentRunner.java:60)
1: 	at org.junit.runners.ParentRunner.runChildren(ParentRunner.java:229)
1: 	at org.junit.runners.ParentRunner.access$000(ParentRunner.java:50)
1: 	at org.junit.runners.ParentRunner$2.evaluate(ParentRunner.java:222)
1: 	at org.junit.runners.ParentRunner.run(ParentRunner.java:300)
1: 	at org.apache.maven.surefire.junit4.JUnit4Provider.execute(JUnit4Provider.java:252)
1: 	at org.apache.maven.surefire.junit4.JUnit4Provider.executeTestSet(JUnit4Provider.java:141)
1: 	at org.apache.maven.surefire.junit4.JUnit4Provider.invoke(JUnit4Provider.java:112)
1: 	at sun.reflect.NativeMethodAccessorImpl.invoke0(Native Method)
1: 	at sun.reflect.NativeMethodAccessorImpl.invoke(NativeMethodAccessorImpl.java:57)
1: 	at sun.reflect.DelegatingMethodAccessorImpl.invoke(DelegatingMethodAccessorImpl.java:43)
1: 	at java.lang.reflect.Method.invoke(Method.java:606)
1: 	at org.apache.maven.surefire.util.ReflectionUtils.invokeMethodWithArray(ReflectionUtils.java:189)
1: 	at org.apache.maven.surefire.booter.ProviderFactory$ProviderProxy.invoke(ProviderFactory.java:165)
1: 	at org.apache.maven.surefire.booter.ProviderFactory.invokeProvider(ProviderFactory.java:85)
1: 	at org.apache.maven.surefire.booter.ForkedBooter.runSuitesInProcess(ForkedBooter.java:115)
1: 	at org.apache.maven.surefire.booter.ForkedBooter.main(ForkedBooter.java:75)
1: 
1: connectionRefused[1](org.apache.qpid.proton.reactor.ReactorTest)  Time elapsed: 0.005 sec
 <<< FAILURE!
1: junit.framework.AssertionFailedError: Resources leaked
1: 	at org.apache.qpid.proton.reactor.impl.LeakTestReactor$TestIO.assertNoLeaks(LeakTestReactor.java:101)
1: 	at org.apache.qpid.proton.reactor.impl.LeakTestReactor.assertNoLeaks(LeakTestReactor.java:115)
1: 	at org.apache.qpid.proton.reactor.ReactorTest.checkForLeaks(ReactorTest.java:96)
1: 	at org.apache.qpid.proton.reactor.ReactorTest.after(ReactorTest.java:102)
1: 	at sun.reflect.GeneratedMethodAccessor2.invoke(Unknown Source)
1: 	at sun.reflect.DelegatingMethodAccessorImpl.invoke(DelegatingMethodAccessorImpl.java:43)
1: 	at java.lang.reflect.Method.invoke(Method.java:606)
1: 	at org.junit.runners.model.FrameworkMethod$1.runReflectiveCall(FrameworkMethod.java:45)
1: 	at org.junit.internal.runners.model.ReflectiveCallable.run(ReflectiveCallable.java:15)
1: 	at org.junit.runners.model.FrameworkMethod.invokeExplosively(FrameworkMethod.java:42)
1: 	at org.junit.internal.runners.statements.RunAfters.evaluate(RunAfters.java:36)
1: 	at org.junit.runners.ParentRunner.runLeaf(ParentRunner.java:263)
1: 	at org.junit.runners.BlockJUnit4ClassRunner.runChild(BlockJUnit4ClassRunner.java:68)
1: 	at org.junit.runners.BlockJUnit4ClassRunner.runChild(BlockJUnit4ClassRunner.java:47)
1: 	at org.junit.runners.ParentRunner$3.run(ParentRunner.java:231)
1: 	at org.junit.runners.ParentRunner$1.schedule(ParentRunner.java:60)
1: 	at org.junit.runners.ParentRunner.runChildren(ParentRunner.java:229)
1: 	at org.junit.runners.ParentRunner.access$000(ParentRunner.java:50)
1: 	at org.junit.runners.ParentRunner$2.evaluate(ParentRunner.java:222)
1: 	at org.junit.runners.ParentRunner.run(ParentRunner.java:300)
1: 	at org.junit.runners.Suite.runChild(Suite.java:128)
1: 	at org.junit.runners.Suite.runChild(Suite.java:24)
1: 	at org.junit.runners.ParentRunner$3.run(ParentRunner.java:231)
1: 	at org.junit.runners.ParentRunner$1.schedule(ParentRunner.java:60)
1: 	at org.junit.runners.ParentRunner.runChildren(ParentRunner.java:229)
1: 	at org.junit.runners.ParentRunner.access$000(ParentRunner.java:50)
1: 	at org.junit.runners.ParentRunner$2.evaluate(ParentRunner.java:222)
1: 	at org.junit.runners.ParentRunner.run(ParentRunner.java:300)
1: 	at org.apache.maven.surefire.junit4.JUnit4Provider.execute(JUnit4Provider.java:252)
1: 	at org.apache.maven.surefire.junit4.JUnit4Provider.executeTestSet(JUnit4Provider.java:141)
1: 	at org.apache.maven.surefire.junit4.JUnit4Provider.invoke(JUnit4Provider.java:112)
1: 	at sun.reflect.NativeMethodAccessorImpl.invoke0(Native Method)
1: 	at sun.reflect.NativeMethodAccessorImpl.invoke(NativeMethodAccessorImpl.java:57)
1: 	at sun.reflect.DelegatingMethodAccessorImpl.invoke(DelegatingMethodAccessorImpl.java:43)
1: 	at java.lang.reflect.Method.invoke(Method.java:606)
1: 	at org.apache.maven.surefire.util.ReflectionUtils.invokeMethodWithArray(ReflectionUtils.java:189)
1: 	at org.apache.maven.surefire.booter.ProviderFactory$ProviderProxy.invoke(ProviderFactory.java:165)
1: 	at org.apache.maven.surefire.booter.ProviderFactory.invokeProvider(ProviderFactory.java:85)
1: 	at org.apache.maven.surefire.booter.ForkedBooter.runSuitesInProcess(ForkedBooter.java:115)
1: 	at org.apache.maven.surefire.booter.ForkedBooter.main(ForkedBooter.java:75)
1: 
1: Running org.apache.qpid.proton.reactor.impl.AcceptorImplTest
1: Tests run: 2, Failures: 0, Errors: 0, Skipped: 0, Time elapsed: 0.527 sec
1: Running org.apache.qpid.proton.engine.EventExtensibilityTest
1: Tests run: 2, Failures: 0, Errors: 0, Skipped: 0, Time elapsed: 0.012 sec
1: Running org.apache.qpid.proton.engine.impl.StringUtilsTest
1: Tests run: 10, Failures: 0, Errors: 0, Skipped: 0, Time elapsed: 0.019 sec
1: Running org.apache.qpid.proton.engine.impl.SaslFrameParserTest
1: Tests run: 3, Failures: 0, Errors: 0, Skipped: 0, Time elapsed: 0.525 sec
1: Running org.apache.qpid.proton.engine.impl.ssl.SimpleSslTransportWrapperTest
1: Aug 18, 2015 2:19:36 PM org.apache.qpid.proton.engine.impl.ssl.SimpleSslTransportWrapper
process
1: WARNING: unwrap exception
1: Tests run: 13, Failures: 0, Errors: 0, Skipped: 0, Time elapsed: 0.083 sec
1: Running org.apache.qpid.proton.engine.impl.ssl.SslHandshakeSniffingTransportWrapperTest
1: Tests run: 7, Failures: 0, Errors: 0, Skipped: 0, Time elapsed: 0.044 sec
1: Running org.apache.qpid.proton.engine.impl.TransportImplTest
1: Tests run: 15, Failures: 0, Errors: 0, Skipped: 0, Time elapsed: 0.148 sec
1: Running org.apache.qpid.proton.engine.impl.FrameParserTest
1: Tests run: 8, Failures: 0, Errors: 0, Skipped: 0, Time elapsed: 0.047 sec
1: Running org.apache.qpid.proton.engine.impl.TransportOutputAdaptorTest
1: Tests run: 4, Failures: 0, Errors: 0, Skipped: 0, Time elapsed: 0.007 sec
1: Running org.apache.qpid.proton.codec.UnsignedIntegerTypeTest
1: Tests run: 3, Failures: 0, Errors: 0, Skipped: 0, Time elapsed: 0.001 sec
1: Running org.apache.qpid.proton.codec.StringTypeTest
1: Tests run: 2, Failures: 0, Errors: 0, Skipped: 0, Time elapsed: 0.881 sec
1: Running org.apache.qpid.proton.codec.UnsignedLongTypeTest
1: Tests run: 3, Failures: 0, Errors: 0, Skipped: 0, Time elapsed: 0.001 sec
1: Running org.apache.qpid.proton.codec.impl.DataImplTest
1: Tests run: 2, Failures: 0, Errors: 0, Skipped: 0, Time elapsed: 0.06 sec
1: Running org.apache.qpid.proton.amqp.transport.ErrorConditionTest
1: Tests run: 5, Failures: 0, Errors: 0, Skipped: 0, Time elapsed: 0.003 sec
1: Running org.apache.qpid.proton.amqp.BinaryTest
1: Tests run: 6, Failures: 0, Errors: 0, Skipped: 0, Time elapsed: 0.001 sec
1: Running org.apache.qpid.proton.amqp.UnsignedLongTest
1: Tests run: 6, Failures: 0, Errors: 0, Skipped: 0, Time elapsed: 0.036 sec
1: Running org.apache.qpid.proton.messenger.impl.AddressTest
1: Tests run: 1, Failures: 0, Errors: 0, Skipped: 0, Time elapsed: 0.001 sec
1: Running org.apache.qpid.proton.systemtests.ProtonEngineExampleTest
1: Tests run: 1, Failures: 0, Errors: 0, Skipped: 0, Time elapsed: 0.199 sec
1: Running org.apache.qpid.proton.systemtests.engine.ConnectionTest
1: Tests run: 13, Failures: 0, Errors: 0, Skipped: 1, Time elapsed: 0.039 sec
1: Running org.apache.qpid.proton.systemtests.engine.TransportTest
1: Tests run: 1, Failures: 0, Errors: 0, Skipped: 1, Time elapsed: 0.001 sec
1: Running org.apache.qpid.proton.systemtests.DefaultDeliveryStateTest
1: Tests run: 1, Failures: 0, Errors: 0, Skipped: 0, Time elapsed: 0.03 sec
1: Running org.apache.qpid.proton.systemtests.SaslTest
1: Tests run: 1, Failures: 0, Errors: 0, Skipped: 0, Time elapsed: 0.081 sec
1: Running org.apache.qpid.proton.systemtests.BinaryFormatterTest
1: Tests run: 4, Failures: 0, Errors: 0, Skipped: 0, Time elapsed: 0.001 sec
1: Running org.apache.qpid.proton.systemtests.SimpleTest
1: Tests run: 1, Failures: 0, Errors: 0, Skipped: 0, Time elapsed: 0 sec
1: Running org.apache.qpid.proton.systemtests.FreeTest
1: Tests run: 1, Failures: 0, Errors: 0, Skipped: 0, Time elapsed: 0.033 sec
1: 
1: Results :
1: 
1: Failed tests:   connect[1](org.apache.qpid.proton.reactor.ReactorTest): Resources leaked
1:   connection[1](org.apache.qpid.proton.reactor.ReactorTest): Resources leaked
1:   transfer_0to64_2[1](org.apache.qpid.proton.reactor.ReactorTest): Resources leaked
1:   transfer_1024_64[1](org.apache.qpid.proton.reactor.ReactorTest): Resources leaked
1:   transfer_4096_1024[1](org.apache.qpid.proton.reactor.ReactorTest): Resources leaked
1:   schedule[1](org.apache.qpid.proton.reactor.ReactorTest): Resources leaked
1:   barfOnConnection[1](org.apache.qpid.proton.reactor.ReactorTest): Resources leaked
1:   barfOnSession[1](org.apache.qpid.proton.reactor.ReactorTest): Resources leaked
1:   barfOnLink[1](org.apache.qpid.proton.reactor.ReactorTest): Resources leaked
1:   barfOnSchedule[1](org.apache.qpid.proton.reactor.ReactorTest): Resources leaked
1:   connectionRefused[1](org.apache.qpid.proton.reactor.ReactorTest): Resources leaked
1: 
1: Tests in error: 
1:   connect[0](org.apache.qpid.proton.reactor.ReactorTest): org.apache.qpid.proton.engine.impl.CollectorImpl.put(Lorg/apache/qpid/proton/engine/Event$Type;Ljava/lang/Object;)Lorg/apache/qpid/proton/engine/impl/EventImpl;
1:   connection[0](org.apache.qpid.proton.reactor.ReactorTest): org.apache.qpid.proton.engine.impl.CollectorImpl.put(Lorg/apache/qpid/proton/engine/Event$Type;Ljava/lang/Object;)Lorg/apache/qpid/proton/engine/impl/EventImpl;
1:   transfer_0to64_2[0](org.apache.qpid.proton.reactor.ReactorTest): org.apache.qpid.proton.engine.impl.CollectorImpl.put(Lorg/apache/qpid/proton/engine/Event$Type;Ljava/lang/Object;)Lorg/apache/qpid/proton/engine/impl/EventImpl;
1:   transfer_1024_64[0](org.apache.qpid.proton.reactor.ReactorTest): org.apache.qpid.proton.engine.impl.CollectorImpl.put(Lorg/apache/qpid/proton/engine/Event$Type;Ljava/lang/Object;)Lorg/apache/qpid/proton/engine/impl/EventImpl;
1:   transfer_4096_1024[0](org.apache.qpid.proton.reactor.ReactorTest): org.apache.qpid.proton.engine.impl.CollectorImpl.put(Lorg/apache/qpid/proton/engine/Event$Type;Ljava/lang/Object;)Lorg/apache/qpid/proton/engine/impl/EventImpl;
1:   schedule[0](org.apache.qpid.proton.reactor.ReactorTest): org.apache.qpid.proton.engine.impl.CollectorImpl.put(Lorg/apache/qpid/proton/engine/Event$Type;Ljava/lang/Object;)Lorg/apache/qpid/proton/engine/impl/EventImpl;
1:   barfOnConnection[0](org.apache.qpid.proton.reactor.ReactorTest): org.apache.qpid.proton.engine.impl.CollectorImpl.put(Lorg/apache/qpid/proton/engine/Event$Type;Ljava/lang/Object;)Lorg/apache/qpid/proton/engine/impl/EventImpl;
1:   barfOnSession[0](org.apache.qpid.proton.reactor.ReactorTest): org.apache.qpid.proton.engine.impl.CollectorImpl.put(Lorg/apache/qpid/proton/engine/Event$Type;Ljava/lang/Object;)Lorg/apache/qpid/proton/engine/impl/EventImpl;
1:   barfOnLink[0](org.apache.qpid.proton.reactor.ReactorTest): org.apache.qpid.proton.engine.impl.CollectorImpl.put(Lorg/apache/qpid/proton/engine/Event$Type;Ljava/lang/Object;)Lorg/apache/qpid/proton/engine/impl/EventImpl;
1:   barfOnSchedule[0](org.apache.qpid.proton.reactor.ReactorTest): org.apache.qpid.proton.engine.impl.CollectorImpl.put(Lorg/apache/qpid/proton/engine/Event$Type;Ljava/lang/Object;)Lorg/apache/qpid/proton/engine/impl/EventImpl;
1:   connectionRefused[0](org.apache.qpid.proton.reactor.ReactorTest): org.apache.qpid.proton.engine.impl.CollectorImpl.put(Lorg/apache/qpid/proton/engine/Event$Type;Ljava/lang/Object;)Lorg/apache/qpid/proton/engine/impl/EventImpl;
1:   connect[1](org.apache.qpid.proton.reactor.ReactorTest): org.apache.qpid.proton.engine.impl.CollectorImpl.put(Lorg/apache/qpid/proton/engine/Event$Type;Ljava/lang/Object;)Lorg/apache/qpid/proton/engine/impl/EventImpl;
1:   connection[1](org.apache.qpid.proton.reactor.ReactorTest): org.apache.qpid.proton.engine.impl.CollectorImpl.put(Lorg/apache/qpid/proton/engine/Event$Type;Ljava/lang/Object;)Lorg/apache/qpid/proton/engine/impl/EventImpl;
1:   transfer_0to64_2[1](org.apache.qpid.proton.reactor.ReactorTest): org.apache.qpid.proton.engine.impl.CollectorImpl.put(Lorg/apache/qpid/proton/engine/Event$Type;Ljava/lang/Object;)Lorg/apache/qpid/proton/engine/impl/EventImpl;
1:   transfer_1024_64[1](org.apache.qpid.proton.reactor.ReactorTest): org.apache.qpid.proton.engine.impl.CollectorImpl.put(Lorg/apache/qpid/proton/engine/Event$Type;Ljava/lang/Object;)Lorg/apache/qpid/proton/engine/impl/EventImpl;
1:   transfer_4096_1024[1](org.apache.qpid.proton.reactor.ReactorTest): org.apache.qpid.proton.engine.impl.CollectorImpl.put(Lorg/apache/qpid/proton/engine/Event$Type;Ljava/lang/Object;)Lorg/apache/qpid/proton/engine/impl/EventImpl;
1:   schedule[1](org.apache.qpid.proton.reactor.ReactorTest): org.apache.qpid.proton.engine.impl.CollectorImpl.put(Lorg/apache/qpid/proton/engine/Event$Type;Ljava/lang/Object;)Lorg/apache/qpid/proton/engine/impl/EventImpl;
1:   barfOnConnection[1](org.apache.qpid.proton.reactor.ReactorTest): org.apache.qpid.proton.engine.impl.CollectorImpl.put(Lorg/apache/qpid/proton/engine/Event$Type;Ljava/lang/Object;)Lorg/apache/qpid/proton/engine/impl/EventImpl;
1:   barfOnSession[1](org.apache.qpid.proton.reactor.ReactorTest): org.apache.qpid.proton.engine.impl.CollectorImpl.put(Lorg/apache/qpid/proton/engine/Event$Type;Ljava/lang/Object;)Lorg/apache/qpid/proton/engine/impl/EventImpl;
1:   barfOnLink[1](org.apache.qpid.proton.reactor.ReactorTest): org.apache.qpid.proton.engine.impl.CollectorImpl.put(Lorg/apache/qpid/proton/engine/Event$Type;Ljava/lang/Object;)Lorg/apache/qpid/proton/engine/impl/EventImpl;
1:   barfOnSchedule[1](org.apache.qpid.proton.reactor.ReactorTest): org.apache.qpid.proton.engine.impl.CollectorImpl.put(Lorg/apache/qpid/proton/engine/Event$Type;Ljava/lang/Object;)Lorg/apache/qpid/proton/engine/impl/EventImpl;
1:   connectionRefused[1](org.apache.qpid.proton.reactor.ReactorTest): org.apache.qpid.proton.engine.impl.CollectorImpl.put(Lorg/apache/qpid/proton/engine/Event$Type;Ljava/lang/Object;)Lorg/apache/qpid/proton/engine/impl/EventImpl;
1: 
1: Tests run: 164, Failures: 11, Errors: 22, Skipped: 2
1: 
1: [INFO] ------------------------------------------------------------------------
1: [ERROR] BUILD FAILURE
1: [INFO] ------------------------------------------------------------------------
1: [INFO] There are test failures.
1: 
1: Please refer to /x1/jenkins/jenkins-slave/workspace/Qpid-proton-c/proton-j/target/surefire-reports
for the individual test results.
1: [INFO] ------------------------------------------------------------------------
1: [INFO] For more information, run Maven with the -e switch
1: [INFO] ------------------------------------------------------------------------
1: [INFO] Total time: 8 seconds
1: [INFO] Finished at: Tue Aug 18 14:19:38 UTC 2015
1: [INFO] Final Memory: 28M/455M
1: [INFO] ------------------------------------------------------------------------
1/1 Test #1: proton-java ......................***Failed    9.93 sec

0% tests passed, 1 tests failed out of 1

Total Test time (real) =   9.93 sec

The following tests FAILED:
	  1 - proton-java (Failed)
Errors while running CTest
Build step 'Execute shell' marked build as failure
Recording test results

Mime
View raw message