qpid-notifications mailing list archives

Site index · List index
Message view « Date » · « Thread »
Top « Date » · « Thread »
From Apache Jenkins Server <jenk...@builds.apache.org>
Subject Build failed in Jenkins: Qpid-Java-Java-Test-JDK1.8 #1123
Date Fri, 12 Jun 2015 04:54:51 GMT
See <https://builds.apache.org/job/Qpid-Java-Java-Test-JDK1.8/1123/changes>

Changes:

[rgodfrey] QPID-6586 : [Java Broker] Allow configured objects to define "ManagedOperations"
and expose these through the REST api

[rgodfrey] QPID-6585 : Allow omission of the AMQP 1.0 SASL layer for ports where External
or Anonymous auth is allowed

[rgodfrey] QPID-6584 : [Java Test] ensure tests clean up thread pools created by vhosts on
closing (work by Lorenz Quack and Rob Godfrey)

[rgodfrey] QPID-6583 : [Java Client] AMQSession_0_10 should use connection task pool rather
than a Timer

[rgodfrey] QPID-6429 : NonBlockingConnection.doWrite() may incorrectly return true when all
output has been TLS encrypted by the SSLEngine, but not yet written to the wire

[rgodfrey] QPID-6582 : Implement fairness amongst session/consumer on a single connection
(work by Rob Godfrey and Lorenz Quack)

[rgodfrey] NO-JIRA : Exclude long running test which simply tests Java subtraction

------------------------------------------
[...truncated 3934 lines...]
Running org.apache.qpid.disttest.client.utils.ExecutorWithTimeLimitTest
Tests run: 4, Failures: 0, Errors: 0, Skipped: 0, Time elapsed: 0.511 sec - in org.apache.qpid.disttest.client.utils.ExecutorWithTimeLimitTest
Running org.apache.qpid.disttest.client.ClientTest
Tests run: 8, Failures: 0, Errors: 0, Skipped: 0, Time elapsed: 0.531 sec - in org.apache.qpid.disttest.client.ClientTest
Running org.apache.qpid.disttest.client.MessageProviderTest
Tests run: 3, Failures: 0, Errors: 0, Skipped: 0, Time elapsed: 0.036 sec - in org.apache.qpid.disttest.client.MessageProviderTest
Running org.apache.qpid.disttest.client.ParticipantRegistryTest
Tests run: 2, Failures: 0, Errors: 0, Skipped: 0, Time elapsed: 0.002 sec - in org.apache.qpid.disttest.client.ParticipantRegistryTest
Running org.apache.qpid.disttest.client.ProducerParticipantTest
Tests run: 9, Failures: 0, Errors: 0, Skipped: 0, Time elapsed: 1.615 sec - in org.apache.qpid.disttest.client.ProducerParticipantTest
Running org.apache.qpid.disttest.client.ConsumerParticipantTest
Tests run: 7, Failures: 0, Errors: 0, Skipped: 0, Time elapsed: 0.143 sec - in org.apache.qpid.disttest.client.ConsumerParticipantTest
Running org.apache.qpid.disttest.client.ParticipantResultFactoryTest
Tests run: 3, Failures: 0, Errors: 0, Skipped: 0, Time elapsed: 0.002 sec - in org.apache.qpid.disttest.client.ParticipantResultFactoryTest
Running org.apache.qpid.disttest.results.aggregation.AggregatorTest
Tests run: 1, Failures: 0, Errors: 0, Skipped: 0, Time elapsed: 0.342 sec - in org.apache.qpid.disttest.results.aggregation.AggregatorTest
Running org.apache.qpid.disttest.results.aggregation.ParticipantResultAggregatorTest
Tests run: 14, Failures: 0, Errors: 0, Skipped: 0, Time elapsed: 0.006 sec - in org.apache.qpid.disttest.results.aggregation.ParticipantResultAggregatorTest
Running org.apache.qpid.disttest.results.aggregation.SeriesStatisticsTest
Tests run: 1, Failures: 0, Errors: 0, Skipped: 0, Time elapsed: 0.001 sec - in org.apache.qpid.disttest.results.aggregation.SeriesStatisticsTest
Running org.apache.qpid.disttest.results.aggregation.TestResultAggregatorTest
Tests run: 4, Failures: 0, Errors: 0, Skipped: 0, Time elapsed: 0.004 sec - in org.apache.qpid.disttest.results.aggregation.TestResultAggregatorTest
Running org.apache.qpid.disttest.results.formatting.CSVFormatterTest
Tests run: 1, Failures: 0, Errors: 0, Skipped: 0, Time elapsed: 0.015 sec - in org.apache.qpid.disttest.results.formatting.CSVFormatterTest
Running org.apache.qpid.disttest.results.formatting.CSVOrderParticipantResultComparatorTest
Tests run: 6, Failures: 0, Errors: 0, Skipped: 0, Time elapsed: 0.031 sec - in org.apache.qpid.disttest.results.formatting.CSVOrderParticipantResultComparatorTest
Running org.apache.qpid.disttest.results.ResultsFileWriterTest
Tests run: 2, Failures: 0, Errors: 0, Skipped: 0, Time elapsed: 0.013 sec - in org.apache.qpid.disttest.results.ResultsFileWriterTest
Running org.apache.qpid.disttest.jms.JmsMessageAdaptorTest
Tests run: 1, Failures: 0, Errors: 0, Skipped: 0, Time elapsed: 0.008 sec - in org.apache.qpid.disttest.jms.JmsMessageAdaptorTest
Running org.apache.qpid.disttest.VisitorTest
Tests run: 3, Failures: 0, Errors: 0, Skipped: 0, Time elapsed: 0 sec - in org.apache.qpid.disttest.VisitorTest

Results :

Tests run: 180, Failures: 0, Errors: 0, Skipped: 0

[INFO] 
[INFO] --- maven-jar-plugin:2.4:jar (default-jar) @ qpid-perftests ---
[INFO] Building jar: <https://builds.apache.org/job/Qpid-Java-Java-Test-JDK1.8/ws/trunk/perftests/target/qpid-perftests-6.0.0-SNAPSHOT.jar>
[INFO] 
[INFO] --- maven-site-plugin:3.3:attach-descriptor (attach-descriptor) @ qpid-perftests ---
[INFO] 
[INFO] --- maven-assembly-plugin:2.4:single (make-assembly) @ qpid-perftests ---
[INFO] Reading assembly descriptor: src/main/assembly/qpid-perftests-bin.xml
[INFO] Building tar: <https://builds.apache.org/job/Qpid-Java-Java-Test-JDK1.8/ws/trunk/perftests/target/qpid-perftests-6.0.0-SNAPSHOT-bin.tar.gz>
[WARNING] Entry: qpid-perftests/6.0.0-SNAPSHOT/etc/chartdefs/1302-QueueConsumersWithOverlappingSelectors-Transient.chartdef
longer than 100 characters.
[WARNING] Resulting tar file can only be processed successfully by GNU compatible tar commands
[WARNING] Entry: qpid-perftests/6.0.0-SNAPSHOT/etc/chartdefs/1300-QueueConsumersWithNonOverlappingSelectors-Transient.chartdef
longer than 100 characters.
[WARNING] Entry: qpid-perftests/6.0.0-SNAPSHOT/etc/chartdefs/1303-QueueConsumersWithOverlappingSelectors-Persistent.chartdef
longer than 100 characters.
[WARNING] Entry: qpid-perftests/6.0.0-SNAPSHOT/etc/chartdefs/1301-QueueConsumersWithNonOverlappingSelectors-Persistent.chartdef
longer than 100 characters.
[WARNING] Entry: qpid-perftests/6.0.0-SNAPSHOT/etc/chartdefs/1050-VaryingNumberOfProducerSessionsSingleConnection.chartdef
longer than 100 characters.
[WARNING] Entry: qpid-perftests/6.0.0-SNAPSHOT/etc/chartdefs/timeseries/1011-MultipleProducersAndConsumers-Persistent.chartdef
longer than 100 characters.
[INFO] 
[INFO] --- maven-antrun-plugin:1.7:run (create-qbtc-output-dir) @ qpid-perftests ---
[INFO] Executing tasks

main:
    [mkdir] Created dir: <https://builds.apache.org/job/Qpid-Java-Java-Test-JDK1.8/ws/trunk/perftests/target/qbtc-test-config>
[INFO] Executed tasks
[INFO]                                                                         
[INFO] ------------------------------------------------------------------------
[INFO] Skipping Qpid Performance Test System Tests
[INFO] This project has been banned from the build due to previous failures.
[INFO] ------------------------------------------------------------------------
[INFO]                                                                         
[INFO] ------------------------------------------------------------------------
[INFO] Building Qpid Performance Tests Visualisation JFC 6.0.0-SNAPSHOT
[INFO] ------------------------------------------------------------------------
[INFO] 
[INFO] --- maven-clean-plugin:2.5:clean (default-clean) @ qpid-perftests-visualisation-jfc
---
[INFO] Deleting <https://builds.apache.org/job/Qpid-Java-Java-Test-JDK1.8/ws/trunk/perftests/visualisation-jfc/target>
[INFO] 
[INFO] --- maven-antrun-plugin:1.7:run (output-test-properties) @ qpid-perftests-visualisation-jfc
---
[INFO] Executing tasks

main:
     [echo] Qpid Test Profile Properties
     [echo] [profile] java-mms.0-10
     [echo] [profile.broker.language] java
     [echo] [profile.broker.type] internal
     [echo] [profile.broker.command] "<https://builds.apache.org/job/Qpid-Java-Java-Test-JDK1.8/ws/trunk/perftests/visualisation-jfc/bin/qpid-server">
-sp @STORE_PATH -st @STORE_TYPE
     [echo] [profile.specific.excludes] JavaTransientExcludes Java010Excludes
     [echo] [profile.test.excludes] Excludes JavaExcludes java-mms.0-10.excludes JavaTransientExcludes
Java010Excludes
     [echo] [profile.broker.version] v0_10
     [echo] [profile.test.amqp_port_protocols] ["AMQP_0_8","AMQP_0_9","AMQP_0_9_1","AMQP_0_10"]
     [echo] [profile.broker.persistent] false
     [echo] [profile.virtualhostnode.type] Memory
     [echo] [profile.virtualhostnode.context.blueprint] {"type":"ProvidedStore","globalAddressDomains":"${qpid.globalAddressDomains}"}
     [echo] [profile.test_receive_timeout] 1000
[INFO] Executed tasks
[INFO] 
[INFO] --- maven-enforcer-plugin:1.3.1:enforce (enforce-minimum-versions) @ qpid-perftests-visualisation-jfc
---
[INFO] 
[INFO] --- maven-enforcer-plugin:1.3.1:enforce (enforce-versions-standard-properties) @ qpid-perftests-visualisation-jfc
---
[INFO] 
[INFO] --- jacoco-maven-plugin:0.7.0.201403182114:prepare-agent (default-prepare-agent) @
qpid-perftests-visualisation-jfc ---
[INFO] argLine set to -javaagent:/home/jenkins/.m2/repository/org/jacoco/org.jacoco.agent/0.7.0.201403182114/org.jacoco.agent-0.7.0.201403182114-runtime.jar=destfile=<https://builds.apache.org/job/Qpid-Java-Java-Test-JDK1.8/ws/trunk/perftests/visualisation-jfc/target/jacoco.exec>
-Xmx512m
[INFO] 
[INFO] --- maven-remote-resources-plugin:1.5:process (default) @ qpid-perftests-visualisation-jfc
---
[INFO] 
[INFO] --- maven-resources-plugin:2.6:resources (default-resources) @ qpid-perftests-visualisation-jfc
---
[INFO] Using 'UTF-8' encoding to copy filtered resources.
[INFO] skip non existing resourceDirectory <https://builds.apache.org/job/Qpid-Java-Java-Test-JDK1.8/ws/trunk/perftests/visualisation-jfc/src/main/resources>
[INFO] Copying 0 resource
[INFO] Copying 3 resources
[INFO] 
[INFO] --- maven-compiler-plugin:3.1:compile (default-compile) @ qpid-perftests-visualisation-jfc
---
[INFO] Changes detected - recompiling the module!
[INFO] Compiling 30 source files to <https://builds.apache.org/job/Qpid-Java-Java-Test-JDK1.8/ws/trunk/perftests/visualisation-jfc/target/classes>
[WARNING] bootstrap class path not set in conjunction with -source 1.7
[INFO] 
[INFO] --- maven-resources-plugin:2.6:testResources (default-testResources) @ qpid-perftests-visualisation-jfc
---
[INFO] Using 'UTF-8' encoding to copy filtered resources.
[INFO] Copying 1 resource
[INFO] skip non existing resourceDirectory <https://builds.apache.org/job/Qpid-Java-Java-Test-JDK1.8/ws/trunk/perftests/visualisation-jfc/src/test/resources>
[INFO] Copying 3 resources
[INFO] 
[INFO] --- maven-compiler-plugin:3.1:testCompile (default-testCompile) @ qpid-perftests-visualisation-jfc
---
[INFO] Changes detected - recompiling the module!
[INFO] Compiling 11 source files to <https://builds.apache.org/job/Qpid-Java-Java-Test-JDK1.8/ws/trunk/perftests/visualisation-jfc/target/test-classes>
[WARNING] bootstrap class path not set in conjunction with -source 1.7
[INFO] 
[INFO] --- maven-surefire-plugin:2.16:test (default-test) @ qpid-perftests-visualisation-jfc
---
[INFO] Surefire report directory: <https://builds.apache.org/job/Qpid-Java-Java-Test-JDK1.8/ws/trunk/perftests/visualisation-jfc/target/surefire-reports>

-------------------------------------------------------
 T E S T S
-------------------------------------------------------
Running org.apache.qpid.disttest.charting.definition.SeriesDefinitionCreatorTest
Tests run: 4, Failures: 0, Errors: 0, Skipped: 0, Time elapsed: 0.52 sec - in org.apache.qpid.disttest.charting.definition.SeriesDefinitionCreatorTest
Running org.apache.qpid.disttest.charting.definition.ChartingDefinitionCreatorTest
Tests run: 4, Failures: 0, Errors: 0, Skipped: 0, Time elapsed: 0.025 sec - in org.apache.qpid.disttest.charting.definition.ChartingDefinitionCreatorTest
Running org.apache.qpid.disttest.charting.writer.ChartWriterTest
Tests run: 3, Failures: 0, Errors: 0, Skipped: 0, Time elapsed: 3.914 sec - in org.apache.qpid.disttest.charting.writer.ChartWriterTest
Running org.apache.qpid.disttest.charting.chartbuilder.ChartProductionTest
Tests run: 8, Failures: 0, Errors: 0, Skipped: 0, Time elapsed: 0.868 sec - in org.apache.qpid.disttest.charting.chartbuilder.ChartProductionTest
Running org.apache.qpid.disttest.charting.chartbuilder.ColorFactoryTest
Tests run: 2, Failures: 0, Errors: 0, Skipped: 0, Time elapsed: 0.002 sec - in org.apache.qpid.disttest.charting.chartbuilder.ColorFactoryTest
Running org.apache.qpid.disttest.charting.chartbuilder.ChartBuilderFactoryTest
Tests run: 6, Failures: 0, Errors: 0, Skipped: 0, Time elapsed: 0.014 sec - in org.apache.qpid.disttest.charting.chartbuilder.ChartBuilderFactoryTest
Running org.apache.qpid.disttest.charting.chartbuilder.BaseChartBuilderTest
Tests run: 1, Failures: 0, Errors: 0, Skipped: 0, Time elapsed: 0.064 sec - in org.apache.qpid.disttest.charting.chartbuilder.BaseChartBuilderTest
Running org.apache.qpid.disttest.charting.chartbuilder.TimeSeriesBuilderCallbackTest
Tests run: 1, Failures: 0, Errors: 0, Skipped: 0, Time elapsed: 0.002 sec - in org.apache.qpid.disttest.charting.chartbuilder.TimeSeriesBuilderCallbackTest
Running org.apache.qpid.disttest.charting.seriesbuilder.SeriesRowTest
Tests run: 5, Failures: 0, Errors: 0, Skipped: 0, Time elapsed: 0.003 sec - in org.apache.qpid.disttest.charting.seriesbuilder.SeriesRowTest
Running org.apache.qpid.disttest.charting.seriesbuilder.JdbcUrlGeneratorTest
Tests run: 4, Failures: 0, Errors: 0, Skipped: 0, Time elapsed: 0.007 sec - in org.apache.qpid.disttest.charting.seriesbuilder.JdbcUrlGeneratorTest
Running org.apache.qpid.disttest.charting.seriesbuilder.JdbcSeriesBuilderTest
Tests run: 1, Failures: 0, Errors: 0, Skipped: 0, Time elapsed: 0.126 sec - in org.apache.qpid.disttest.charting.seriesbuilder.JdbcSeriesBuilderTest

Results :

Tests run: 39, Failures: 0, Errors: 0, Skipped: 0

[INFO] 
[INFO] --- maven-jar-plugin:2.4:jar (default-jar) @ qpid-perftests-visualisation-jfc ---
[INFO] Building jar: <https://builds.apache.org/job/Qpid-Java-Java-Test-JDK1.8/ws/trunk/perftests/visualisation-jfc/target/qpid-perftests-visualisation-jfc-6.0.0-SNAPSHOT.jar>
[INFO] 
[INFO] --- maven-site-plugin:3.3:attach-descriptor (attach-descriptor) @ qpid-perftests-visualisation-jfc
---
[INFO] 
[INFO] --- maven-assembly-plugin:2.4:single (make-assembly) @ qpid-perftests-visualisation-jfc
---
[INFO] Reading assembly descriptor: src/main/assembly/qpid-perftests-visualisation-jfc-bin.xml
[INFO] Building tar: <https://builds.apache.org/job/Qpid-Java-Java-Test-JDK1.8/ws/trunk/perftests/visualisation-jfc/target/qpid-perftests-visualisation-jfc-6.0.0-SNAPSHOT-bin.tar.gz>
[WARNING] Entry: qpid-perftests-visualisation-jfc/6.0.0-SNAPSHOT/lib/qpid-perftests-visualisation-jfc-6.0.0-SNAPSHOT.jar
longer than 100 characters.
[WARNING] Resulting tar file can only be processed successfully by GNU compatible tar commands
[INFO] 
[INFO] --- maven-antrun-plugin:1.7:run (create-qbtc-output-dir) @ qpid-perftests-visualisation-jfc
---
[INFO] Executing tasks

main:
    [mkdir] Created dir: <https://builds.apache.org/job/Qpid-Java-Java-Test-JDK1.8/ws/trunk/perftests/visualisation-jfc/target/qbtc-test-config>
[INFO] Executed tasks
[INFO]                                                                         
[INFO] ------------------------------------------------------------------------
[INFO] Skipping Qpid BDB Store System Tests
[INFO] This project has been banned from the build due to previous failures.
[INFO] ------------------------------------------------------------------------
[INFO] ------------------------------------------------------------------------
[INFO] Reactor Summary:
[INFO] 
[INFO] Qpid Java Build ................................... SUCCESS [2.832s]
[INFO] Qpid Broker Code Generation ....................... SUCCESS [4.039s]
[INFO] Qpid Test Utilities ............................... SUCCESS [0.809s]
[INFO] Qpid Common ....................................... SUCCESS [22.161s]
[INFO] Qpid Management Common ............................ SUCCESS [1.882s]
[INFO] Qpid Java Broker Core ............................. SUCCESS [1:44.900s]
[INFO] Qpid Access Control Broker Plug-in ................ SUCCESS [4.041s]
[INFO] Qpid AMQP 0-8 Protocol Broker Plug-in ............. SUCCESS [4.510s]
[INFO] Qpid AMQP 0-10 Protocol Plug-in ................... SUCCESS [4.664s]
[INFO] Qpid AMQP 1-0 Protocol Broker Plug-in ............. SUCCESS [6.037s]
[INFO] Qpid AMQP 0-8 to 0-10 Message Conversion Broker Plug-in  SUCCESS [0.362s]
[INFO] Qpid AMQP 0-8 to 1-0 Message Conversion Broker Plug-in  SUCCESS [0.281s]
[INFO] Qpid AMQP 0-10 to 1-0 Message Conversion Broker Plug-in  SUCCESS [0.263s]
[INFO] Qpid Derby Message Store .......................... SUCCESS [15.046s]
[INFO] Qpid JDBC Message Store Connection Pooling Plug-in  SUCCESS [0.476s]
[INFO] Qpid JDBC Message Store Broker Plug-in ............ SUCCESS [8.503s]
[INFO] Qpid HTTP Management Broker Plug-in ............... SUCCESS [5.037s]
[INFO] Qpid JMX Management Broker Plug-in ................ SUCCESS [3.293s]
[INFO] Qpid Memory Message Store Broker Plug-in .......... SUCCESS [0.387s]
[INFO] Qpid WebSocket Broker Plug-in ..................... SUCCESS [0.273s]
[INFO] Qpid AMQP 0-x JMS Client .......................... SUCCESS [8.205s]
[INFO] Qpid BDB Message Store ............................ SUCCESS [5.927s]
[INFO] Qpid BDB Message Store JMX ........................ SUCCESS [2.298s]
[INFO] Qpid Java Broker .................................. SUCCESS [4.231s]
[INFO] Qpid AMQP Management Protocol Broker Plug-in ...... SUCCESS [0.297s]
[INFO] Qpid AMQP 0-x JMS Client Examples ................. SUCCESS [0.153s]
[INFO] Qpid JCA .......................................... SUCCESS [2.009s]
[INFO] Qpid Resource Adaptor ............................. SUCCESS [0.365s]
[INFO] Qpid Tools ........................................ SUCCESS [0.486s]
[INFO] Qpid Management Examples .......................... SUCCESS [0.152s]
[INFO] Qpid Java System Test Parent ...................... SUCCESS [0.657s]
[INFO] Qpid System Tests ................................. FAILURE [16:45.029s]
[INFO] Qpid Performance Tests ............................ SUCCESS [16.092s]
[INFO] Qpid Performance Test System Tests ................ SKIPPED
[INFO] Qpid Performance Tests Visualisation JFC .......... SUCCESS [7.329s]
[INFO] Qpid BDB Store System Tests ....................... SKIPPED
[INFO] ------------------------------------------------------------------------
[INFO] BUILD FAILURE
[INFO] ------------------------------------------------------------------------
[INFO] Total time: 20:43.929s
[INFO] Finished at: Fri Jun 12 04:48:37 UTC 2015
[INFO] Final Memory: 79M/333M
[INFO] ------------------------------------------------------------------------
[ERROR] Failed to execute goal org.apache.maven.plugins:maven-surefire-plugin:2.16:test (integration-test)
on project qpid-systests: There are test failures.
[ERROR] 
[ERROR] Please refer to <https://builds.apache.org/job/Qpid-Java-Java-Test-JDK1.8/ws/trunk/systests/target/surefire-reports>
for the individual test results.
[ERROR] -> [Help 1]
[ERROR] 
[ERROR] To see the full stack trace of the errors, re-run Maven with the -e switch.
[ERROR] Re-run Maven using the -X switch to enable full debug logging.
[ERROR] 
[ERROR] For more information about the errors and possible solutions, please read the following
articles:
[ERROR] [Help 1] http://cwiki.apache.org/confluence/display/MAVEN/MojoFailureException
[ERROR] 
[ERROR] After correcting the problems, you can resume the build with the command
[ERROR]   mvn <goals> -rf :qpid-systests
Build step 'Invoke top-level Maven targets' marked build as failure
[locks-and-latches] Releasing all the locks
[locks-and-latches] All the locks released
Archiving artifacts
Sending artifact delta relative to Qpid-Java-Java-Test-JDK1.8 #1116
Archived 2269 artifacts
Archive block size is 32768
Received 458 blocks and 306902772 bytes
Compression is 4.7%
Took 2 min 21 sec
Recording test results

Mime
View raw message