qpid-notifications mailing list archives

Site index · List index
Message view « Date » · « Thread »
Top « Date » · « Thread »
From Apache Jenkins Server <jenk...@builds.apache.org>
Subject Build failed in Jenkins: Qpid-Java-Java-Test-IBMJDK1.7 #1106
Date Wed, 10 Jun 2015 02:40:56 GMT
See <https://builds.apache.org/job/Qpid-Java-Java-Test-IBMJDK1.7/1106/changes>

Changes:

[kwall] QPID-6533: [Java Broker/Client] Remove dead log4j and temporarily added logback configuration
files.

[kwall] QPID-6533: [Java Broker] Remove remaining log4j configuration options and remaining
log4j test support

[orudyy] QPID-6578: [Java Broker] Add the ability for logging filters to be added/removed/changed
dynamically

[rgodfrey] QPID-6576 : Fix 0-9-1 implementation to recturn the encrypted message when it cannot
be decrypted

------------------------------------------
[...truncated 8231 lines...]
22514/23064 KB   
22518/23064 KB   
22522/23064 KB   
22526/23064 KB   
22530/23064 KB   
22534/23064 KB   
22538/23064 KB   
22542/23064 KB   
22546/23064 KB   
22550/23064 KB   
22554/23064 KB   
22558/23064 KB   
22562/23064 KB   
22566/23064 KB   
22570/23064 KB   
22574/23064 KB   
22578/23064 KB   
22582/23064 KB   
22586/23064 KB   
22590/23064 KB   
22592/23064 KB   
22594/23064 KB   
22598/23064 KB   
22602/23064 KB   
22606/23064 KB   
22610/23064 KB   
22614/23064 KB   
22618/23064 KB   
22622/23064 KB   
22624/23064 KB   
22626/23064 KB   
22630/23064 KB   
22634/23064 KB   
22638/23064 KB   
22642/23064 KB   
22646/23064 KB   
22650/23064 KB   
22654/23064 KB   
22658/23064 KB   
22662/23064 KB   
22666/23064 KB   
22670/23064 KB   
22674/23064 KB   
22678/23064 KB   
22682/23064 KB   
22686/23064 KB   
22690/23064 KB   
22694/23064 KB   
22698/23064 KB   
22702/23064 KB   
22706/23064 KB   
22710/23064 KB   
22714/23064 KB   
22718/23064 KB   
22722/23064 KB   
22726/23064 KB   
22730/23064 KB   
22734/23064 KB   
22738/23064 KB   
22742/23064 KB   
22746/23064 KB   
22750/23064 KB   
22754/23064 KB   
22758/23064 KB   
22762/23064 KB   
22766/23064 KB   
22770/23064 KB   
22774/23064 KB   
22778/23064 KB   
22782/23064 KB   
22786/23064 KB   
22790/23064 KB   
22794/23064 KB   
22798/23064 KB   
22802/23064 KB   
22806/23064 KB   
22810/23064 KB   
22814/23064 KB   
22818/23064 KB   
22822/23064 KB   
22826/23064 KB   
22830/23064 KB   
22834/23064 KB   
22838/23064 KB   
22842/23064 KB   
22846/23064 KB   
22850/23064 KB   
22854/23064 KB   
22858/23064 KB   
22862/23064 KB   
22866/23064 KB   
22870/23064 KB   
22874/23064 KB   
22878/23064 KB   
22882/23064 KB   
22886/23064 KB   
22890/23064 KB   
22894/23064 KB   
22898/23064 KB   
22902/23064 KB   
22906/23064 KB   
22910/23064 KB   
22914/23064 KB   
22918/23064 KB   
22922/23064 KB   
22926/23064 KB   
22930/23064 KB   
22934/23064 KB   
22938/23064 KB   
22942/23064 KB   
22944/23064 KB   
22946/23064 KB   
22950/23064 KB   
22954/23064 KB   
22958/23064 KB   
22962/23064 KB   
22966/23064 KB   
22970/23064 KB   
22974/23064 KB   
22976/23064 KB   
22978/23064 KB   
22982/23064 KB   
22986/23064 KB   
22990/23064 KB   
22994/23064 KB   
22998/23064 KB   
23002/23064 KB   
23006/23064 KB   
23010/23064 KB   
23014/23064 KB   
23018/23064 KB   
23022/23064 KB   
23026/23064 KB   
23030/23064 KB   
23034/23064 KB   
23038/23064 KB   
23042/23064 KB   
23046/23064 KB   
23050/23064 KB   
23054/23064 KB   
23058/23064 KB   
23062/23064 KB   
23064/23064 KB   
                 
Downloaded: http://repository.apache.org/snapshots/org/apache/qpid/qpid-broker/6.0.0-SNAPSHOT/qpid-broker-6.0.0-20150609.232905-56-bin.tar.gz
(23064 KB at 14996.0 KB/sec)
[INFO] Unpacking /home/jenkins/.m2/repository/org/apache/qpid/qpid-broker/6.0.0-SNAPSHOT/qpid-broker-6.0.0-SNAPSHOT-bin.tar.gz
to <https://builds.apache.org/job/Qpid-Java-Java-Test-IBMJDK1.7/ws/qpid-systests-parent/target>
with includes "" and excludes ""
[INFO] Expanding: /home/jenkins/.m2/repository/org/apache/qpid/qpid-broker/6.0.0-SNAPSHOT/qpid-broker-6.0.0-SNAPSHOT-bin.tar.gz
into <https://builds.apache.org/job/Qpid-Java-Java-Test-IBMJDK1.7/ws/qpid-systests-parent/target>
[INFO] 
[INFO] --- maven-dependency-plugin:2.8:copy (copy-sleepycat-jar-for-bdb-tests) @ qpid-systests-parent
---
[INFO] Configured Artifact: com.sleepycat:je:5.0.104:jar
[INFO] Copying je-5.0.104.jar to <https://builds.apache.org/job/Qpid-Java-Java-Test-IBMJDK1.7/ws/qpid-systests-parent/target/qpid-broker/6.0.0-SNAPSHOT/lib/je-5.0.104.jar>
[INFO] 
[INFO] --- maven-surefire-plugin:2.16:test (integration-test) @ qpid-systests-parent ---
[INFO] No tests to run.
[INFO]                                                                         
[INFO] ------------------------------------------------------------------------
[INFO] Skipping Qpid System Tests
[INFO] This project has been banned from the build due to previous failures.
[INFO] ------------------------------------------------------------------------
[INFO]                                                                         
[INFO] ------------------------------------------------------------------------
[INFO] Skipping Qpid Performance Tests
[INFO] This project has been banned from the build due to previous failures.
[INFO] ------------------------------------------------------------------------
[INFO]                                                                         
[INFO] ------------------------------------------------------------------------
[INFO] Skipping Qpid Performance Test System Tests
[INFO] This project has been banned from the build due to previous failures.
[INFO] ------------------------------------------------------------------------
[INFO]                                                                         
[INFO] ------------------------------------------------------------------------
[INFO] Skipping Qpid Performance Tests Visualisation JFC
[INFO] This project has been banned from the build due to previous failures.
[INFO] ------------------------------------------------------------------------
[INFO]                                                                         
[INFO] ------------------------------------------------------------------------
[INFO] Skipping Qpid BDB Store System Tests
[INFO] This project has been banned from the build due to previous failures.
[INFO] ------------------------------------------------------------------------
[INFO] ------------------------------------------------------------------------
[INFO] Reactor Summary:
[INFO] 
[INFO] Qpid Java Build ................................... SUCCESS [2.617s]
[INFO] Qpid Broker Code Generation ....................... SUCCESS [1.866s]
[INFO] Qpid Test Utilities ............................... SUCCESS [0.918s]
[INFO] Qpid Common ....................................... SUCCESS [6:22.470s]
[INFO] Qpid Management Common ............................ SUCCESS [1.873s]
[INFO] Qpid Java Broker Core ............................. SUCCESS [1:42.590s]
[INFO] Qpid Access Control Broker Plug-in ................ SUCCESS [4.755s]
[INFO] Qpid AMQP 0-8 Protocol Broker Plug-in ............. SUCCESS [4.668s]
[INFO] Qpid AMQP 0-10 Protocol Plug-in ................... SUCCESS [4.810s]
[INFO] Qpid AMQP 1-0 Protocol Broker Plug-in ............. SUCCESS [2.641s]
[INFO] Qpid AMQP 0-8 to 0-10 Message Conversion Broker Plug-in  SUCCESS [0.475s]
[INFO] Qpid AMQP 0-8 to 1-0 Message Conversion Broker Plug-in  SUCCESS [0.373s]
[INFO] Qpid AMQP 0-10 to 1-0 Message Conversion Broker Plug-in  SUCCESS [0.363s]
[INFO] Qpid Derby Message Store .......................... SUCCESS [16.555s]
[INFO] Qpid JDBC Message Store Connection Pooling Plug-in  SUCCESS [0.497s]
[INFO] Qpid JDBC Message Store Broker Plug-in ............ SUCCESS [10.327s]
[INFO] Qpid HTTP Management Broker Plug-in ............... SUCCESS [6.800s]
[INFO] Qpid JMX Management Broker Plug-in ................ SUCCESS [4.191s]
[INFO] Qpid Memory Message Store Broker Plug-in .......... SUCCESS [0.549s]
[INFO] Qpid WebSocket Broker Plug-in ..................... SUCCESS [0.394s]
[INFO] Qpid AMQP 0-x JMS Client .......................... FAILURE [8.440s]
[INFO] Qpid BDB Message Store ............................ SKIPPED
[INFO] Qpid BDB Message Store JMX ........................ SKIPPED
[INFO] Qpid Java Broker .................................. SKIPPED
[INFO] Qpid AMQP Management Protocol Broker Plug-in ...... SUCCESS [0.603s]
[INFO] Qpid AMQP 0-x JMS Client Examples ................. SKIPPED
[INFO] Qpid JCA .......................................... SKIPPED
[INFO] Qpid Resource Adaptor ............................. SKIPPED
[INFO] Qpid Tools ........................................ SKIPPED
[INFO] Qpid Management Examples .......................... SUCCESS [0.250s]
[INFO] Qpid Java System Test Parent ...................... SUCCESS [3.108s]
[INFO] Qpid System Tests ................................. SKIPPED
[INFO] Qpid Performance Tests ............................ SKIPPED
[INFO] Qpid Performance Test System Tests ................ SKIPPED
[INFO] Qpid Performance Tests Visualisation JFC .......... SKIPPED
[INFO] Qpid BDB Store System Tests ....................... SKIPPED
[INFO] ------------------------------------------------------------------------
[INFO] BUILD FAILURE
[INFO] ------------------------------------------------------------------------
[INFO] Total time: 9:23.270s
[INFO] Finished at: Wed Jun 10 02:39:40 UTC 2015
[INFO] Final Memory: 79M/211M
[INFO] ------------------------------------------------------------------------
[ERROR] Failed to execute goal org.apache.maven.plugins:maven-surefire-plugin:2.16:test (default-test)
on project qpid-client: There are test failures.
[ERROR] 
[ERROR] Please refer to <https://builds.apache.org/job/Qpid-Java-Java-Test-IBMJDK1.7/ws/client/target/surefire-reports>
for the individual test results.
[ERROR] -> [Help 1]
[ERROR] 
[ERROR] To see the full stack trace of the errors, re-run Maven with the -e switch.
[ERROR] Re-run Maven using the -X switch to enable full debug logging.
[ERROR] 
[ERROR] For more information about the errors and possible solutions, please read the following
articles:
[ERROR] [Help 1] http://cwiki.apache.org/confluence/display/MAVEN/MojoFailureException
[ERROR] 
[ERROR] After correcting the problems, you can resume the build with the command
[ERROR]   mvn <goals> -rf :qpid-client
Build step 'Invoke top-level Maven targets' marked build as failure
[locks-and-latches] Releasing all the locks
[locks-and-latches] All the locks released
Archiving artifacts
Sending artifact delta relative to Qpid-Java-Java-Test-IBMJDK1.7 #1103
Archived 2237 artifacts
Archive block size is 32768
Received 9705 blocks and 3756893 bytes
Compression is 98.8%
Took 1 min 9 sec
Recording test results

Mime
View raw message