qpid-notifications mailing list archives

Site index · List index
Message view « Date » · « Thread »
Top « Date » · « Thread »
From Apache Jenkins Server <jenk...@builds.apache.org>
Subject Build failed in Jenkins: Qpid-Java-Java-Test-IBMJDK1.7 #1105
Date Tue, 09 Jun 2015 02:41:14 GMT
See <https://builds.apache.org/job/Qpid-Java-Java-Test-IBMJDK1.7/1105/changes>

Changes:

[rgodfrey] QPID-6576 : Fix unit client unit tests to locate keystore

[kwall] QPID-6575 : [Java Broker Documentation]  Document consumer.suspendNotificationPeriod
context var

------------------------------------------
[...truncated 8215 lines...]
22496/23060 KB   
22500/23060 KB   
22504/23060 KB   
22508/23060 KB   
22512/23060 KB   
22516/23060 KB   
22520/23060 KB   
22524/23060 KB   
22528/23060 KB   
22532/23060 KB   
22536/23060 KB   
22540/23060 KB   
22544/23060 KB   
22548/23060 KB   
22552/23060 KB   
22556/23060 KB   
22560/23060 KB   
22564/23060 KB   
22568/23060 KB   
22572/23060 KB   
22576/23060 KB   
22580/23060 KB   
22584/23060 KB   
22588/23060 KB   
22592/23060 KB   
22596/23060 KB   
22600/23060 KB   
22604/23060 KB   
22608/23060 KB   
22612/23060 KB   
22616/23060 KB   
22620/23060 KB   
22624/23060 KB   
22628/23060 KB   
22632/23060 KB   
22636/23060 KB   
22640/23060 KB   
22644/23060 KB   
22648/23060 KB   
22652/23060 KB   
22656/23060 KB   
22660/23060 KB   
22664/23060 KB   
22668/23060 KB   
22672/23060 KB   
22676/23060 KB   
22680/23060 KB   
22684/23060 KB   
22688/23060 KB   
22692/23060 KB   
22696/23060 KB   
22700/23060 KB   
22704/23060 KB   
22708/23060 KB   
22712/23060 KB   
22716/23060 KB   
22720/23060 KB   
22724/23060 KB   
22728/23060 KB   
22732/23060 KB   
22736/23060 KB   
22740/23060 KB   
22744/23060 KB   
22748/23060 KB   
22752/23060 KB   
22756/23060 KB   
22760/23060 KB   
22764/23060 KB   
22768/23060 KB   
22772/23060 KB   
22776/23060 KB   
22780/23060 KB   
22784/23060 KB   
22788/23060 KB   
22792/23060 KB   
22796/23060 KB   
22800/23060 KB   
22804/23060 KB   
22808/23060 KB   
22812/23060 KB   
22816/23060 KB   
22820/23060 KB   
22824/23060 KB   
22828/23060 KB   
22832/23060 KB   
22836/23060 KB   
22840/23060 KB   
22844/23060 KB   
22848/23060 KB   
22852/23060 KB   
22856/23060 KB   
22860/23060 KB   
22864/23060 KB   
22868/23060 KB   
22872/23060 KB   
22876/23060 KB   
22880/23060 KB   
22884/23060 KB   
22888/23060 KB   
22892/23060 KB   
22896/23060 KB   
22900/23060 KB   
22904/23060 KB   
22908/23060 KB   
22912/23060 KB   
22916/23060 KB   
22920/23060 KB   
22924/23060 KB   
22928/23060 KB   
22932/23060 KB   
22936/23060 KB   
22940/23060 KB   
22944/23060 KB   
22948/23060 KB   
22952/23060 KB   
22956/23060 KB   
22960/23060 KB   
22964/23060 KB   
22968/23060 KB   
22972/23060 KB   
22976/23060 KB   
22980/23060 KB   
22984/23060 KB   
22988/23060 KB   
22992/23060 KB   
22996/23060 KB   
23000/23060 KB   
23004/23060 KB   
23008/23060 KB   
23012/23060 KB   
23016/23060 KB   
23020/23060 KB   
23024/23060 KB   
23028/23060 KB   
23032/23060 KB   
23036/23060 KB   
23040/23060 KB   
23044/23060 KB   
23048/23060 KB   
23052/23060 KB   
23056/23060 KB   
23060/23060 KB   
23060/23060 KB   
                 
Downloaded: http://repository.apache.org/snapshots/org/apache/qpid/qpid-broker/6.0.0-SNAPSHOT/qpid-broker-6.0.0-20150608.232922-55-bin.tar.gz
(23060 KB at 18374.1 KB/sec)
[INFO] Unpacking /home/jenkins/.m2/repository/org/apache/qpid/qpid-broker/6.0.0-SNAPSHOT/qpid-broker-6.0.0-SNAPSHOT-bin.tar.gz
to <https://builds.apache.org/job/Qpid-Java-Java-Test-IBMJDK1.7/ws/qpid-systests-parent/target>
with includes "" and excludes ""
[INFO] Expanding: /home/jenkins/.m2/repository/org/apache/qpid/qpid-broker/6.0.0-SNAPSHOT/qpid-broker-6.0.0-SNAPSHOT-bin.tar.gz
into <https://builds.apache.org/job/Qpid-Java-Java-Test-IBMJDK1.7/ws/qpid-systests-parent/target>
[INFO] 
[INFO] --- maven-dependency-plugin:2.8:copy (copy-sleepycat-jar-for-bdb-tests) @ qpid-systests-parent
---
[INFO] Configured Artifact: com.sleepycat:je:5.0.104:jar
[INFO] Copying je-5.0.104.jar to <https://builds.apache.org/job/Qpid-Java-Java-Test-IBMJDK1.7/ws/qpid-systests-parent/target/qpid-broker/6.0.0-SNAPSHOT/lib/je-5.0.104.jar>
[INFO] 
[INFO] --- maven-surefire-plugin:2.16:test (integration-test) @ qpid-systests-parent ---
[INFO] No tests to run.
[INFO]                                                                         
[INFO] ------------------------------------------------------------------------
[INFO] Skipping Qpid System Tests
[INFO] This project has been banned from the build due to previous failures.
[INFO] ------------------------------------------------------------------------
[INFO]                                                                         
[INFO] ------------------------------------------------------------------------
[INFO] Skipping Qpid Performance Tests
[INFO] This project has been banned from the build due to previous failures.
[INFO] ------------------------------------------------------------------------
[INFO]                                                                         
[INFO] ------------------------------------------------------------------------
[INFO] Skipping Qpid Performance Test System Tests
[INFO] This project has been banned from the build due to previous failures.
[INFO] ------------------------------------------------------------------------
[INFO]                                                                         
[INFO] ------------------------------------------------------------------------
[INFO] Skipping Qpid Performance Tests Visualisation JFC
[INFO] This project has been banned from the build due to previous failures.
[INFO] ------------------------------------------------------------------------
[INFO]                                                                         
[INFO] ------------------------------------------------------------------------
[INFO] Skipping Qpid BDB Store System Tests
[INFO] This project has been banned from the build due to previous failures.
[INFO] ------------------------------------------------------------------------
[INFO] ------------------------------------------------------------------------
[INFO] Reactor Summary:
[INFO] 
[INFO] Qpid Java Build ................................... SUCCESS [3.730s]
[INFO] Qpid Broker Code Generation ....................... SUCCESS [2.100s]
[INFO] Qpid Test Utilities ............................... SUCCESS [0.651s]
[INFO] Qpid Common ....................................... SUCCESS [5:49.858s]
[INFO] Qpid Management Common ............................ SUCCESS [1.961s]
[INFO] Qpid Java Broker Core ............................. SUCCESS [1:48.035s]
[INFO] Qpid Access Control Broker Plug-in ................ SUCCESS [4.886s]
[INFO] Qpid AMQP 0-8 Protocol Broker Plug-in ............. SUCCESS [4.748s]
[INFO] Qpid AMQP 0-10 Protocol Plug-in ................... SUCCESS [5.319s]
[INFO] Qpid AMQP 1-0 Protocol Broker Plug-in ............. SUCCESS [3.090s]
[INFO] Qpid AMQP 0-8 to 0-10 Message Conversion Broker Plug-in  SUCCESS [0.573s]
[INFO] Qpid AMQP 0-8 to 1-0 Message Conversion Broker Plug-in  SUCCESS [0.473s]
[INFO] Qpid AMQP 0-10 to 1-0 Message Conversion Broker Plug-in  SUCCESS [0.438s]
[INFO] Qpid Derby Message Store .......................... SUCCESS [17.360s]
[INFO] Qpid JDBC Message Store Connection Pooling Plug-in  SUCCESS [0.520s]
[INFO] Qpid JDBC Message Store Broker Plug-in ............ SUCCESS [10.132s]
[INFO] Qpid HTTP Management Broker Plug-in ............... SUCCESS [7.128s]
[INFO] Qpid JMX Management Broker Plug-in ................ SUCCESS [4.544s]
[INFO] Qpid Memory Message Store Broker Plug-in .......... SUCCESS [0.671s]
[INFO] Qpid WebSocket Broker Plug-in ..................... SUCCESS [0.520s]
[INFO] Qpid AMQP 0-x JMS Client .......................... FAILURE [9.065s]
[INFO] Qpid BDB Message Store ............................ SKIPPED
[INFO] Qpid BDB Message Store JMX ........................ SKIPPED
[INFO] Qpid Java Broker .................................. SKIPPED
[INFO] Qpid AMQP Management Protocol Broker Plug-in ...... SUCCESS [0.439s]
[INFO] Qpid AMQP 0-x JMS Client Examples ................. SKIPPED
[INFO] Qpid JCA .......................................... SKIPPED
[INFO] Qpid Resource Adaptor ............................. SKIPPED
[INFO] Qpid Tools ........................................ SKIPPED
[INFO] Qpid Management Examples .......................... SUCCESS [0.179s]
[INFO] Qpid Java System Test Parent ...................... SUCCESS [3.363s]
[INFO] Qpid System Tests ................................. SKIPPED
[INFO] Qpid Performance Tests ............................ SKIPPED
[INFO] Qpid Performance Test System Tests ................ SKIPPED
[INFO] Qpid Performance Tests Visualisation JFC .......... SKIPPED
[INFO] Qpid BDB Store System Tests ....................... SKIPPED
[INFO] ------------------------------------------------------------------------
[INFO] BUILD FAILURE
[INFO] ------------------------------------------------------------------------
[INFO] Total time: 9:01.184s
[INFO] Finished at: Tue Jun 09 02:39:19 UTC 2015
[INFO] Final Memory: 80M/203M
[INFO] ------------------------------------------------------------------------
[ERROR] Failed to execute goal org.apache.maven.plugins:maven-surefire-plugin:2.16:test (default-test)
on project qpid-client: There are test failures.
[ERROR] 
[ERROR] Please refer to <https://builds.apache.org/job/Qpid-Java-Java-Test-IBMJDK1.7/ws/client/target/surefire-reports>
for the individual test results.
[ERROR] -> [Help 1]
[ERROR] 
[ERROR] To see the full stack trace of the errors, re-run Maven with the -e switch.
[ERROR] Re-run Maven using the -X switch to enable full debug logging.
[ERROR] 
[ERROR] For more information about the errors and possible solutions, please read the following
articles:
[ERROR] [Help 1] http://cwiki.apache.org/confluence/display/MAVEN/MojoFailureException
[ERROR] 
[ERROR] After correcting the problems, you can resume the build with the command
[ERROR]   mvn <goals> -rf :qpid-client
Build step 'Invoke top-level Maven targets' marked build as failure
[locks-and-latches] Releasing all the locks
[locks-and-latches] All the locks released
Archiving artifacts
Sending artifact delta relative to Qpid-Java-Java-Test-IBMJDK1.7 #1103
Archived 2228 artifacts
Archive block size is 32768
Received 9705 blocks and 3709830 bytes
Compression is 98.8%
Took 1 min 48 sec
Recording test results

Mime
View raw message