qpid-notifications mailing list archives

Site index · List index
Message view « Date » · « Thread »
Top « Date » · « Thread »
From Apache Jenkins Server <jenk...@builds.apache.org>
Subject Build failed in Jenkins: Qpid-proton-c #686
Date Wed, 17 Jun 2015 12:22:33 GMT
See <https://builds.apache.org/job/Qpid-proton-c/686/changes>

Changes:

[kgiusti] PROTON-908: Remove install-runtime dependency on swig

[astitcher] PROTON-909: Rearrange the test code to create the Cyrus SASL configuration

------------------------------------------
[...truncated 669 lines...]
proton_tests.engine.SettlementTest.testUnsettled ........................ pass
proton_tests.engine.TeardownLeakTest.testLeak ........................... pass
proton_tests.engine.TeardownLeakTest.testLocalLeak ...................... pass
proton_tests.engine.TeardownLeakTest.testLocalRemoteLeak ................ pass
proton_tests.engine.TeardownLeakTest.testRemoteLeak ..................... pass
proton_tests.engine.TransferTest.test_cleanup ........................... pass
proton_tests.engine.TransferTest.test_delivery_id_ordering .............. pass
proton_tests.engine.TransferTest.test_disposition ....................... pass
proton_tests.engine.TransferTest.test_multiframe ........................ pass
proton_tests.engine.TransferTest.test_work_queue ........................ pass
proton_tests.interop.InteropTest.test_arrays ............................ pass
proton_tests.interop.InteropTest.test_described ......................... pass
proton_tests.interop.InteropTest.test_described_array ................... pass
proton_tests.interop.InteropTest.test_lists ............................. pass
proton_tests.interop.InteropTest.test_maps .............................. pass
proton_tests.interop.InteropTest.test_message ........................... pass
proton_tests.interop.InteropTest.test_primitives ........................ pass
proton_tests.interop.InteropTest.test_strings ........................... pass
proton_tests.message.AccessorsTest.testAddress .......................... pass
proton_tests.message.AccessorsTest.testContentEncoding .................. pass
proton_tests.message.AccessorsTest.testContentType ...................... pass
proton_tests.message.AccessorsTest.testCorrelationId .................... pass
proton_tests.message.AccessorsTest.testCreationTime ..................... pass
proton_tests.message.AccessorsTest.testDeliveryCount .................... pass
proton_tests.message.AccessorsTest.testDurable .......................... pass
proton_tests.message.AccessorsTest.testExpiryTime ....................... pass
proton_tests.message.AccessorsTest.testFirstAquirer ..................... pass
proton_tests.message.AccessorsTest.testGroupId .......................... pass
proton_tests.message.AccessorsTest.testGroupSequence .................... pass
proton_tests.message.AccessorsTest.testId ............................... pass
proton_tests.message.AccessorsTest.testPriority ......................... pass
proton_tests.message.AccessorsTest.testReplyTo .......................... pass
proton_tests.message.AccessorsTest.testReplyToGroupId ................... pass
proton_tests.message.AccessorsTest.testSubject .......................... pass
proton_tests.message.AccessorsTest.testTtl .............................. pass
proton_tests.message.AccessorsTest.testUserId ........................... pass
proton_tests.message.CodecTest.testRoundTrip ............................ pass
proton_tests.messenger.IdleTimeoutTest.testIdleTimeout .................. pass
proton_tests.messenger.MessengerTest.testBuffered ....................... pass
proton_tests.messenger.MessengerTest.testCreditBlockingRebalance ........ pass
proton_tests.messenger.MessengerTest.testDefaultRewriteH ................ pass
proton_tests.messenger.MessengerTest.testDefaultRewriteHN ............... pass
proton_tests.messenger.MessengerTest.testDefaultRewriteHP ............... pass
proton_tests.messenger.MessengerTest.testDefaultRewriteHPN .............. pass
proton_tests.messenger.MessengerTest.testDefaultRewriteSH ............... pass
proton_tests.messenger.MessengerTest.testDefaultRewriteSHN .............. pass
proton_tests.messenger.MessengerTest.testDefaultRewriteSHP .............. pass
proton_tests.messenger.MessengerTest.testDefaultRewriteSHPN ............. pass
proton_tests.messenger.MessengerTest.testDefaultRewriteSUH .............. pass
proton_tests.messenger.MessengerTest.testDefaultRewriteSUHN ............. pass
proton_tests.messenger.MessengerTest.testDefaultRewriteSUHP ............. pass
proton_tests.messenger.MessengerTest.testDefaultRewriteSUHPN ............ pass
proton_tests.messenger.MessengerTest.testDefaultRewriteSUPH ............. pass
proton_tests.messenger.MessengerTest.testDefaultRewriteSUPHN ............ pass
proton_tests.messenger.MessengerTest.testDefaultRewriteSUPHP ............ pass
proton_tests.messenger.MessengerTest.testDefaultRewriteSUPHPN ........... pass
proton_tests.messenger.MessengerTest.testDefaultRewriteUH ............... pass
proton_tests.messenger.MessengerTest.testDefaultRewriteUHN .............. pass
proton_tests.messenger.MessengerTest.testDefaultRewriteUHP .............. pass
proton_tests.messenger.MessengerTest.testDefaultRewriteUHPN ............. pass
proton_tests.messenger.MessengerTest.testDefaultRewriteUPH .............. pass
proton_tests.messenger.MessengerTest.testDefaultRewriteUPHN ............. pass
proton_tests.messenger.MessengerTest.testDefaultRewriteUPHP ............. pass
proton_tests.messenger.MessengerTest.testDefaultRewriteUPHPN ............ pass
proton_tests.messenger.MessengerTest.testDefaultRoute ................... pass
proton_tests.messenger.MessengerTest.testDefaultRouteSubstitution ....... pass
proton_tests.messenger.MessengerTest. \
    testIncomingQueueBiggerThanSessionWindow ............................ pass
proton_tests.messenger.MessengerTest.testIncomingQueueBiggerThanWindow .. pass
proton_tests.messenger.MessengerTest.testIncomingRoute .................. pass
proton_tests.messenger.MessengerTest.testIncomingWindow ................. pass
proton_tests.messenger.MessengerTest.testOutgoingWindow ................. pass
proton_tests.messenger.MessengerTest.testReject ......................... pass
proton_tests.messenger.MessengerTest.testRejectIndividual ............... pass
proton_tests.messenger.MessengerTest.testRewrite ........................ pass
proton_tests.messenger.MessengerTest.testRewriteOverrideDefault ......... pass
proton_tests.messenger.MessengerTest.testRewritePattern ................. pass
proton_tests.messenger.MessengerTest.testRewriteSupress ................. pass
proton_tests.messenger.MessengerTest.testRewriteToAt .................... pass
proton_tests.messenger.MessengerTest.testRoute .......................... pass
proton_tests.messenger.MessengerTest.testSendReceive .................... pass
proton_tests.messenger.MessengerTest.testSendReceive100K ................ pass
proton_tests.messenger.MessengerTest.testSendReceive10K ................. pass
proton_tests.messenger.MessengerTest.testSendReceive1K .................. pass
proton_tests.messenger.MessengerTest.testSendReceive1M .................. pass
proton_tests.messenger.MessengerTest.testSendReceive2K .................. pass
proton_tests.messenger.MessengerTest.testSendReceive4K .................. pass
proton_tests.messenger.MessengerTest.testSendReceiveLargeAddress ........ pass
proton_tests.messenger.MessengerTest.testUnlimitedCredit ................ pass
proton_tests.messenger.MessengerTest.test_proton222 ..................... pass
proton_tests.messenger.NBMessengerTest.testCreditAutoBackpressure ....... pass
proton_tests.messenger.NBMessengerTest.testCreditReclaim ................ pass
proton_tests.messenger.NBMessengerTest.testCreditRedistribution ......... pass
proton_tests.messenger.NBMessengerTest.testCreditReplenish .............. pass
proton_tests.messenger.NBMessengerTest.testPushback ..................... pass
proton_tests.messenger.NBMessengerTest.testRecvBeforeSubscribe .......... pass
proton_tests.messenger.NBMessengerTest.testSmoke ........................ pass
proton_tests.messenger.NBMessengerTest.testSmoke1024 .................... pass
proton_tests.messenger.NBMessengerTest.testSmoke4096 .................... pass
proton_tests.messenger.SelectableMessengerTest.testSelectable ........... pass
proton_tests.messenger.SelectableMessengerTest.testSelectable1024 ....... pass
proton_tests.messenger.SelectableMessengerTest.testSelectable16 ......... pass
proton_tests.messenger.SelectableMessengerTest.testSelectable4096 ....... pass
proton_tests.reactor.ExceptionTest.test_connection ...................... pass
proton_tests.reactor.ExceptionTest.test_connection_add .................. pass
proton_tests.reactor.ExceptionTest.test_connection_set .................. pass
proton_tests.reactor.ExceptionTest.test_global_add ...................... pass
proton_tests.reactor.ExceptionTest.test_global_set ...................... pass
proton_tests.reactor.ExceptionTest.test_link_add ........................ pass
proton_tests.reactor.ExceptionTest.test_link_set ........................ pass
proton_tests.reactor.ExceptionTest.test_reactor_add ..................... pass
proton_tests.reactor.ExceptionTest.test_reactor_final ................... pass
proton_tests.reactor.ExceptionTest.test_reactor_set ..................... pass
proton_tests.reactor.ExceptionTest.test_schedule ........................ pass
proton_tests.reactor.ExceptionTest.test_session_add ..................... pass
proton_tests.reactor.ExceptionTest.test_session_set ..................... pass
proton_tests.sasl.CyrusSASLTest.testMechANON ............................[0x19bcf30]:Authenticated
user: anonymous with mechanism ANONYMOUS
 pass
proton_tests.sasl.CyrusSASLTest.testMechCRAMMD5 .........................[0x19ce520]:Authenticated
user: user@proton with mechanism CRAM-MD5
 pass
proton_tests.sasl.CyrusSASLTest.testMechDIGESTMD5 .......................[0x19c9430]:Authenticated
user: user@proton with mechanism DIGEST-MD5
 pass
proton_tests.sasl.SSLSASLTest.testSSLExternalSimple .....................[0x19ce730]:Authenticated
user: O=Client,CN=127.0.0.1 with mechanism EXTERNAL
 pass
proton_tests.sasl.SSLSASLTest.testSSLExternalSimpleFail ................. pass
proton_tests.sasl.SSLSASLTest.testSSLPlainSimple ........................[0x1f93800]:Authenticated
user: user@proton with mechanism PLAIN
 pass
proton_tests.sasl.SSLSASLTest.testSSLPlainSimpleFail ....................[0x1f846b0]:sasl
error: SASL(-13): user not found: Password verification failed
 pass
proton_tests.sasl.SaslTest.testFracturedSASL ............................ pass
proton_tests.sasl.SaslTest.testMechNotFound .............................[0x19c78f0]:sasl
error: SASL(-4): no mechanism available: 
 pass
proton_tests.sasl.SaslTest.testPipelined2 ............................... pass
proton_tests.sasl.SaslTest.testPipelinedClient ..........................[0x19cf6d0]:Authenticated
user: anonymous with mechanism ANONYMOUS
 pass
proton_tests.sasl.SaslTest.testPipelinedClientFail ......................[0x18b3f50]:sasl
error: SASL(-1): generic failure: Client mechanism not in mechanism inclusion list.
 pass
proton_tests.sasl.SaslTest.testSaslAndAmqpInSingleChunk .................[0x51d87f0]:Authenticated
user: anonymous with mechanism ANONYMOUS
 pass
proton_tests.sasl.SaslTest.testSaslSkipped .............................. pass
proton_tests.sasl.SaslTest.testSaslSkippedFail .......................... pass
proton_tests.sasl.SaslTest.test_singleton ............................... pass
proton_tests.soak.MessengerTests.test_echo_C ............................ pass
proton_tests.soak.MessengerTests.test_echo_C_Python ..................... pass
proton_tests.soak.MessengerTests.test_echo_C_SSL ........................ pass
proton_tests.soak.MessengerTests.test_echo_Python ....................... pass
proton_tests.soak.MessengerTests.test_echo_Python_C ..................... pass
proton_tests.soak.MessengerTests.test_echo_valgrind ..................... skip
  Skipped: Skipping test - $VALGRIND not set.
proton_tests.soak.MessengerTests.test_oneway_C .......................... pass
proton_tests.soak.MessengerTests.test_oneway_C_Python ................... pass
proton_tests.soak.MessengerTests.test_oneway_C_SSL ...................... pass
proton_tests.soak.MessengerTests.test_oneway_Python ..................... pass
proton_tests.soak.MessengerTests.test_oneway_Python_C ................... pass
proton_tests.soak.MessengerTests.test_oneway_reactor .................... pass
proton_tests.soak.MessengerTests.test_oneway_reactor_valgrind ........... skip
  Skipped: Skipping test - $VALGRIND not set.
proton_tests.soak.MessengerTests.test_oneway_valgrind ................... skip
  Skipped: Skipping test - $VALGRIND not set.
proton_tests.soak.MessengerTests.test_relay_C ........................... pass
proton_tests.soak.MessengerTests.test_relay_C_Python .................... pass
proton_tests.soak.MessengerTests.test_relay_C_SSL ....................... pass
proton_tests.soak.MessengerTests.test_relay_Python ...................... pass
proton_tests.soak.MessengerTests.test_relay_valgrind .................... skip
  Skipped: Skipping test - $VALGRIND not set.
proton_tests.soak.MessengerTests.test_star_topology_C ................... pass
proton_tests.soak.MessengerTests.test_star_topology_C_Python ............ pass
proton_tests.soak.MessengerTests.test_star_topology_C_SSL ............... pass
proton_tests.soak.MessengerTests.test_star_topology_Python .............. fail
Error during test:  Traceback (most recent call last):
    File "../tests/python/proton-test", line 355, in run
      phase()
    File "/x1/jenkins/jenkins-slave/workspace/Qpid-proton-c/tests/python/proton_tests/soak.py",
line 352, in test_star_topology_Python
      self._do_star_topology_test( MessengerReceiverPython, MessengerSenderPython )
    File "/x1/jenkins/jenkins-slave/workspace/Qpid-proton-c/tests/python/proton_tests/soak.py",
line 281, in _do_star_topology_test
      self._do_test(iterations)
    File "/x1/jenkins/jenkins-slave/workspace/Qpid-proton-c/tests/python/proton_tests/soak.py",
line 103, in _do_test
      S.stderr()))
  AssertionError: Command '['msgr-send.py', '-a', 'amqp://0.0.0.0:51734/0,amqp://0.0.0.0:51734/1,amqp://0.0.0.0:51734/2,amqp://0.0.0.0:51734/3,amqp://0.0.0.0:51734/4,amqp://0.0.0.0:61730/0,amqp://0.0.0.0:61730/1,amqp://0.0.0.0:61730/2,amqp://0.0.0.0:61730/3,amqp://0.0.0.0:61730/4,amqp://0.0.0.0:62355/0,amqp://0.0.0.0:62355/1,amqp://0.0.0.0:62355/2,amqp://0.0.0.0:62355/3,amqp://0.0.0.0:62355/4',
'-c', '255', '-p', '7', '-R', '-t', '60']' failed status=1: 'Traceback (most recent call last):
    File "/x1/jenkins/jenkins-slave/workspace/Qpid-proton-c/tests/tools/apps/python/msgr-send.py",
line 199, in <module>
      sys.exit(main())
    File "/x1/jenkins/jenkins-slave/workspace/Qpid-proton-c/tests/tools/apps/python/msgr-send.py",
line 174, in main
      stats, opts.recv_count, log )
    File "/x1/jenkins/jenkins-slave/workspace/Qpid-proton-c/tests/tools/apps/python/msgr-send.py",
line 106, in process_replies
      messenger.recv( max_count )
    File "/x1/jenkins/jenkins-slave/workspace/Qpid-proton-c/proton-c/bindings/python/proton/__init__.py",
line 565, in recv
      self._check(pn_messenger_recv(self._mng, n))
    File "/x1/jenkins/jenkins-slave/workspace/Qpid-proton-c/proton-c/bindings/python/proton/__init__.py",
line 283, in _check
      raise exc("[%s]: %s" % (err, pn_error_text(pn_messenger_error(self._mng))))
  proton.Timeout: [-7]: None
  ' '*** NO STDERR ***'
proton_tests.soak.MessengerTests.test_star_topology_Python_C ............ pass
proton_tests.soak.MessengerTests.test_star_topology_valgrind ............ skip
  Skipped: Skipping test - $VALGRIND not set.
proton_tests.ssl.MessengerSSLTests.test_client_credentials .............. pass
proton_tests.ssl.MessengerSSLTests.test_client_credentials_bad_cert ..... pass
proton_tests.ssl.MessengerSSLTests.test_client_credentials_bad_password . pass
proton_tests.ssl.MessengerSSLTests.test_client_credentials_bad_trusted .. pass
proton_tests.ssl.MessengerSSLTests.test_client_credentials_untrusted .... pass
proton_tests.ssl.MessengerSSLTests.test_server_credentials .............. pass
proton_tests.ssl.MessengerSSLTests.test_server_credentials_bad_cert ..... pass
proton_tests.ssl.MessengerSSLTests.test_server_credentials_bad_key ...... pass
proton_tests.ssl.MessengerSSLTests.test_server_credentials_bad_password . pass
proton_tests.ssl.SslTest. \
    test_allow_unsecured_client_which_connects_secured .................. pass
proton_tests.ssl.SslTest. \
    test_allow_unsecured_client_which_connects_unsecured ................ pass
proton_tests.ssl.SslTest.test_bad_server_certificate .................... pass
proton_tests.ssl.SslTest.test_client_authentication ..................... pass
proton_tests.ssl.SslTest.test_client_authentication_fail_bad_cert ....... pass
proton_tests.ssl.SslTest.test_client_authentication_fail_no_cert ........ pass
proton_tests.ssl.SslTest.test_client_server_authentication .............. pass
proton_tests.ssl.SslTest.test_defaults .................................. pass
proton_tests.ssl.SslTest.test_defaults_messenger_app .................... pass
proton_tests.ssl.SslTest.test_disallow_unsecured_client ................. pass
proton_tests.ssl.SslTest.test_multiple_sessions ......................... pass
proton_tests.ssl.SslTest.test_server_authentication ..................... pass
proton_tests.ssl.SslTest.test_server_authentication_messenger_app ....... pass
proton_tests.ssl.SslTest.test_server_certificate ........................ pass
proton_tests.ssl.SslTest.test_server_hostname_authentication ............ pass
proton_tests.ssl.SslTest.test_server_only_authentication ................ pass
proton_tests.ssl.SslTest.test_session_resume ............................ pass
proton_tests.ssl.SslTest.test_singleton ................................. pass
proton_tests.ssl.SslTest.test_ssl_with_small_buffer ..................... pass
proton_tests.transport.LogTest.testTracer ............................... pass
proton_tests.transport.TransportTest.testBigGarbage ..................... pass
proton_tests.transport.TransportTest.testBindAfterOpen .................. pass
proton_tests.transport.TransportTest.testCloseHead ...................... pass
proton_tests.transport.TransportTest.testCloseTail ...................... pass
proton_tests.transport.TransportTest.testEOS ............................ pass
proton_tests.transport.TransportTest.testEOSAfterSASL ...................[0x19cde70]:Authenticated
user: anonymous with mechanism ANONYMOUS
 pass
proton_tests.transport.TransportTest.testGarbage ........................ pass
proton_tests.transport.TransportTest.testHeader ......................... pass
proton_tests.transport.TransportTest.testPartial ........................ pass
proton_tests.transport.TransportTest.testPeek ........................... pass
proton_tests.transport.TransportTest.testSmallGarbage ................... pass
proton_tests.transport.TransportTest.testUnpairedPop .................... pass
proton_tests.url.UrlTest.testAmqps ...................................... pass
proton_tests.url.UrlTest.testArgs ....................................... pass
proton_tests.url.UrlTest.testDefaults ................................... pass
proton_tests.url.UrlTest.testEqual ...................................... pass
proton_tests.url.UrlTest.testMissing .................................... pass
proton_tests.url.UrlTest.testPort ....................................... pass
proton_tests.url.UrlTest.testUrl ........................................ pass
proton_tests.utils.SyncRequestResponseTest.test_request_response ........ pass
Totals: 337 tests, 331 passed, 5 skipped, 0 ignored, 1 failed
Build step 'Execute shell' marked build as failure
Recording test results

Mime
View raw message