qpid-notifications mailing list archives

Site index · List index
Message view « Date » · « Thread »
Top « Date » · « Thread »
From Apache Jenkins Server <jenk...@builds.apache.org>
Subject Build failed in Jenkins: Qpid-Java-Java-Test-IBMJDK1.7 #1072
Date Thu, 07 May 2015 02:33:56 GMT
See <https://builds.apache.org/job/Qpid-Java-Java-Test-IBMJDK1.7/1072/changes>

Changes:

[rgodfrey] QPID-6533 : Store logging configuration within the broker config

[rgodfrey] QPID-6530 : : [Java Broker] Enable connection close from the Web Management UI
(applied patch by Lorenz Quack)

[rgodfrey] QPID-6531 : Move the legacy JMS AMQP 1.0 client out of the Java tree

------------------------------------------
[...truncated 6764 lines...]
22504/23039 KB   
22508/23039 KB   
22512/23039 KB   
22516/23039 KB   
22520/23039 KB   
22524/23039 KB   
22528/23039 KB   
22532/23039 KB   
22536/23039 KB   
22540/23039 KB   
22544/23039 KB   
22548/23039 KB   
22552/23039 KB   
22556/23039 KB   
22560/23039 KB   
22564/23039 KB   
22568/23039 KB   
22572/23039 KB   
22576/23039 KB   
22580/23039 KB   
22584/23039 KB   
22588/23039 KB   
22589/23039 KB   
22593/23039 KB   
22597/23039 KB   
22601/23039 KB   
22605/23039 KB   
22609/23039 KB   
22613/23039 KB   
22617/23039 KB   
22621/23039 KB   
22625/23039 KB   
22629/23039 KB   
22633/23039 KB   
22637/23039 KB   
22641/23039 KB   
22645/23039 KB   
22649/23039 KB   
22653/23039 KB   
22657/23039 KB   
22661/23039 KB   
22665/23039 KB   
22669/23039 KB   
22673/23039 KB   
22677/23039 KB   
22681/23039 KB   
22685/23039 KB   
22689/23039 KB   
22693/23039 KB   
22697/23039 KB   
22701/23039 KB   
22705/23039 KB   
22709/23039 KB   
22713/23039 KB   
22717/23039 KB   
22721/23039 KB   
22725/23039 KB   
22729/23039 KB   
22733/23039 KB   
22737/23039 KB   
22741/23039 KB   
22745/23039 KB   
22749/23039 KB   
22753/23039 KB   
22757/23039 KB   
22761/23039 KB   
22763/23039 KB   
22767/23039 KB   
22767/23039 KB   
22771/23039 KB   
22771/23039 KB   
22775/23039 KB   
22775/23039 KB   
22779/23039 KB   
22783/23039 KB   
22787/23039 KB   
22791/23039 KB   
22795/23039 KB   
22799/23039 KB   
22803/23039 KB   
22807/23039 KB   
22811/23039 KB   
22815/23039 KB   
22819/23039 KB   
22823/23039 KB   
22826/23039 KB   
22830/23039 KB   
22830/23039 KB   
22834/23039 KB   
22838/23039 KB   
22842/23039 KB   
22846/23039 KB   
22850/23039 KB   
22854/23039 KB   
22858/23039 KB   
22862/23039 KB   
22866/23039 KB   
22870/23039 KB   
22874/23039 KB   
22878/23039 KB   
22882/23039 KB   
22886/23039 KB   
22890/23039 KB   
22894/23039 KB   
22894/23039 KB   
22898/23039 KB   
22902/23039 KB   
22906/23039 KB   
22910/23039 KB   
22914/23039 KB   
22918/23039 KB   
22922/23039 KB   
22926/23039 KB   
22930/23039 KB   
22934/23039 KB   
22938/23039 KB   
22942/23039 KB   
22946/23039 KB   
22950/23039 KB   
22954/23039 KB   
22958/23039 KB   
22962/23039 KB   
22966/23039 KB   
22970/23039 KB   
22974/23039 KB   
22978/23039 KB   
22982/23039 KB   
22986/23039 KB   
22990/23039 KB   
22994/23039 KB   
22998/23039 KB   
23002/23039 KB   
23006/23039 KB   
23010/23039 KB   
23014/23039 KB   
23017/23039 KB   
23021/23039 KB   
23021/23039 KB   
23025/23039 KB   
23029/23039 KB   
23033/23039 KB   
23037/23039 KB   
23039/23039 KB   
                 
Downloaded: http://repository.apache.org/snapshots/org/apache/qpid/qpid-broker/6.0.0-SNAPSHOT/qpid-broker-6.0.0-20150506.233404-23-bin.tar.gz
(23039 KB at 13575.8 KB/sec)
[INFO] Unpacking /home/jenkins/.m2/repository/org/apache/qpid/qpid-broker/6.0.0-SNAPSHOT/qpid-broker-6.0.0-SNAPSHOT-bin.tar.gz
to <https://builds.apache.org/job/Qpid-Java-Java-Test-IBMJDK1.7/ws/qpid-systests-parent/target>
with includes "" and excludes ""
[INFO] Expanding: /home/jenkins/.m2/repository/org/apache/qpid/qpid-broker/6.0.0-SNAPSHOT/qpid-broker-6.0.0-SNAPSHOT-bin.tar.gz
into <https://builds.apache.org/job/Qpid-Java-Java-Test-IBMJDK1.7/ws/qpid-systests-parent/target>
[INFO] 
[INFO] --- maven-dependency-plugin:2.8:copy (copy-sleepycat-jar-for-bdb-tests) @ qpid-systests-parent
---
[INFO] Configured Artifact: com.sleepycat:je:5.0.104:jar
[INFO] Copying je-5.0.104.jar to <https://builds.apache.org/job/Qpid-Java-Java-Test-IBMJDK1.7/ws/qpid-systests-parent/target/qpid-broker/6.0.0-SNAPSHOT/lib/je-5.0.104.jar>
[INFO] 
[INFO] --- maven-surefire-plugin:2.16:test (integration-test) @ qpid-systests-parent ---
[INFO] No tests to run.
[INFO]                                                                         
[INFO] ------------------------------------------------------------------------
[INFO] Skipping Qpid System Tests
[INFO] This project has been banned from the build due to previous failures.
[INFO] ------------------------------------------------------------------------
[INFO]                                                                         
[INFO] ------------------------------------------------------------------------
[INFO] Skipping Qpid Performance Tests
[INFO] This project has been banned from the build due to previous failures.
[INFO] ------------------------------------------------------------------------
[INFO]                                                                         
[INFO] ------------------------------------------------------------------------
[INFO] Skipping Qpid Performance Test System Tests
[INFO] This project has been banned from the build due to previous failures.
[INFO] ------------------------------------------------------------------------
[INFO]                                                                         
[INFO] ------------------------------------------------------------------------
[INFO] Skipping Qpid Performance Tests Visualisation JFC
[INFO] This project has been banned from the build due to previous failures.
[INFO] ------------------------------------------------------------------------
[INFO]                                                                         
[INFO] ------------------------------------------------------------------------
[INFO] Skipping Qpid BDB Store System Tests
[INFO] This project has been banned from the build due to previous failures.
[INFO] ------------------------------------------------------------------------
[INFO] ------------------------------------------------------------------------
[INFO] Reactor Summary:
[INFO] 
[INFO] Qpid Java Build ................................... SUCCESS [2.552s]
[INFO] Qpid Broker Code Generation ....................... SUCCESS [1.855s]
[INFO] Qpid Test Utilities ............................... SUCCESS [0.633s]
[INFO] Qpid Common ....................................... FAILURE [27.380s]
[INFO] Qpid Management Common ............................ SUCCESS [1.602s]
[INFO] Qpid Java Broker Core ............................. SKIPPED
[INFO] Qpid Access Control Broker Plug-in ................ SKIPPED
[INFO] Qpid AMQP 0-8 Protocol Broker Plug-in ............. SKIPPED
[INFO] Qpid AMQP 0-10 Protocol Plug-in ................... SKIPPED
[INFO] Qpid AMQP 1-0 Protocol Broker Plug-in ............. SKIPPED
[INFO] Qpid AMQP 0-8 to 0-10 Message Conversion Broker Plug-in  SKIPPED
[INFO] Qpid AMQP 0-8 to 1-0 Message Conversion Broker Plug-in  SKIPPED
[INFO] Qpid AMQP 0-10 to 1-0 Message Conversion Broker Plug-in  SKIPPED
[INFO] Qpid Derby Message Store .......................... SKIPPED
[INFO] Qpid JDBC Message Store Connection Pooling Plug-in  SKIPPED
[INFO] Qpid JDBC Message Store Broker Plug-in ............ SKIPPED
[INFO] Qpid HTTP Management Broker Plug-in ............... SKIPPED
[INFO] Qpid JMX Management Broker Plug-in ................ SKIPPED
[INFO] Qpid Memory Message Store Broker Plug-in .......... SKIPPED
[INFO] Qpid WebSocket Broker Plug-in ..................... SKIPPED
[INFO] Qpid AMQP 0-x JMS Client .......................... SKIPPED
[INFO] Qpid BDB Message Store ............................ SKIPPED
[INFO] Qpid BDB Message Store JMX ........................ SKIPPED
[INFO] Qpid Java Broker .................................. SKIPPED
[INFO] Qpid AMQP Management Protocol Broker Plug-in ...... SKIPPED
[INFO] Qpid AMQP 0-x JMS Client Examples ................. SKIPPED
[INFO] Qpid JCA .......................................... SKIPPED
[INFO] Qpid Resource Adaptor ............................. SKIPPED
[INFO] Qpid Tools ........................................ SKIPPED
[INFO] Qpid Management Examples .......................... SUCCESS [0.262s]
[INFO] Qpid Java System Test Parent ...................... SUCCESS [3.827s]
[INFO] Qpid System Tests ................................. SKIPPED
[INFO] Qpid Performance Tests ............................ SKIPPED
[INFO] Qpid Performance Test System Tests ................ SKIPPED
[INFO] Qpid Performance Tests Visualisation JFC .......... SKIPPED
[INFO] Qpid BDB Store System Tests ....................... SKIPPED
[INFO] ------------------------------------------------------------------------
[INFO] BUILD FAILURE
[INFO] ------------------------------------------------------------------------
[INFO] Total time: 39.129s
[INFO] Finished at: Thu May 07 02:30:59 UTC 2015
[INFO] Final Memory: 32M/87M
[INFO] ------------------------------------------------------------------------
[ERROR] Failed to execute goal org.apache.maven.plugins:maven-surefire-plugin:2.16:test (default-test)
on project qpid-common: There are test failures.
[ERROR] 
[ERROR] Please refer to <https://builds.apache.org/job/Qpid-Java-Java-Test-IBMJDK1.7/ws/common/target/surefire-reports>
for the individual test results.
[ERROR] -> [Help 1]
[ERROR] 
[ERROR] To see the full stack trace of the errors, re-run Maven with the -e switch.
[ERROR] Re-run Maven using the -X switch to enable full debug logging.
[ERROR] 
[ERROR] For more information about the errors and possible solutions, please read the following
articles:
[ERROR] [Help 1] http://cwiki.apache.org/confluence/display/MAVEN/MojoFailureException
[ERROR] 
[ERROR] After correcting the problems, you can resume the build with the command
[ERROR]   mvn <goals> -rf :qpid-common
Build step 'Invoke top-level Maven targets' marked build as failure
[locks-and-latches] Releasing all the locks
[locks-and-latches] All the locks released
Archiving artifacts
Sending artifact delta relative to Qpid-Java-Java-Test-IBMJDK1.7 #1071
Archived 2211 artifacts
Archive block size is 32768
Received 19471 blocks and 512916 bytes
Compression is 99.9%
Took 2 min 53 sec
Recording test results

Mime
View raw message