qpid-notifications mailing list archives

Site index · List index
Message view « Date » · « Thread »
Top « Date » · « Thread »
From Apache Jenkins Server <jenk...@builds.apache.org>
Subject Build failed in Jenkins: Qpid-Java-Java-Test-IBMJDK1.7 #1066
Date Fri, 01 May 2015 03:10:35 GMT
See <https://builds.apache.org/job/Qpid-Java-Java-Test-IBMJDK1.7/1066/changes>

Changes:

[rgodfrey] QPID-6518 : Reduce the likelihood of spurious interrupts being propogated to threds
calling receive()

[rgodfrey] QPID-6513 : Null Pointer Exception on connection.close()

[rgodfrey] QPID-6523 : [Java] Update guava dependency to the latest version

[rgodfrey] QPID-6522 : [Java] Remove dependencies on commons-lang, commons-codec

------------------------------------------
[...truncated 8766 lines...]
[INFO] Compiling 11 source files to <https://builds.apache.org/job/Qpid-Java-Java-Test-IBMJDK1.7/ws/perftests/visualisation-jfc/target/test-classes>
[INFO] 
[INFO] --- maven-surefire-plugin:2.16:test (default-test) @ qpid-perftests-visualisation-jfc
---
[INFO] Surefire report directory: <https://builds.apache.org/job/Qpid-Java-Java-Test-IBMJDK1.7/ws/perftests/visualisation-jfc/target/surefire-reports>

-------------------------------------------------------
 T E S T S
-------------------------------------------------------
Running org.apache.qpid.disttest.charting.writer.ChartWriterTest
Tests run: 3, Failures: 0, Errors: 0, Skipped: 0, Time elapsed: 4.227 sec - in org.apache.qpid.disttest.charting.writer.ChartWriterTest
Running org.apache.qpid.disttest.charting.seriesbuilder.JdbcSeriesBuilderTest
Tests run: 1, Failures: 0, Errors: 0, Skipped: 0, Time elapsed: 0.142 sec - in org.apache.qpid.disttest.charting.seriesbuilder.JdbcSeriesBuilderTest
Running org.apache.qpid.disttest.charting.seriesbuilder.SeriesRowTest
Tests run: 5, Failures: 0, Errors: 0, Skipped: 0, Time elapsed: 0.004 sec - in org.apache.qpid.disttest.charting.seriesbuilder.SeriesRowTest
Running org.apache.qpid.disttest.charting.seriesbuilder.JdbcUrlGeneratorTest
Tests run: 4, Failures: 0, Errors: 0, Skipped: 0, Time elapsed: 0.014 sec - in org.apache.qpid.disttest.charting.seriesbuilder.JdbcUrlGeneratorTest
Running org.apache.qpid.disttest.charting.definition.ChartingDefinitionCreatorTest
Tests run: 4, Failures: 0, Errors: 0, Skipped: 0, Time elapsed: 0.022 sec - in org.apache.qpid.disttest.charting.definition.ChartingDefinitionCreatorTest
Running org.apache.qpid.disttest.charting.definition.SeriesDefinitionCreatorTest
Tests run: 4, Failures: 0, Errors: 0, Skipped: 0, Time elapsed: 0.008 sec - in org.apache.qpid.disttest.charting.definition.SeriesDefinitionCreatorTest
Running org.apache.qpid.disttest.charting.chartbuilder.ChartProductionTest
Tests run: 8, Failures: 0, Errors: 0, Skipped: 0, Time elapsed: 0.821 sec - in org.apache.qpid.disttest.charting.chartbuilder.ChartProductionTest
Running org.apache.qpid.disttest.charting.chartbuilder.ColorFactoryTest
Tests run: 2, Failures: 0, Errors: 0, Skipped: 0, Time elapsed: 0.002 sec - in org.apache.qpid.disttest.charting.chartbuilder.ColorFactoryTest
Running org.apache.qpid.disttest.charting.chartbuilder.BaseChartBuilderTest
Tests run: 1, Failures: 0, Errors: 0, Skipped: 0, Time elapsed: 0.044 sec - in org.apache.qpid.disttest.charting.chartbuilder.BaseChartBuilderTest
Running org.apache.qpid.disttest.charting.chartbuilder.TimeSeriesBuilderCallbackTest
Tests run: 1, Failures: 0, Errors: 0, Skipped: 0, Time elapsed: 0.002 sec - in org.apache.qpid.disttest.charting.chartbuilder.TimeSeriesBuilderCallbackTest
Running org.apache.qpid.disttest.charting.chartbuilder.ChartBuilderFactoryTest
Tests run: 6, Failures: 0, Errors: 0, Skipped: 0, Time elapsed: 0.006 sec - in org.apache.qpid.disttest.charting.chartbuilder.ChartBuilderFactoryTest

Results :

Tests run: 39, Failures: 0, Errors: 0, Skipped: 0

[INFO] 
[INFO] --- maven-jar-plugin:2.4:jar (default-jar) @ qpid-perftests-visualisation-jfc ---
[INFO] Building jar: <https://builds.apache.org/job/Qpid-Java-Java-Test-IBMJDK1.7/ws/perftests/visualisation-jfc/target/qpid-perftests-visualisation-jfc-6.0.0-SNAPSHOT.jar>
[INFO] 
[INFO] --- maven-site-plugin:3.3:attach-descriptor (attach-descriptor) @ qpid-perftests-visualisation-jfc
---
[INFO] 
[INFO] --- maven-assembly-plugin:2.4:single (make-assembly) @ qpid-perftests-visualisation-jfc
---
[INFO] Reading assembly descriptor: src/main/assembly/qpid-perftests-visualisation-jfc-bin.xml
[INFO] Building tar: <https://builds.apache.org/job/Qpid-Java-Java-Test-IBMJDK1.7/ws/perftests/visualisation-jfc/target/qpid-perftests-visualisation-jfc-6.0.0-SNAPSHOT-bin.tar.gz>
[WARNING] Entry: qpid-perftests-visualisation-jfc/6.0.0-SNAPSHOT/lib/qpid-perftests-visualisation-jfc-6.0.0-SNAPSHOT.jar
longer than 100 characters.
[WARNING] Resulting tar file can only be processed successfully by GNU compatible tar commands
[INFO] 
[INFO] --- maven-antrun-plugin:1.7:run (create-qbtc-output-dir) @ qpid-perftests-visualisation-jfc
---
[INFO] Executing tasks

main:
    [mkdir] Created dir: <https://builds.apache.org/job/Qpid-Java-Java-Test-IBMJDK1.7/ws/perftests/visualisation-jfc/target/qbtc-test-config>
[INFO] Executed tasks
[INFO]                                                                         
[INFO] ------------------------------------------------------------------------
[INFO] Building Qpid BDB Store System Tests 6.0.0-SNAPSHOT
[INFO] ------------------------------------------------------------------------
[INFO] 
[INFO] --- maven-clean-plugin:2.5:clean (default-clean) @ qpid-bdbstore-systests ---
[INFO] 
[INFO] --- maven-antrun-plugin:1.7:run (output-test-properties) @ qpid-bdbstore-systests ---
[INFO] Executing tasks

main:
     [echo] Qpid Test Profile Properties
     [echo] [profile] java-mms.0-10
     [echo] [profile.broker.language] java
     [echo] [profile.broker.type] internal
     [echo] [profile.broker.command] "<https://builds.apache.org/job/Qpid-Java-Java-Test-IBMJDK1.7/ws/bdbstore/systests/target/qpid-broker/6.0.0-SNAPSHOT/bin/qpid-server">
-sp @STORE_PATH -st @STORE_TYPE -l @LOG_CONFIG_FILE
     [echo] [profile.specific.excludes] JavaTransientExcludes Java010Excludes IBMJDKExcludes
     [echo] [profile.test.excludes] Excludes JavaExcludes java-mms.0-10.excludes JavaTransientExcludes
Java010Excludes IBMJDKExcludes
     [echo] [profile.broker.version] v0_10
     [echo] [profile.test.amqp_port_protocols] ["AMQP_0_8","AMQP_0_9","AMQP_0_9_1","AMQP_0_10"]
     [echo] [profile.broker.persistent] false
     [echo] [profile.virtualhostnode.type] Memory
     [echo] [profile.virtualhostnode.context.blueprint] {"type":"ProvidedStore"}
     [echo] [profile.test_receive_timeout] 1000
[INFO] Executed tasks
[INFO] 
[INFO] --- maven-enforcer-plugin:1.3.1:enforce (enforce-minimum-versions) @ qpid-bdbstore-systests
---
[INFO] 
[INFO] --- maven-enforcer-plugin:1.3.1:enforce (enforce-versions-standard-properties) @ qpid-bdbstore-systests
---
[INFO] 
[INFO] --- jacoco-maven-plugin:0.7.0.201403182114:prepare-agent (default-prepare-agent) @
qpid-bdbstore-systests ---
[INFO] Skipping JaCoCo execution because property jacoco.skip is set.
[INFO] argLine set to empty
[INFO] 
[INFO] --- maven-remote-resources-plugin:1.5:process (default) @ qpid-bdbstore-systests ---
[INFO] 
[INFO] --- maven-resources-plugin:2.6:copy-resources (copy-systests-etc-resources) @ qpid-bdbstore-systests
---
[INFO] Using 'UTF-8' encoding to copy filtered resources.
[INFO] Copying 4 resources
[INFO] 
[INFO] --- maven-resources-plugin:2.6:copy-resources (copy-test-profile-resources) @ qpid-bdbstore-systests
---
[INFO] Using 'UTF-8' encoding to copy filtered resources.
[INFO] Copying 49 resources
[INFO] 
[INFO] --- maven-resources-plugin:2.6:copy-resources (copy-bdbstore-bin-resources) @ qpid-bdbstore-systests
---
[INFO] Using 'UTF-8' encoding to copy filtered resources.
[INFO] Copying 1 resource
[INFO] 
[INFO] --- maven-resources-plugin:2.6:resources (default-resources) @ qpid-bdbstore-systests
---
[INFO] Using 'UTF-8' encoding to copy filtered resources.
[INFO] skip non existing resourceDirectory <https://builds.apache.org/job/Qpid-Java-Java-Test-IBMJDK1.7/ws/bdbstore/systests/src/main/resources>
[INFO] Copying 27 resources
[INFO] Copying 3 resources
[INFO] 
[INFO] --- maven-compiler-plugin:3.1:compile (default-compile) @ qpid-bdbstore-systests ---
[INFO] No sources to compile
[INFO] 
[INFO] --- maven-resources-plugin:2.6:testResources (default-testResources) @ qpid-bdbstore-systests
---
[INFO] Using 'UTF-8' encoding to copy filtered resources.
[INFO] skip non existing resourceDirectory <https://builds.apache.org/job/Qpid-Java-Java-Test-IBMJDK1.7/ws/bdbstore/systests/src/test/resources>
[INFO] Copying 3 resources
[INFO] 
[INFO] --- maven-compiler-plugin:3.1:testCompile (default-testCompile) @ qpid-bdbstore-systests
---
[INFO] Changes detected - recompiling the module!
[INFO] Compiling 8 source files to <https://builds.apache.org/job/Qpid-Java-Java-Test-IBMJDK1.7/ws/bdbstore/systests/target/test-classes>
[INFO] 
[INFO] --- maven-surefire-plugin:2.16:test (default-test) @ qpid-bdbstore-systests ---
[INFO] Tests are skipped.
[INFO] 
[INFO] --- maven-jar-plugin:2.4:jar (default-jar) @ qpid-bdbstore-systests ---
[INFO] Building jar: <https://builds.apache.org/job/Qpid-Java-Java-Test-IBMJDK1.7/ws/bdbstore/systests/target/qpid-bdbstore-systests-6.0.0-SNAPSHOT.jar>
[INFO] 
[INFO] --- maven-site-plugin:3.3:attach-descriptor (attach-descriptor) @ qpid-bdbstore-systests
---
[INFO] 
[INFO] --- maven-antrun-plugin:1.7:run (fix-bdb-script-permissions) @ qpid-bdbstore-systests
---
[INFO] Executing tasks

main:
[INFO] Executed tasks
[INFO] 
[INFO] --- maven-antrun-plugin:1.7:run (create-qbtc-output-dir) @ qpid-bdbstore-systests ---
[INFO] Executing tasks

main:
    [mkdir] Created dir: <https://builds.apache.org/job/Qpid-Java-Java-Test-IBMJDK1.7/ws/bdbstore/systests/target/qpid-broker/6.0.0-SNAPSHOT/qbtc-test-config>
[INFO] Executed tasks
[INFO] 
[INFO] --- maven-dependency-plugin:2.8:unpack (extract-broker-distribution) @ qpid-bdbstore-systests
---
[INFO] Configured Artifact: org.apache.qpid:qpid-broker:bin:6.0.0-SNAPSHOT:tar.gz
[INFO] Unpacking <https://builds.apache.org/job/Qpid-Java-Java-Test-IBMJDK1.7/ws/broker/target/qpid-broker-6.0.0-SNAPSHOT-bin.tar.gz>
to <https://builds.apache.org/job/Qpid-Java-Java-Test-IBMJDK1.7/ws/bdbstore/systests/target>
with includes "" and excludes ""
[INFO] Expanding: <https://builds.apache.org/job/Qpid-Java-Java-Test-IBMJDK1.7/ws/broker/target/qpid-broker-6.0.0-SNAPSHOT-bin.tar.gz>
into <https://builds.apache.org/job/Qpid-Java-Java-Test-IBMJDK1.7/ws/bdbstore/systests/target>
[INFO] 
[INFO] --- maven-dependency-plugin:2.8:copy (copy-sleepycat-jar-for-bdb-tests) @ qpid-bdbstore-systests
---
[INFO] Configured Artifact: com.sleepycat:je:5.0.104:jar
[INFO] Copying je-5.0.104.jar to <https://builds.apache.org/job/Qpid-Java-Java-Test-IBMJDK1.7/ws/bdbstore/systests/target/qpid-broker/6.0.0-SNAPSHOT/lib/je-5.0.104.jar>
[INFO] 
[INFO] --- maven-surefire-plugin:2.16:test (integration-test) @ qpid-bdbstore-systests ---
[INFO] Surefire report directory: <https://builds.apache.org/job/Qpid-Java-Java-Test-IBMJDK1.7/ws/bdbstore/systests/target/surefire-reports>

-------------------------------------------------------
 T E S T S
-------------------------------------------------------
Running org.apache.qpid.server.store.berkeleydb.replication.BDBHAVirtualHostRestTest
Tests run: 3, Failures: 0, Errors: 0, Skipped: 0, Time elapsed: 0.43 sec - in org.apache.qpid.server.store.berkeleydb.replication.BDBHAVirtualHostRestTest
Running org.apache.qpid.server.store.berkeleydb.replication.BDBHAVirtualHostNodeRestTest
Tests run: 7, Failures: 0, Errors: 0, Skipped: 0, Time elapsed: 0.01 sec - in org.apache.qpid.server.store.berkeleydb.replication.BDBHAVirtualHostNodeRestTest
Running org.apache.qpid.server.store.berkeleydb.replication.MultiNodeTest
Tests run: 10, Failures: 0, Errors: 0, Skipped: 0, Time elapsed: 0.076 sec - in org.apache.qpid.server.store.berkeleydb.replication.MultiNodeTest
Running org.apache.qpid.server.store.berkeleydb.replication.TwoNodeTest
Tests run: 7, Failures: 0, Errors: 0, Skipped: 0, Time elapsed: 0.028 sec - in org.apache.qpid.server.store.berkeleydb.replication.TwoNodeTest
Running org.apache.qpid.server.store.berkeleydb.replication.JMXManagementTest
Tests run: 7, Failures: 0, Errors: 0, Skipped: 0, Time elapsed: 0.033 sec - in org.apache.qpid.server.store.berkeleydb.replication.JMXManagementTest
Running org.apache.qpid.server.store.berkeleydb.BDBUpgradeTest
Tests run: 8, Failures: 0, Errors: 0, Skipped: 0, Time elapsed: 0.039 sec - in org.apache.qpid.server.store.berkeleydb.BDBUpgradeTest
Running org.apache.qpid.server.store.berkeleydb.BDBBackupTest
Tests run: 1, Failures: 0, Errors: 0, Skipped: 0, Time elapsed: 0.002 sec - in org.apache.qpid.server.store.berkeleydb.BDBBackupTest

Results :

Tests run: 43, Failures: 0, Errors: 0, Skipped: 0

[INFO] ------------------------------------------------------------------------
[INFO] Reactor Summary:
[INFO] 
[INFO] Qpid Java Build ................................... SUCCESS [3.769s]
[INFO] Qpid AMQP 1.0 Common .............................. SUCCESS [4.625s]
[INFO] Qpid AMQP 1.0 Client .............................. SUCCESS [0.452s]
[INFO] Qpid AMQP 1.0 Client JMS .......................... SUCCESS [1.439s]
[INFO] Qpid AMQP 1.0 JMS Client Examples ................. SUCCESS [0.211s]
[INFO] Qpid AMQP 1.0 Client WebSocket .................... SUCCESS [0.963s]
[INFO] Qpid Broker Code Generation ....................... SUCCESS [0.253s]
[INFO] Qpid Test Utilities ............................... SUCCESS [1.467s]
[INFO] Qpid Common ....................................... SUCCESS [43.587s]
[INFO] Qpid Management Common ............................ SUCCESS [1.687s]
[INFO] Qpid Java Broker Core ............................. SUCCESS [1:41.871s]
[INFO] Qpid Access Control Broker Plug-in ................ SUCCESS [4.325s]
[INFO] Qpid AMQP 0-8 Protocol Broker Plug-in ............. SUCCESS [4.928s]
[INFO] Qpid AMQP 0-10 Protocol Plug-in ................... SUCCESS [4.584s]
[INFO] Qpid AMQP 1-0 Protocol Broker Plug-in ............. SUCCESS [0.448s]
[INFO] Qpid AMQP 0-8 to 0-10 Message Conversion Broker Plug-in  SUCCESS [0.269s]
[INFO] Qpid AMQP 0-8 to 1-0 Message Conversion Broker Plug-in  SUCCESS [0.243s]
[INFO] Qpid AMQP 0-10 to 1-0 Message Conversion Broker Plug-in  SUCCESS [0.240s]
[INFO] Qpid Derby Message Store .......................... SUCCESS [4:52.267s]
[INFO] Qpid JDBC Message Store Connection Pooling Plug-in  SUCCESS [0.398s]
[INFO] Qpid JDBC Message Store Broker Plug-in ............ SUCCESS [9.759s]
[INFO] Qpid HTTP Management Broker Plug-in ............... SUCCESS [8.170s]
[INFO] Qpid JMX Management Broker Plug-in ................ SUCCESS [3.771s]
[INFO] Qpid Memory Message Store Broker Plug-in .......... SUCCESS [0.260s]
[INFO] Qpid WebSocket Broker Plug-in ..................... SUCCESS [0.251s]
[INFO] Qpid AMQP 0-x JMS Client .......................... SUCCESS [6.949s]
[INFO] Qpid BDB Message Store ............................ SUCCESS [23.951s]
[INFO] Qpid BDB Message Store JMX ........................ SUCCESS [2.835s]
[INFO] Qpid Java Broker .................................. SUCCESS [5.255s]
[INFO] Qpid AMQP Management Protocol Broker Plug-in ...... SUCCESS [0.202s]
[INFO] Qpid AMQP 0-x JMS Client Examples ................. SUCCESS [0.140s]
[INFO] Qpid JCA .......................................... SUCCESS [2.349s]
[INFO] Qpid Resource Adaptor ............................. SUCCESS [0.482s]
[INFO] Qpid Tools ........................................ SUCCESS [0.297s]
[INFO] Qpid Management Examples .......................... SUCCESS [0.116s]
[INFO] Qpid Java System Test Parent ...................... SUCCESS [0.676s]
[INFO] Qpid System Tests ................................. SUCCESS [18:36.771s]
[INFO] Qpid Performance Tests ............................ SUCCESS [20.247s]
[INFO] Qpid Performance Test System Tests ................ FAILURE [29.600s]
[INFO] Qpid Performance Tests Visualisation JFC .......... SUCCESS [7.418s]
[INFO] Qpid BDB Store System Tests ....................... SUCCESS [3.058s]
[INFO] ------------------------------------------------------------------------
[INFO] BUILD FAILURE
[INFO] ------------------------------------------------------------------------
[INFO] Total time: 28:31.485s
[INFO] Finished at: Fri May 01 03:05:50 UTC 2015
[INFO] Final Memory: 94M/222M
[INFO] ------------------------------------------------------------------------
[ERROR] Failed to execute goal org.apache.maven.plugins:maven-surefire-plugin:2.16:test (integration-test)
on project qpid-perftests-systests: There are test failures.
[ERROR] 
[ERROR] Please refer to <https://builds.apache.org/job/Qpid-Java-Java-Test-IBMJDK1.7/ws/qpid-perftests-systests/target/surefire-reports>
for the individual test results.
[ERROR] -> [Help 1]
[ERROR] 
[ERROR] To see the full stack trace of the errors, re-run Maven with the -e switch.
[ERROR] Re-run Maven using the -X switch to enable full debug logging.
[ERROR] 
[ERROR] For more information about the errors and possible solutions, please read the following
articles:
[ERROR] [Help 1] http://cwiki.apache.org/confluence/display/MAVEN/MojoFailureException
[ERROR] 
[ERROR] After correcting the problems, you can resume the build with the command
[ERROR]   mvn <goals> -rf :qpid-perftests-systests
Build step 'Invoke top-level Maven targets' marked build as failure
[locks-and-latches] Releasing all the locks
[locks-and-latches] All the locks released
Archiving artifacts
Sending artifact delta relative to Qpid-Java-Java-Test-IBMJDK1.7 #1061
Archived 2206 artifacts
Archive block size is 32768
Received 0 blocks and 605209995 bytes
Compression is 0.0%
Took 4 min 34 sec
Recording test results

Mime
View raw message