qpid-notifications mailing list archives

Site index · List index
Message view « Date » · « Thread »
Top « Date » · « Thread »
From Apache Jenkins Server <jenk...@builds.apache.org>
Subject Build failed in Jenkins: Qpid-Java-Java-Test-IBMJDK1.7 #1083
Date Mon, 18 May 2015 02:31:13 GMT
See <https://builds.apache.org/job/Qpid-Java-Java-Test-IBMJDK1.7/1083/>

------------------------------------------
[...truncated 6533 lines...]
22518/23069 KB   
22522/23069 KB   
22526/23069 KB   
22530/23069 KB   
22534/23069 KB   
22538/23069 KB   
22542/23069 KB   
22546/23069 KB   
22550/23069 KB   
22554/23069 KB   
22558/23069 KB   
22562/23069 KB   
22566/23069 KB   
22570/23069 KB   
22574/23069 KB   
22578/23069 KB   
22582/23069 KB   
22586/23069 KB   
22590/23069 KB   
22594/23069 KB   
22598/23069 KB   
22602/23069 KB   
22606/23069 KB   
22610/23069 KB   
22614/23069 KB   
22618/23069 KB   
22622/23069 KB   
22624/23069 KB   
22628/23069 KB   
22632/23069 KB   
22636/23069 KB   
22640/23069 KB   
22644/23069 KB   
22648/23069 KB   
22652/23069 KB   
22656/23069 KB   
22660/23069 KB   
22664/23069 KB   
22668/23069 KB   
22672/23069 KB   
22676/23069 KB   
22680/23069 KB   
22684/23069 KB   
22688/23069 KB   
22692/23069 KB   
22696/23069 KB   
22700/23069 KB   
22704/23069 KB   
22708/23069 KB   
22712/23069 KB   
22716/23069 KB   
22720/23069 KB   
22724/23069 KB   
22728/23069 KB   
22732/23069 KB   
22736/23069 KB   
22740/23069 KB   
22744/23069 KB   
22748/23069 KB   
22752/23069 KB   
22756/23069 KB   
22760/23069 KB   
22764/23069 KB   
22768/23069 KB   
22772/23069 KB   
22776/23069 KB   
22780/23069 KB   
22784/23069 KB   
22788/23069 KB   
22792/23069 KB   
22796/23069 KB   
22800/23069 KB   
22804/23069 KB   
22808/23069 KB   
22812/23069 KB   
22816/23069 KB   
22820/23069 KB   
22823/23069 KB   
22824/23069 KB   
22828/23069 KB   
22832/23069 KB   
22836/23069 KB   
22840/23069 KB   
22844/23069 KB   
22848/23069 KB   
22852/23069 KB   
22856/23069 KB   
22860/23069 KB   
22864/23069 KB   
22868/23069 KB   
22872/23069 KB   
22876/23069 KB   
22880/23069 KB   
22880/23069 KB   
22884/23069 KB   
22888/23069 KB   
22892/23069 KB   
22896/23069 KB   
22900/23069 KB   
22904/23069 KB   
22908/23069 KB   
22912/23069 KB   
22916/23069 KB   
22920/23069 KB   
22924/23069 KB   
22928/23069 KB   
22932/23069 KB   
22936/23069 KB   
22940/23069 KB   
22944/23069 KB   
22946/23069 KB   
22950/23069 KB   
22954/23069 KB   
22958/23069 KB   
22962/23069 KB   
22966/23069 KB   
22970/23069 KB   
22974/23069 KB   
22978/23069 KB   
22982/23069 KB   
22986/23069 KB   
22990/23069 KB   
22994/23069 KB   
22998/23069 KB   
23002/23069 KB   
23006/23069 KB   
23008/23069 KB   
23010/23069 KB   
23014/23069 KB   
23018/23069 KB   
23022/23069 KB   
23026/23069 KB   
23030/23069 KB   
23034/23069 KB   
23038/23069 KB   
23042/23069 KB   
23046/23069 KB   
23050/23069 KB   
23054/23069 KB   
23058/23069 KB   
23062/23069 KB   
23066/23069 KB   
23069/23069 KB   
                 
Downloaded: http://repository.apache.org/snapshots/org/apache/qpid/qpid-broker/6.0.0-SNAPSHOT/qpid-broker-6.0.0-20150517.232853-34-bin.tar.gz
(23069 KB at 3598.2 KB/sec)
[INFO] Unpacking /home/jenkins/.m2/repository/org/apache/qpid/qpid-broker/6.0.0-SNAPSHOT/qpid-broker-6.0.0-SNAPSHOT-bin.tar.gz
to <https://builds.apache.org/job/Qpid-Java-Java-Test-IBMJDK1.7/ws/qpid-systests-parent/target>
with includes "" and excludes ""
[INFO] Expanding: /home/jenkins/.m2/repository/org/apache/qpid/qpid-broker/6.0.0-SNAPSHOT/qpid-broker-6.0.0-SNAPSHOT-bin.tar.gz
into <https://builds.apache.org/job/Qpid-Java-Java-Test-IBMJDK1.7/ws/qpid-systests-parent/target>
[INFO] 
[INFO] --- maven-dependency-plugin:2.8:copy (copy-sleepycat-jar-for-bdb-tests) @ qpid-systests-parent
---
[INFO] Configured Artifact: com.sleepycat:je:5.0.104:jar
[INFO] Copying je-5.0.104.jar to <https://builds.apache.org/job/Qpid-Java-Java-Test-IBMJDK1.7/ws/qpid-systests-parent/target/qpid-broker/6.0.0-SNAPSHOT/lib/je-5.0.104.jar>
[INFO] 
[INFO] --- maven-surefire-plugin:2.16:test (integration-test) @ qpid-systests-parent ---
[INFO] No tests to run.
[INFO]                                                                         
[INFO] ------------------------------------------------------------------------
[INFO] Skipping Qpid System Tests
[INFO] This project has been banned from the build due to previous failures.
[INFO] ------------------------------------------------------------------------
[INFO]                                                                         
[INFO] ------------------------------------------------------------------------
[INFO] Skipping Qpid Performance Tests
[INFO] This project has been banned from the build due to previous failures.
[INFO] ------------------------------------------------------------------------
[INFO]                                                                         
[INFO] ------------------------------------------------------------------------
[INFO] Skipping Qpid Performance Test System Tests
[INFO] This project has been banned from the build due to previous failures.
[INFO] ------------------------------------------------------------------------
[INFO]                                                                         
[INFO] ------------------------------------------------------------------------
[INFO] Skipping Qpid Performance Tests Visualisation JFC
[INFO] This project has been banned from the build due to previous failures.
[INFO] ------------------------------------------------------------------------
[INFO]                                                                         
[INFO] ------------------------------------------------------------------------
[INFO] Skipping Qpid BDB Store System Tests
[INFO] This project has been banned from the build due to previous failures.
[INFO] ------------------------------------------------------------------------
[INFO] ------------------------------------------------------------------------
[INFO] Reactor Summary:
[INFO] 
[INFO] Qpid Java Build ................................... SUCCESS [3.698s]
[INFO] Qpid Broker Code Generation ....................... SUCCESS [1.689s]
[INFO] Qpid Test Utilities ............................... SUCCESS [0.476s]
[INFO] Qpid Common ....................................... FAILURE [26.661s]
[INFO] Qpid Management Common ............................ SUCCESS [1.572s]
[INFO] Qpid Java Broker Core ............................. SKIPPED
[INFO] Qpid Access Control Broker Plug-in ................ SKIPPED
[INFO] Qpid AMQP 0-8 Protocol Broker Plug-in ............. SKIPPED
[INFO] Qpid AMQP 0-10 Protocol Plug-in ................... SKIPPED
[INFO] Qpid AMQP 1-0 Protocol Broker Plug-in ............. SKIPPED
[INFO] Qpid AMQP 0-8 to 0-10 Message Conversion Broker Plug-in  SKIPPED
[INFO] Qpid AMQP 0-8 to 1-0 Message Conversion Broker Plug-in  SKIPPED
[INFO] Qpid AMQP 0-10 to 1-0 Message Conversion Broker Plug-in  SKIPPED
[INFO] Qpid Derby Message Store .......................... SKIPPED
[INFO] Qpid JDBC Message Store Connection Pooling Plug-in  SKIPPED
[INFO] Qpid JDBC Message Store Broker Plug-in ............ SKIPPED
[INFO] Qpid HTTP Management Broker Plug-in ............... SKIPPED
[INFO] Qpid JMX Management Broker Plug-in ................ SKIPPED
[INFO] Qpid Memory Message Store Broker Plug-in .......... SKIPPED
[INFO] Qpid WebSocket Broker Plug-in ..................... SKIPPED
[INFO] Qpid AMQP 0-x JMS Client .......................... SKIPPED
[INFO] Qpid BDB Message Store ............................ SKIPPED
[INFO] Qpid BDB Message Store JMX ........................ SKIPPED
[INFO] Qpid Java Broker .................................. SKIPPED
[INFO] Qpid AMQP Management Protocol Broker Plug-in ...... SKIPPED
[INFO] Qpid AMQP 0-x JMS Client Examples ................. SKIPPED
[INFO] Qpid JCA .......................................... SKIPPED
[INFO] Qpid Resource Adaptor ............................. SKIPPED
[INFO] Qpid Tools ........................................ SKIPPED
[INFO] Qpid Management Examples .......................... SUCCESS [0.216s]
[INFO] Qpid Java System Test Parent ...................... SUCCESS [13.050s]
[INFO] Qpid System Tests ................................. SKIPPED
[INFO] Qpid Performance Tests ............................ SKIPPED
[INFO] Qpid Performance Test System Tests ................ SKIPPED
[INFO] Qpid Performance Tests Visualisation JFC .......... SKIPPED
[INFO] Qpid BDB Store System Tests ....................... SKIPPED
[INFO] ------------------------------------------------------------------------
[INFO] BUILD FAILURE
[INFO] ------------------------------------------------------------------------
[INFO] Total time: 48.310s
[INFO] Finished at: Mon May 18 02:30:54 UTC 2015
[INFO] Final Memory: 35M/107M
[INFO] ------------------------------------------------------------------------
[ERROR] Failed to execute goal org.apache.maven.plugins:maven-surefire-plugin:2.16:test (default-test)
on project qpid-common: There are test failures.
[ERROR] 
[ERROR] Please refer to <https://builds.apache.org/job/Qpid-Java-Java-Test-IBMJDK1.7/ws/common/target/surefire-reports>
for the individual test results.
[ERROR] -> [Help 1]
[ERROR] 
[ERROR] To see the full stack trace of the errors, re-run Maven with the -e switch.
[ERROR] Re-run Maven using the -X switch to enable full debug logging.
[ERROR] 
[ERROR] For more information about the errors and possible solutions, please read the following
articles:
[ERROR] [Help 1] http://cwiki.apache.org/confluence/display/MAVEN/MojoFailureException
[ERROR] 
[ERROR] After correcting the problems, you can resume the build with the command
[ERROR]   mvn <goals> -rf :qpid-common
Build step 'Invoke top-level Maven targets' marked build as failure
[locks-and-latches] Releasing all the locks
[locks-and-latches] All the locks released
Archiving artifacts
Sending artifact delta relative to Qpid-Java-Java-Test-IBMJDK1.7 #1082
Archived 2216 artifacts
Archive block size is 32768
Received 610 blocks and 524637 bytes
Compression is 97.4%
Took 17 sec
Recording test results

Mime
View raw message