qpid-notifications mailing list archives

Site index · List index
Message view « Date » · « Thread »
Top « Date » · « Thread »
From Apache Jenkins Server <jenk...@builds.apache.org>
Subject Build failed in Jenkins: Qpid-proton-j-Deploy #419
Date Fri, 03 Apr 2015 03:09:18 GMT
See <https://builds.apache.org/job/Qpid-proton-j-Deploy/419/changes>

Changes:

[dominic.evans] PROTON-843: Java should match C for idle timeout

[dominic.evans] PROTON-844: police handle-max in proton-j

[dominic.evans] NO-JIRA: additional fix to proton-j UTF-8

[dominic.evans] NO-JIRA: fix erroneous getRemoteIdleTimeout()

------------------------------------------
[...truncated 1246 lines...]
[INFO] 
[INFO] --- maven-resources-plugin:2.6:resources (default-resources) @ proton-tests ---
[INFO] Using 'UTF-8' encoding to copy filtered resources.
[INFO] Copying 1 resource
[INFO] Copying 3 resources
[INFO] 
[INFO] --- maven-compiler-plugin:2.5.1:compile (default-compile) @ proton-tests ---
[INFO] No sources to compile
[INFO] 
[INFO] --- maven-resources-plugin:2.6:testResources (default-testResources) @ proton-tests
---
[INFO] Using 'UTF-8' encoding to copy filtered resources.
[INFO] skip non existing resourceDirectory <https://builds.apache.org/job/Qpid-proton-j-Deploy/ws/proton/tests/src/test/resources>
[INFO] Copying 3 resources
[INFO] 
[INFO] --- maven-compiler-plugin:2.5.1:testCompile (default-testCompile) @ proton-tests ---
[INFO] Compiling 2 source files to <https://builds.apache.org/job/Qpid-proton-j-Deploy/ws/proton/tests/target/test-classes>
[INFO] 
[INFO] --- maven-surefire-plugin:2.12.4:test (default-test) @ proton-tests ---
[JENKINS] Recording test results
[INFO] 
[INFO] --- maven-jar-plugin:2.4:jar (default-jar) @ proton-tests ---
[INFO] Building jar: <https://builds.apache.org/job/Qpid-proton-j-Deploy/ws/proton/tests/target/proton-tests-1.0-SNAPSHOT.jar>
[INFO] 
[INFO] --- maven-site-plugin:3.2:attach-descriptor (attach-descriptor) @ proton-tests ---
[WARNING] Failed to getClass for org.apache.maven.plugin.source.SourceJarMojo
[INFO] 
[INFO] --- maven-source-plugin:2.2.1:jar (attach-sources) @ proton-tests ---
[INFO] Building jar: <https://builds.apache.org/job/Qpid-proton-j-Deploy/ws/proton/tests/target/proton-tests-1.0-SNAPSHOT-sources.jar>
[INFO] 
[INFO] --- maven-install-plugin:2.3.1:install (default-install) @ proton-tests ---
[INFO] Installing <https://builds.apache.org/job/Qpid-proton-j-Deploy/ws/proton/tests/target/proton-tests-1.0-SNAPSHOT.jar>
to <https://builds.apache.org/job/Qpid-proton-j-Deploy/ws/.repository/org/apache/qpid/proton-tests/1.0-SNAPSHOT/proton-tests-1.0-SNAPSHOT.jar>
[INFO] Installing <https://builds.apache.org/job/Qpid-proton-j-Deploy/ws/proton/tests/pom.xml>
to <https://builds.apache.org/job/Qpid-proton-j-Deploy/ws/.repository/org/apache/qpid/proton-tests/1.0-SNAPSHOT/proton-tests-1.0-SNAPSHOT.pom>
[INFO] Installing <https://builds.apache.org/job/Qpid-proton-j-Deploy/ws/proton/tests/target/proton-tests-1.0-SNAPSHOT-sources.jar>
to <https://builds.apache.org/job/Qpid-proton-j-Deploy/ws/.repository/org/apache/qpid/proton-tests/1.0-SNAPSHOT/proton-tests-1.0-SNAPSHOT-sources.jar>
[INFO] 
[INFO] --- maven-deploy-plugin:2.7:deploy (default-deploy) @ proton-tests ---
Downloading: https://repository.apache.org/content/repositories/snapshots/org/apache/qpid/proton-tests/1.0-SNAPSHOT/maven-metadata.xml
[WARNING] Could not transfer metadata org.apache.qpid:proton-tests:1.0-SNAPSHOT/maven-metadata.xml
from/to apache.snapshots.https (https://repository.apache.org/content/repositories/snapshots):
Failed to transfer file: https://repository.apache.org/content/repositories/snapshots/org/apache/qpid/proton-tests/1.0-SNAPSHOT/maven-metadata.xml.
Return code is: 502 , ReasonPhrase:Proxy Error.
[JENKINS] Archiving disabled
[INFO]                                                                         
[INFO] ------------------------------------------------------------------------
[INFO] Building proton-j-messenger-example 1.0-SNAPSHOT
[INFO] ------------------------------------------------------------------------
[INFO] 
[INFO] --- maven-clean-plugin:2.5:clean (default-clean) @ proton-j-messenger-example ---
[INFO] 
[INFO] --- maven-remote-resources-plugin:1.4:process (default) @ proton-j-messenger-example
---
[INFO] 
[INFO] --- maven-resources-plugin:2.6:resources (default-resources) @ proton-j-messenger-example
---
[INFO] Using 'UTF-8' encoding to copy filtered resources.
[INFO] skip non existing resourceDirectory <https://builds.apache.org/job/Qpid-proton-j-Deploy/ws/proton/examples/java/messenger/src/main/resources>
[INFO] Copying 3 resources
[INFO] 
[INFO] --- maven-compiler-plugin:2.5.1:compile (default-compile) @ proton-j-messenger-example
---
[INFO] Compiling 2 source files to <https://builds.apache.org/job/Qpid-proton-j-Deploy/ws/proton/examples/java/messenger/target/classes>
[WARNING] <https://builds.apache.org/job/Qpid-proton-j-Deploy/ws/proton/examples/java/messenger/src/main/java/org/apache/qpid/proton/example/Send.java>:[79,28]
[deprecation] MessengerImpl() in org.apache.qpid.proton.messenger.impl.MessengerImpl has been
deprecated
[WARNING] <https://builds.apache.org/job/Qpid-proton-j-Deploy/ws/proton/examples/java/messenger/src/main/java/org/apache/qpid/proton/example/Send.java>:[81,26]
[deprecation] MessageImpl() in org.apache.qpid.proton.message.impl.MessageImpl has been deprecated
[WARNING] <https://builds.apache.org/job/Qpid-proton-j-Deploy/ws/proton/examples/java/messenger/src/main/java/org/apache/qpid/proton/example/Recv.java>:[101,28]
[deprecation] MessengerImpl() in org.apache.qpid.proton.messenger.impl.MessengerImpl has been
deprecated
[INFO] 
[INFO] --- maven-resources-plugin:2.6:testResources (default-testResources) @ proton-j-messenger-example
---
[INFO] Using 'UTF-8' encoding to copy filtered resources.
[INFO] skip non existing resourceDirectory <https://builds.apache.org/job/Qpid-proton-j-Deploy/ws/proton/examples/java/messenger/src/test/resources>
[INFO] Copying 3 resources
[INFO] 
[INFO] --- maven-compiler-plugin:2.5.1:testCompile (default-testCompile) @ proton-j-messenger-example
---
[INFO] No sources to compile
[INFO] 
[INFO] --- maven-surefire-plugin:2.12.4:test (default-test) @ proton-j-messenger-example ---
[JENKINS] Recording test results
[INFO] 
[INFO] --- maven-jar-plugin:2.4:jar (default-jar) @ proton-j-messenger-example ---
[INFO] Building jar: <https://builds.apache.org/job/Qpid-proton-j-Deploy/ws/proton/examples/java/messenger/target/proton-j-messenger-example-1.0-SNAPSHOT.jar>
[INFO] 
[INFO] --- maven-site-plugin:3.2:attach-descriptor (attach-descriptor) @ proton-j-messenger-example
---
[WARNING] Failed to getClass for org.apache.maven.plugin.source.SourceJarMojo
[INFO] 
[INFO] --- maven-source-plugin:2.2.1:jar (attach-sources) @ proton-j-messenger-example ---
[INFO] Building jar: <https://builds.apache.org/job/Qpid-proton-j-Deploy/ws/proton/examples/java/messenger/target/proton-j-messenger-example-1.0-SNAPSHOT-sources.jar>
[INFO] 
[INFO] --- maven-install-plugin:2.3.1:install (default-install) @ proton-j-messenger-example
---
[INFO] Installing <https://builds.apache.org/job/Qpid-proton-j-Deploy/ws/proton/examples/java/messenger/target/proton-j-messenger-example-1.0-SNAPSHOT.jar>
to <https://builds.apache.org/job/Qpid-proton-j-Deploy/ws/.repository/org/apache/qpid/proton-j-messenger-example/1.0-SNAPSHOT/proton-j-messenger-example-1.0-SNAPSHOT.jar>
[INFO] Installing <https://builds.apache.org/job/Qpid-proton-j-Deploy/ws/proton/examples/java/messenger/pom.xml>
to <https://builds.apache.org/job/Qpid-proton-j-Deploy/ws/.repository/org/apache/qpid/proton-j-messenger-example/1.0-SNAPSHOT/proton-j-messenger-example-1.0-SNAPSHOT.pom>
[INFO] Installing <https://builds.apache.org/job/Qpid-proton-j-Deploy/ws/proton/examples/java/messenger/target/proton-j-messenger-example-1.0-SNAPSHOT-sources.jar>
to <https://builds.apache.org/job/Qpid-proton-j-Deploy/ws/.repository/org/apache/qpid/proton-j-messenger-example/1.0-SNAPSHOT/proton-j-messenger-example-1.0-SNAPSHOT-sources.jar>
[INFO] 
[INFO] --- maven-deploy-plugin:2.7:deploy (default-deploy) @ proton-j-messenger-example ---
Downloading: https://repository.apache.org/content/repositories/snapshots/org/apache/qpid/proton-j-messenger-example/1.0-SNAPSHOT/maven-metadata.xml
[WARNING] Could not transfer metadata org.apache.qpid:proton-j-messenger-example:1.0-SNAPSHOT/maven-metadata.xml
from/to apache.snapshots.https (https://repository.apache.org/content/repositories/snapshots):
Failed to transfer file: https://repository.apache.org/content/repositories/snapshots/org/apache/qpid/proton-j-messenger-example/1.0-SNAPSHOT/maven-metadata.xml.
Return code is: 502 , ReasonPhrase:Proxy Error.
[JENKINS] Archiving disabled
[INFO] ------------------------------------------------------------------------
[INFO] Reactor Summary:
[INFO] 
[INFO] proton-project .................................... SUCCESS [39.154s]
[INFO] proton-j .......................................... SUCCESS [1:30.171s]
[INFO] proton-jms ........................................ SUCCESS [1:00.827s]
[INFO] proton-hawtdispatch ............................... SUCCESS [2:11.241s]
[INFO] proton-tests ...................................... FAILURE [1:02.611s]
[INFO] proton-j-messenger-example ........................ FAILURE [1:01.583s]
[INFO] ------------------------------------------------------------------------
[INFO] BUILD FAILURE
[INFO] ------------------------------------------------------------------------
[INFO] Total time: 7:28.613s
[INFO] Finished at: Fri Apr 03 03:09:16 UTC 2015
[INFO] Final Memory: 22M/994M
[INFO] ------------------------------------------------------------------------
[JENKINS] Archiving disabled
[JENKINS] Archiving disabled
[JENKINS] Archiving disabled
[JENKINS] Archiving disabled
[JENKINS] Archiving disabled
[JENKINS] Archiving disabled
Waiting for Jenkins to finish collecting data[ERROR] Failed to execute goal org.apache.maven.plugins:maven-deploy-plugin:2.7:deploy
(default-deploy) on project proton-tests: Failed to retrieve remote metadata org.apache.qpid:proton-tests:1.0-SNAPSHOT/maven-metadata.xml:
Could not transfer metadata org.apache.qpid:proton-tests:1.0-SNAPSHOT/maven-metadata.xml from/to
apache.snapshots.https (https://repository.apache.org/content/repositories/snapshots): Failed
to transfer file: https://repository.apache.org/content/repositories/snapshots/org/apache/qpid/proton-tests/1.0-SNAPSHOT/maven-metadata.xml.
Return code is: 502 , ReasonPhrase:Proxy Error. -> [Help 1]
org.apache.maven.lifecycle.LifecycleExecutionException: Failed to execute goal org.apache.maven.plugins:maven-deploy-plugin:2.7:deploy
(default-deploy) on project proton-tests: Failed to retrieve remote metadata org.apache.qpid:proton-tests:1.0-SNAPSHOT/maven-metadata.xml:
Could not transfer metadata org.apache.qpid:proton-tests:1.0-SNAPSHOT/maven-metadata.xml from/to
apache.snapshots.https (https://repository.apache.org/content/repositories/snapshots): Failed
to transfer file: https://repository.apache.org/content/repositories/snapshots/org/apache/qpid/proton-tests/1.0-SNAPSHOT/maven-metadata.xml.
Return code is: 502 , ReasonPhrase:Proxy Error.
	at org.apache.maven.lifecycle.internal.MojoExecutor.execute(MojoExecutor.java:217)
	at org.apache.maven.lifecycle.internal.MojoExecutor.execute(MojoExecutor.java:153)
	at org.apache.maven.lifecycle.internal.MojoExecutor.execute(MojoExecutor.java:145)
	at org.apache.maven.lifecycle.internal.LifecycleModuleBuilder.buildProject(LifecycleModuleBuilder.java:84)
	at org.apache.maven.lifecycle.internal.LifecycleModuleBuilder.buildProject(LifecycleModuleBuilder.java:59)
	at org.apache.maven.lifecycle.internal.LifecycleStarter.singleThreadedBuild(LifecycleStarter.java:183)
	at org.apache.maven.lifecycle.internal.LifecycleStarter.execute(LifecycleStarter.java:161)
	at org.apache.maven.DefaultMaven.doExecute(DefaultMaven.java:320)
	at org.apache.maven.DefaultMaven.execute(DefaultMaven.java:156)
	at org.jvnet.hudson.maven3.launcher.Maven3Launcher.main(Maven3Launcher.java:117)
	at sun.reflect.NativeMethodAccessorImpl.invoke0(Native Method)
	at sun.reflect.NativeMethodAccessorImpl.invoke(NativeMethodAccessorImpl.java:39)
	at sun.reflect.DelegatingMethodAccessorImpl.invoke(DelegatingMethodAccessorImpl.java:25)
	at java.lang.reflect.Method.invoke(Method.java:597)
	at org.codehaus.plexus.classworlds.launcher.Launcher.launchStandard(Launcher.java:329)
	at org.codehaus.plexus.classworlds.launcher.Launcher.launch(Launcher.java:239)
	at org.jvnet.hudson.maven3.agent.Maven3Main.launch(Maven3Main.java:178)
	at sun.reflect.NativeMethodAccessorImpl.invoke0(Native Method)
	at sun.reflect.NativeMethodAccessorImpl.invoke(NativeMethodAccessorImpl.java:39)
	at sun.reflect.DelegatingMethodAccessorImpl.invoke(DelegatingMethodAccessorImpl.java:25)
	at java.lang.reflect.Method.invoke(Method.java:597)
	at hudson.maven.Maven3Builder.call(Maven3Builder.java:136)
	at hudson.maven.Maven3Builder.call(Maven3Builder.java:71)
	at hudson.remoting.UserRequest.perform(UserRequest.java:118)
	at hudson.remoting.UserRequest.perform(UserRequest.java:48)
	at hudson.remoting.Request$2.run(Request.java:328)
	at hudson.remoting.InterceptingExecutorService$1.call(InterceptingExecutorService.java:72)
	at java.util.concurrent.FutureTask$Sync.innerRun(FutureTask.java:303)
	at java.util.concurrent.FutureTask.run(FutureTask.java:138)
	at java.util.concurrent.ThreadPoolExecutor$Worker.runTask(ThreadPoolExecutor.java:895)
	at java.util.concurrent.ThreadPoolExecutor$Worker.run(ThreadPoolExecutor.java:918)
	at java.lang.Thread.run(Thread.java:662)
Caused by: org.apache.maven.plugin.MojoExecutionException: Failed to retrieve remote metadata
org.apache.qpid:proton-tests:1.0-SNAPSHOT/maven-metadata.xml: Could not transfer metadata
org.apache.qpid:proton-tests:1.0-SNAPSHOT/maven-metadata.xml from/to apache.snapshots.https
(https://repository.apache.org/content/repositories/snapshots): Failed to transfer file: https://repository.apache.org/content/repositories/snapshots/org/apache/qpid/proton-tests/1.0-SNAPSHOT/maven-metadata.xml.
Return code is: 502 , ReasonPhrase:Proxy Error.
	at org.apache.maven.plugin.deploy.DeployMojo.execute(DeployMojo.java:193)
	at org.apache.maven.plugin.DefaultBuildPluginManager.executeMojo(DefaultBuildPluginManager.java:101)
	at org.apache.maven.lifecycle.internal.MojoExecutor.execute(MojoExecutor.java:209)
	... 31 more
Caused by: org.apache.maven.artifact.deployer.ArtifactDeploymentException: Failed to retrieve
remote metadata org.apache.qpid:proton-tests:1.0-SNAPSHOT/maven-metadata.xml: Could not transfer
metadata org.apache.qpid:proton-tests:1.0-SNAPSHOT/maven-metadata.xml from/to apache.snapshots.https
(https://repository.apache.org/content/repositories/snapshots): Failed to transfer file: https://repository.apache.org/content/repositories/snapshots/org/apache/qpid/proton-tests/1.0-SNAPSHOT/maven-metadata.xml.
Return code is: 502 , ReasonPhrase:Proxy Error.
	at org.apache.maven.artifact.deployer.DefaultArtifactDeployer.deploy(DefaultArtifactDeployer.java:141)
	at org.apache.maven.plugin.deploy.AbstractDeployMojo.deploy(AbstractDeployMojo.java:167)
	at org.apache.maven.plugin.deploy.DeployMojo.execute(DeployMojo.java:157)
	... 33 more
Caused by: org.sonatype.aether.deployment.DeploymentException: Failed to retrieve remote metadata
org.apache.qpid:proton-tests:1.0-SNAPSHOT/maven-metadata.xml: Could not transfer metadata
org.apache.qpid:proton-tests:1.0-SNAPSHOT/maven-metadata.xml from/to apache.snapshots.https
(https://repository.apache.org/content/repositories/snapshots): Failed to transfer file: https://repository.apache.org/content/repositories/snapshots/org/apache/qpid/proton-tests/1.0-SNAPSHOT/maven-metadata.xml.
Return code is: 502 , ReasonPhrase:Proxy Error.
	at org.sonatype.aether.impl.internal.DefaultDeployer.upload(DefaultDeployer.java:403)
	at org.sonatype.aether.impl.internal.DefaultDeployer.deploy(DefaultDeployer.java:256)
	at org.sonatype.aether.impl.internal.DefaultDeployer.deploy(DefaultDeployer.java:211)
	at org.sonatype.aether.impl.internal.DefaultRepositorySystem.deploy(DefaultRepositorySystem.java:443)
	at org.apache.maven.artifact.deployer.DefaultArtifactDeployer.deploy(DefaultArtifactDeployer.java:137)
	... 35 more
Caused by: org.sonatype.aether.transfer.MetadataTransferException: Could not transfer metadata
org.apache.qpid:proton-tests:1.0-SNAPSHOT/maven-metadata.xml from/to apache.snapshots.https
(https://repository.apache.org/content/repositories/snapshots): Failed to transfer file: https://repository.apache.org/content/repositories/snapshots/org/apache/qpid/proton-tests/1.0-SNAPSHOT/maven-metadata.xml.
Return code is: 502 , ReasonPhrase:Proxy Error.
	at org.sonatype.aether.connector.wagon.WagonRepositoryConnector$3.wrap(WagonRepositoryConnector.java:930)
	at org.sonatype.aether.connector.wagon.WagonRepositoryConnector$3.wrap(WagonRepositoryConnector.java:920)
	at org.sonatype.aether.connector.wagon.WagonRepositoryConnector$GetTask.run(WagonRepositoryConnector.java:669)
	at org.sonatype.aether.util.concurrency.RunnableErrorForwarder$1.run(RunnableErrorForwarder.java:60)
	... 3 more
Caused by: org.apache.maven.wagon.TransferFailedException: Failed to transfer file: https://repository.apache.org/content/repositories/snapshots/org/apache/qpid/proton-tests/1.0-SNAPSHOT/maven-metadata.xml.
Return code is: 502 , ReasonPhrase:Proxy Error.
	at org.apache.maven.wagon.shared.http4.AbstractHttpClientWagon.fillInputData(AbstractHttpClientWagon.java:945)
	at org.apache.maven.wagon.StreamWagon.getInputStream(StreamWagon.java:116)
	at org.apache.maven.wagon.StreamWagon.getIfNewer(StreamWagon.java:88)
	at org.apache.maven.wagon.StreamWagon.get(StreamWagon.java:61)
	at org.sonatype.aether.connector.wagon.WagonRepositoryConnector$GetTask.run(WagonRepositoryConnector.java:601)
	... 4 more
[ERROR] Failed to execute goal org.apache.maven.plugins:maven-deploy-plugin:2.7:deploy (default-deploy)
on project proton-j-messenger-example: Failed to retrieve remote metadata org.apache.qpid:proton-j-messenger-example:1.0-SNAPSHOT/maven-metadata.xml:
Could not transfer metadata org.apache.qpid:proton-j-messenger-example:1.0-SNAPSHOT/maven-metadata.xml
from/to apache.snapshots.https (https://repository.apache.org/content/repositories/snapshots):
Failed to transfer file: https://repository.apache.org/content/repositories/snapshots/org/apache/qpid/proton-j-messenger-example/1.0-SNAPSHOT/maven-metadata.xml.
Return code is: 502 , ReasonPhrase:Proxy Error. -> [Help 1]
org.apache.maven.lifecycle.LifecycleExecutionException: Failed to execute goal org.apache.maven.plugins:maven-deploy-plugin:2.7:deploy
(default-deploy) on project proton-j-messenger-example: Failed to retrieve remote metadata
org.apache.qpid:proton-j-messenger-example:1.0-SNAPSHOT/maven-metadata.xml: Could not transfer
metadata org.apache.qpid:proton-j-messenger-example:1.0-SNAPSHOT/maven-metadata.xml from/to
apache.snapshots.https (https://repository.apache.org/content/repositories/snapshots): Failed
to transfer file: https://repository.apache.org/content/repositories/snapshots/org/apache/qpid/proton-j-messenger-example/1.0-SNAPSHOT/maven-metadata.xml.
Return code is: 502 , ReasonPhrase:Proxy Error.
	at org.apache.maven.lifecycle.internal.MojoExecutor.execute(MojoExecutor.java:217)
	at org.apache.maven.lifecycle.internal.MojoExecutor.execute(MojoExecutor.java:153)
	at org.apache.maven.lifecycle.internal.MojoExecutor.execute(MojoExecutor.java:145)
	at org.apache.maven.lifecycle.internal.LifecycleModuleBuilder.buildProject(LifecycleModuleBuilder.java:84)
	at org.apache.maven.lifecycle.internal.LifecycleModuleBuilder.buildProject(LifecycleModuleBuilder.java:59)
	at org.apache.maven.lifecycle.internal.LifecycleStarter.singleThreadedBuild(LifecycleStarter.java:183)
	at org.apache.maven.lifecycle.internal.LifecycleStarter.execute(LifecycleStarter.java:161)
	at org.apache.maven.DefaultMaven.doExecute(DefaultMaven.java:320)
	at org.apache.maven.DefaultMaven.execute(DefaultMaven.java:156)
	at org.jvnet.hudson.maven3.launcher.Maven3Launcher.main(Maven3Launcher.java:117)
	at sun.reflect.NativeMethodAccessorImpl.invoke0(Native Method)
	at sun.reflect.NativeMethodAccessorImpl.invoke(NativeMethodAccessorImpl.java:39)
	at sun.reflect.DelegatingMethodAccessorImpl.invoke(DelegatingMethodAccessorImpl.java:25)
	at java.lang.reflect.Method.invoke(Method.java:597)
	at org.codehaus.plexus.classworlds.launcher.Launcher.launchStandard(Launcher.java:329)
	at org.codehaus.plexus.classworlds.launcher.Launcher.launch(Launcher.java:239)
	at org.jvnet.hudson.maven3.agent.Maven3Main.launch(Maven3Main.java:178)
	at sun.reflect.NativeMethodAccessorImpl.invoke0(Native Method)
	at sun.reflect.NativeMethodAccessorImpl.invoke(NativeMethodAccessorImpl.java:39)
	at sun.reflect.DelegatingMethodAccessorImpl.invoke(DelegatingMethodAccessorImpl.java:25)
	at java.lang.reflect.Method.invoke(Method.java:597)
	at hudson.maven.Maven3Builder.call(Maven3Builder.java:136)
	at hudson.maven.Maven3Builder.call(Maven3Builder.java:71)
	at hudson.remoting.UserRequest.perform(UserRequest.java:118)
	at hudson.remoting.UserRequest.perform(UserRequest.java:48)
	at hudson.remoting.Request$2.run(Request.java:328)
	at hudson.remoting.InterceptingExecutorService$1.call(InterceptingExecutorService.java:72)
	at java.util.concurrent.FutureTask$Sync.innerRun(FutureTask.java:303)
	at java.util.concurrent.FutureTask.run(FutureTask.java:138)
	at java.util.concurrent.ThreadPoolExecutor$Worker.runTask(ThreadPoolExecutor.java:895)
	at java.util.concurrent.ThreadPoolExecutor$Worker.run(ThreadPoolExecutor.java:918)
	at java.lang.Thread.run(Thread.java:662)
Caused by: org.apache.maven.plugin.MojoExecutionException: Failed to retrieve remote metadata
org.apache.qpid:proton-j-messenger-example:1.0-SNAPSHOT/maven-metadata.xml: Could not transfer
metadata org.apache.qpid:proton-j-messenger-example:1.0-SNAPSHOT/maven-metadata.xml from/to
apache.snapshots.https (https://repository.apache.org/content/repositories/snapshots): Failed
to transfer file: https://repository.apache.org/content/repositories/snapshots/org/apache/qpid/proton-j-messenger-example/1.0-SNAPSHOT/maven-metadata.xml.
Return code is: 502 , ReasonPhrase:Proxy Error.
	at org.apache.maven.plugin.deploy.DeployMojo.execute(DeployMojo.java:193)
	at org.apache.maven.plugin.DefaultBuildPluginManager.executeMojo(DefaultBuildPluginManager.java:101)
	at org.apache.maven.lifecycle.internal.MojoExecutor.execute(MojoExecutor.java:209)
	... 31 more
Caused by: org.apache.maven.artifact.deployer.ArtifactDeploymentException: Failed to retrieve
remote metadata org.apache.qpid:proton-j-messenger-example:1.0-SNAPSHOT/maven-metadata.xml:
Could not transfer metadata org.apache.qpid:proton-j-messenger-example:1.0-SNAPSHOT/maven-metadata.xml
from/to apache.snapshots.https (https://repository.apache.org/content/repositories/snapshots):
Failed to transfer file: https://repository.apache.org/content/repositories/snapshots/org/apache/qpid/proton-j-messenger-example/1.0-SNAPSHOT/maven-metadata.xml.
Return code is: 502 , ReasonPhrase:Proxy Error.
	at org.apache.maven.artifact.deployer.DefaultArtifactDeployer.deploy(DefaultArtifactDeployer.java:141)
	at org.apache.maven.plugin.deploy.AbstractDeployMojo.deploy(AbstractDeployMojo.java:167)
	at org.apache.maven.plugin.deploy.DeployMojo.execute(DeployMojo.java:157)
	... 33 more
Caused by: org.sonatype.aether.deployment.DeploymentException: Failed to retrieve remote metadata
org.apache.qpid:proton-j-messenger-example:1.0-SNAPSHOT/maven-metadata.xml: Could not transfer
metadata org.apache.qpid:proton-j-messenger-example:1.0-SNAPSHOT/maven-metadata.xml from/to
apache.snapshots.https (https://repository.apache.org/content/repositories/snapshots): Failed
to transfer file: https://repository.apache.org/content/repositories/snapshots/org/apache/qpid/proton-j-messenger-example/1.0-SNAPSHOT/maven-metadata.xml.
Return code is: 502 , ReasonPhrase:Proxy Error.
	at org.sonatype.aether.impl.internal.DefaultDeployer.upload(DefaultDeployer.java:403)
	at org.sonatype.aether.impl.internal.DefaultDeployer.deploy(DefaultDeployer.java:256)
	at org.sonatype.aether.impl.internal.DefaultDeployer.deploy(DefaultDeployer.java:211)
	at org.sonatype.aether.impl.internal.DefaultRepositorySystem.deploy(DefaultRepositorySystem.java:443)
	at org.apache.maven.artifact.deployer.DefaultArtifactDeployer.deploy(DefaultArtifactDeployer.java:137)
	... 35 more
Caused by: org.sonatype.aether.transfer.MetadataTransferException: Could not transfer metadata
org.apache.qpid:proton-j-messenger-example:1.0-SNAPSHOT/maven-metadata.xml from/to apache.snapshots.https
(https://repository.apache.org/content/repositories/snapshots): Failed to transfer file: https://repository.apache.org/content/repositories/snapshots/org/apache/qpid/proton-j-messenger-example/1.0-SNAPSHOT/maven-metadata.xml.
Return code is: 502 , ReasonPhrase:Proxy Error.
	at org.sonatype.aether.connector.wagon.WagonRepositoryConnector$3.wrap(WagonRepositoryConnector.java:930)
	at org.sonatype.aether.connector.wagon.WagonRepositoryConnector$3.wrap(WagonRepositoryConnector.java:920)
	at org.sonatype.aether.connector.wagon.WagonRepositoryConnector$GetTask.run(WagonRepositoryConnector.java:669)
	at org.sonatype.aether.util.concurrency.RunnableErrorForwarder$1.run(RunnableErrorForwarder.java:60)
	... 3 more
Caused by: org.apache.maven.wagon.TransferFailedException: Failed to transfer file: https://repository.apache.org/content/repositories/snapshots/org/apache/qpid/proton-j-messenger-example/1.0-SNAPSHOT/maven-metadata.xml.
Return code is: 502 , ReasonPhrase:Proxy Error.
	at org.apache.maven.wagon.shared.http4.AbstractHttpClientWagon.fillInputData(AbstractHttpClientWagon.java:945)
	at org.apache.maven.wagon.StreamWagon.getInputStream(StreamWagon.java:116)
	at org.apache.maven.wagon.StreamWagon.getIfNewer(StreamWagon.java:88)
	at org.apache.maven.wagon.StreamWagon.get(StreamWagon.java:61)
	at org.sonatype.aether.connector.wagon.WagonRepositoryConnector$GetTask.run(WagonRepositoryConnector.java:601)
	... 4 more
[ERROR] 
[ERROR] Re-run Maven using the -X switch to enable full debug logging.
[ERROR] 
[ERROR] For more information about the errors and possible solutions, please read the following
articles:
[ERROR] [Help 1] http://cwiki.apache.org/confluence/display/MAVEN/MojoExecutionException
[ERROR] 
[ERROR] After correcting the problems, you can resume the build with the command
[ERROR]   mvn <goals> -rf :proton-tests

Sending e-mails to: notifications@qpid.apache.org
Sending e-mails to: notifications@qpid.apache.org
channel stopped

Mime
View raw message