qpid-notifications mailing list archives

Site index · List index
Message view « Date » · « Thread »
Top « Date » · « Thread »
From Apache Jenkins Server <jenk...@builds.apache.org>
Subject Build failed in Jenkins: Qpid-Java-Cpp-Test #2422
Date Wed, 18 Feb 2015 12:42:43 GMT
See <https://builds.apache.org/job/Qpid-Java-Cpp-Test/2422/changes>

Changes:

[kwall] QPID-6390: [Java System Tests] Ensure that Broker's system properties are loaded before
the test begins to use the Model to create test config

------------------------------------------
[...truncated 6556 lines...]
	at org.apache.qpid.server.store.berkeleydb.replication.MultiNodeTest.setUp(MultiNodeTest.java:81)

testPriority(org.apache.qpid.server.store.berkeleydb.replication.MultiNodeTest)  Time elapsed:
0.006 sec  <<< FAILURE!
junit.framework.AssertionFailedError: null
	at junit.framework.Assert.fail(Assert.java:55)
	at junit.framework.Assert.assertTrue(Assert.java:22)
	at junit.framework.Assert.assertTrue(Assert.java:31)
	at junit.framework.TestCase.assertTrue(TestCase.java:201)
	at org.apache.qpid.server.store.berkeleydb.replication.MultiNodeTest.setUp(MultiNodeTest.java:81)

testQuorumOverride(org.apache.qpid.server.store.berkeleydb.replication.MultiNodeTest)  Time
elapsed: 0.006 sec  <<< FAILURE!
junit.framework.AssertionFailedError: null
	at junit.framework.Assert.fail(Assert.java:55)
	at junit.framework.Assert.assertTrue(Assert.java:22)
	at junit.framework.Assert.assertTrue(Assert.java:31)
	at junit.framework.TestCase.assertTrue(TestCase.java:201)
	at org.apache.qpid.server.store.berkeleydb.replication.MultiNodeTest.setUp(MultiNodeTest.java:81)

testLossOfQuorumCausesClientDisconnection(org.apache.qpid.server.store.berkeleydb.replication.MultiNodeTest)
 Time elapsed: 0.006 sec  <<< FAILURE!
junit.framework.AssertionFailedError: null
	at junit.framework.Assert.fail(Assert.java:55)
	at junit.framework.Assert.assertTrue(Assert.java:22)
	at junit.framework.Assert.assertTrue(Assert.java:31)
	at junit.framework.TestCase.assertTrue(TestCase.java:201)
	at org.apache.qpid.server.store.berkeleydb.replication.MultiNodeTest.setUp(MultiNodeTest.java:81)

testLossOfMasterNodeCausesClientToFailover(org.apache.qpid.server.store.berkeleydb.replication.MultiNodeTest)
 Time elapsed: 0.006 sec  <<< FAILURE!
junit.framework.AssertionFailedError: null
	at junit.framework.Assert.fail(Assert.java:55)
	at junit.framework.Assert.assertTrue(Assert.java:22)
	at junit.framework.Assert.assertTrue(Assert.java:31)
	at junit.framework.TestCase.assertTrue(TestCase.java:201)
	at org.apache.qpid.server.store.berkeleydb.replication.MultiNodeTest.setUp(MultiNodeTest.java:81)

testClusterCannotStartWithIntruder(org.apache.qpid.server.store.berkeleydb.replication.MultiNodeTest)
 Time elapsed: 0.006 sec  <<< FAILURE!
junit.framework.AssertionFailedError: null
	at junit.framework.Assert.fail(Assert.java:55)
	at junit.framework.Assert.assertTrue(Assert.java:22)
	at junit.framework.Assert.assertTrue(Assert.java:31)
	at junit.framework.TestCase.assertTrue(TestCase.java:201)
	at org.apache.qpid.server.store.berkeleydb.replication.MultiNodeTest.setUp(MultiNodeTest.java:81)

testTransferMasterWhilstMessagesInFlight(org.apache.qpid.server.store.berkeleydb.replication.MultiNodeTest)
 Time elapsed: 0.006 sec  <<< FAILURE!
junit.framework.AssertionFailedError: null
	at junit.framework.Assert.fail(Assert.java:55)
	at junit.framework.Assert.assertTrue(Assert.java:22)
	at junit.framework.Assert.assertTrue(Assert.java:31)
	at junit.framework.TestCase.assertTrue(TestCase.java:201)
	at org.apache.qpid.server.store.berkeleydb.replication.MultiNodeTest.setUp(MultiNodeTest.java:81)

testTransferMasterFromRemoteNode(org.apache.qpid.server.store.berkeleydb.replication.MultiNodeTest)
 Time elapsed: 0.006 sec  <<< FAILURE!
junit.framework.AssertionFailedError: null
	at junit.framework.Assert.fail(Assert.java:55)
	at junit.framework.Assert.assertTrue(Assert.java:22)
	at junit.framework.Assert.assertTrue(Assert.java:31)
	at junit.framework.TestCase.assertTrue(TestCase.java:201)
	at org.apache.qpid.server.store.berkeleydb.replication.MultiNodeTest.setUp(MultiNodeTest.java:81)

testLossOfReplicaNodeDoesNotCauseClientToFailover(org.apache.qpid.server.store.berkeleydb.replication.MultiNodeTest)
 Time elapsed: 0.006 sec  <<< FAILURE!
junit.framework.AssertionFailedError: null
	at junit.framework.Assert.fail(Assert.java:55)
	at junit.framework.Assert.assertTrue(Assert.java:22)
	at junit.framework.Assert.assertTrue(Assert.java:31)
	at junit.framework.TestCase.assertTrue(TestCase.java:201)
	at org.apache.qpid.server.store.berkeleydb.replication.MultiNodeTest.setUp(MultiNodeTest.java:81)

testPersistentMessagesAvailableAfterFailover(org.apache.qpid.server.store.berkeleydb.replication.MultiNodeTest)
 Time elapsed: 0.006 sec  <<< FAILURE!
junit.framework.AssertionFailedError: null
	at junit.framework.Assert.fail(Assert.java:55)
	at junit.framework.Assert.assertTrue(Assert.java:22)
	at junit.framework.Assert.assertTrue(Assert.java:31)
	at junit.framework.TestCase.assertTrue(TestCase.java:201)
	at org.apache.qpid.server.store.berkeleydb.replication.MultiNodeTest.setUp(MultiNodeTest.java:81)

Running org.apache.qpid.server.store.berkeleydb.replication.TwoNodeTest
Tests run: 7, Failures: 7, Errors: 0, Skipped: 0, Time elapsed: 0.063 sec <<< FAILURE!
- in org.apache.qpid.server.store.berkeleydb.replication.TwoNodeTest
testMasterDesignatedPrimaryCanBeRestartedWithoutReplica(org.apache.qpid.server.store.berkeleydb.replication.TwoNodeTest)
 Time elapsed: 0.006 sec  <<< FAILURE!
junit.framework.AssertionFailedError: null
	at junit.framework.Assert.fail(Assert.java:55)
	at junit.framework.Assert.assertTrue(Assert.java:22)
	at junit.framework.Assert.assertTrue(Assert.java:31)
	at junit.framework.TestCase.assertTrue(TestCase.java:201)
	at org.apache.qpid.server.store.berkeleydb.replication.TwoNodeTest.setUp(TwoNodeTest.java:55)

testSecondaryDesignatedAsPrimaryAfterOriginalPrimaryStopped(org.apache.qpid.server.store.berkeleydb.replication.TwoNodeTest)
 Time elapsed: 0.019 sec  <<< FAILURE!
junit.framework.AssertionFailedError: null
	at junit.framework.Assert.fail(Assert.java:55)
	at junit.framework.Assert.assertTrue(Assert.java:22)
	at junit.framework.Assert.assertTrue(Assert.java:31)
	at junit.framework.TestCase.assertTrue(TestCase.java:201)
	at org.apache.qpid.server.store.berkeleydb.replication.TwoNodeTest.setUp(TwoNodeTest.java:55)

testClusterRestartWithoutDesignatedPrimary(org.apache.qpid.server.store.berkeleydb.replication.TwoNodeTest)
 Time elapsed: 0.006 sec  <<< FAILURE!
junit.framework.AssertionFailedError: null
	at junit.framework.Assert.fail(Assert.java:55)
	at junit.framework.Assert.assertTrue(Assert.java:22)
	at junit.framework.Assert.assertTrue(Assert.java:31)
	at junit.framework.TestCase.assertTrue(TestCase.java:201)
	at org.apache.qpid.server.store.berkeleydb.replication.TwoNodeTest.setUp(TwoNodeTest.java:55)

testDesignatedPrimaryContinuesAfterSecondaryStopped(org.apache.qpid.server.store.berkeleydb.replication.TwoNodeTest)
 Time elapsed: 0.005 sec  <<< FAILURE!
junit.framework.AssertionFailedError: null
	at junit.framework.Assert.fail(Assert.java:55)
	at junit.framework.Assert.assertTrue(Assert.java:22)
	at junit.framework.Assert.assertTrue(Assert.java:31)
	at junit.framework.TestCase.assertTrue(TestCase.java:201)
	at org.apache.qpid.server.store.berkeleydb.replication.TwoNodeTest.setUp(TwoNodeTest.java:55)

testPersistentOperationsFailOnNonDesignatedPrimaryAfterSecondaryStopped(org.apache.qpid.server.store.berkeleydb.replication.TwoNodeTest)
 Time elapsed: 0.005 sec  <<< FAILURE!
junit.framework.AssertionFailedError: null
	at junit.framework.Assert.fail(Assert.java:55)
	at junit.framework.Assert.assertTrue(Assert.java:22)
	at junit.framework.Assert.assertTrue(Assert.java:31)
	at junit.framework.TestCase.assertTrue(TestCase.java:201)
	at org.apache.qpid.server.store.berkeleydb.replication.TwoNodeTest.setUp(TwoNodeTest.java:55)

testInitialDesignatedPrimaryStateOfNodes(org.apache.qpid.server.store.berkeleydb.replication.TwoNodeTest)
 Time elapsed: 0.006 sec  <<< FAILURE!
junit.framework.AssertionFailedError: null
	at junit.framework.Assert.fail(Assert.java:55)
	at junit.framework.Assert.assertTrue(Assert.java:22)
	at junit.framework.Assert.assertTrue(Assert.java:31)
	at junit.framework.TestCase.assertTrue(TestCase.java:201)
	at org.apache.qpid.server.store.berkeleydb.replication.TwoNodeTest.setUp(TwoNodeTest.java:55)

testSecondaryDoesNotBecomePrimaryWhenDesignatedPrimaryStopped(org.apache.qpid.server.store.berkeleydb.replication.TwoNodeTest)
 Time elapsed: 0.006 sec  <<< FAILURE!
junit.framework.AssertionFailedError: null
	at junit.framework.Assert.fail(Assert.java:55)
	at junit.framework.Assert.assertTrue(Assert.java:22)
	at junit.framework.Assert.assertTrue(Assert.java:31)
	at junit.framework.TestCase.assertTrue(TestCase.java:201)
	at org.apache.qpid.server.store.berkeleydb.replication.TwoNodeTest.setUp(TwoNodeTest.java:55)

Running org.apache.qpid.server.store.berkeleydb.BDBBackupTest
Tests run: 0, Failures: 0, Errors: 0, Skipped: 0, Time elapsed: 0 sec - in org.apache.qpid.server.store.berkeleydb.BDBBackupTest

Results :

Failed tests: 
  MultiNodeTest>QpidTestCase.run:148->QpidBrokerTestCase.runBare:286->setUp:81 null
  MultiNodeTest>QpidTestCase.run:148->QpidBrokerTestCase.runBare:286->setUp:81 null
  MultiNodeTest>QpidTestCase.run:148->QpidBrokerTestCase.runBare:286->setUp:81 null
  MultiNodeTest>QpidTestCase.run:148->QpidBrokerTestCase.runBare:286->setUp:81 null
  MultiNodeTest>QpidTestCase.run:148->QpidBrokerTestCase.runBare:286->setUp:81 null
  MultiNodeTest>QpidTestCase.run:148->QpidBrokerTestCase.runBare:286->setUp:81 null
  MultiNodeTest>QpidTestCase.run:148->QpidBrokerTestCase.runBare:286->setUp:81 null
  MultiNodeTest>QpidTestCase.run:148->QpidBrokerTestCase.runBare:286->setUp:81 null
  MultiNodeTest>QpidTestCase.run:148->QpidBrokerTestCase.runBare:286->setUp:81 null
  MultiNodeTest>QpidTestCase.run:148->QpidBrokerTestCase.runBare:286->setUp:81 null
  TwoNodeTest>QpidTestCase.run:148->QpidBrokerTestCase.runBare:286->setUp:55 null
  TwoNodeTest>QpidTestCase.run:148->QpidBrokerTestCase.runBare:286->setUp:55 null
  TwoNodeTest>QpidTestCase.run:148->QpidBrokerTestCase.runBare:286->setUp:55 null
  TwoNodeTest>QpidTestCase.run:148->QpidBrokerTestCase.runBare:286->setUp:55 null
  TwoNodeTest>QpidTestCase.run:148->QpidBrokerTestCase.runBare:286->setUp:55 null
  TwoNodeTest>QpidTestCase.run:148->QpidBrokerTestCase.runBare:286->setUp:55 null
  TwoNodeTest>QpidTestCase.run:148->QpidBrokerTestCase.runBare:286->setUp:55 null

Tests in error: 
  BDBHAVirtualHostNodeRestTest>QpidTestCase.run:148->QpidBrokerTestCase.runBare:286->testNewMasterElectedWhenVirtualHostIsStopped:135->createHANode:317
» Connect
  BDBHAVirtualHostNodeRestTest>QpidTestCase.run:148->QpidBrokerTestCase.runBare:286->testMutateStateOfOneNode:103->createHANode:317
» Connect
  BDBHAVirtualHostNodeRestTest>QpidTestCase.run:148->QpidBrokerTestCase.runBare:286->testIntruderProtection:252->createHANode:317
» Connect
  BDBHAVirtualHostNodeRestTest>QpidTestCase.run:148->QpidBrokerTestCase.runBare:286->testDeleteMasterNode:192->createHANode:317
» Connect
  BDBHAVirtualHostNodeRestTest>QpidTestCase.run:148->QpidBrokerTestCase.runBare:286->testCreate3NodeGroup:92->createHANode:317
» Connect
  BDBHAVirtualHostNodeRestTest>QpidTestCase.run:148->QpidBrokerTestCase.runBare:286->testDeleteReplicaNode:166->createHANode:317
» Connect
  BDBHAVirtualHostNodeRestTest>QpidTestCase.run:148->QpidBrokerTestCase.runBare:286->testIntruderBDBHAVHNNotAllowedToConnect:232->createHANode:317
» Connect
  BDBHAVirtualHostRestTest>QpidTestCase.run:148->QpidBrokerTestCase.runBare:286->testSetLocalTransactionSynchronizationPolicy:116->QpidRestTestCase.waitForAttributeChanged:114
» Connect
  BDBHAVirtualHostRestTest>QpidTestCase.run:148->QpidBrokerTestCase.runBare:286->testMutateState:140->QpidRestTestCase.waitForAttributeChanged:114
» Connect
  BDBHAVirtualHostRestTest>QpidTestCase.run:148->QpidBrokerTestCase.runBare:286->testSetRemoteTransactionSynchronizationPolicy:128->QpidRestTestCase.waitForAttributeChanged:114
» Connect
  JMXManagementTest>QpidTestCase.run:148->QpidBrokerTestCase.runBare:286->testRemoveRemoteNodeFromGroup:164->getStoreBeanForNodeAtBrokerPort:276
» IO
  JMXManagementTest>QpidTestCase.run:148->QpidBrokerTestCase.runBare:286->testVirtualHostOperationsDeniedForNonMasterNode:187->getManagedBrokerBeanForNodeAtBrokerPort:283
» IO
  JMXManagementTest>QpidTestCase.run:148->QpidBrokerTestCase.runBare:286->testStateOfNonActiveBrokerIsNotMaster:133->getStoreBeanForNodeAtBrokerPort:276
» IO
  JMXManagementTest>QpidTestCase.run:148->QpidBrokerTestCase.runBare:286->testStateOfActiveBrokerIsMaster:125->getStoreBeanForNodeAtBrokerPort:276
» IO
  JMXManagementTest>QpidTestCase.run:148->QpidBrokerTestCase.runBare:286->testVirtualHostMbeanOnMasterTransfer:225->getManagedBrokerBeanForNodeAtBrokerPort:283
» IO
  JMXManagementTest>QpidTestCase.run:148->QpidBrokerTestCase.runBare:286->testGroupMembers:142->getStoreBeanForNodeAtBrokerPort:276
» IO
  JMXManagementTest>QpidTestCase.run:148->QpidBrokerTestCase.runBare:286->testReadonlyMBeanAttributes:111->getStoreBeanForNodeAtBrokerPort:276
» IO

Tests run: 42, Failures: 17, Errors: 17, Skipped: 0

[INFO] ------------------------------------------------------------------------
[INFO] Reactor Summary:
[INFO] 
[INFO] Qpid Java Build ................................... SUCCESS [2.217s]
[INFO] Qpid AMQP 1.0 Common .............................. SUCCESS [5.311s]
[INFO] Qpid AMQP 1.0 Client .............................. SUCCESS [0.858s]
[INFO] Qpid AMQP 1.0 Client JMS .......................... SUCCESS [1.725s]
[INFO] Qpid AMQP 1.0 JMS Client Examples ................. SUCCESS [0.203s]
[INFO] Qpid AMQP 1.0 Client WebSocket .................... SUCCESS [0.568s]
[INFO] Qpid Broker Code Generation ....................... SUCCESS [0.327s]
[INFO] Qpid Test Utilities ............................... SUCCESS [0.302s]
[INFO] Qpid Common ....................................... SUCCESS [27.656s]
[INFO] Qpid Management Common ............................ SUCCESS [1.401s]
[INFO] Qpid Java Broker Core ............................. SUCCESS [1:26.096s]
[INFO] Qpid Access Control Broker Plug-in ................ SUCCESS [4.050s]
[INFO] Qpid AMQP 0-8 Protocol Broker Plug-in ............. SUCCESS [20.445s]
[INFO] Qpid AMQP 0-10 Protocol Plug-in ................... SUCCESS [4.209s]
[INFO] Qpid AMQP 1-0 Protocol Broker Plug-in ............. SUCCESS [0.505s]
[INFO] Qpid AMQP 0-8 to 0-10 Message Conversion Broker Plug-in  SUCCESS [0.273s]
[INFO] Qpid AMQP 0-8 to 1-0 Message Conversion Broker Plug-in  SUCCESS [0.279s]
[INFO] Qpid AMQP 0-10 to 1-0 Message Conversion Broker Plug-in  SUCCESS [0.277s]
[INFO] Qpid Derby Message Store .......................... SUCCESS [17.224s]
[INFO] Qpid JDBC Message Store Connection Pooling Plug-in  SUCCESS [0.342s]
[INFO] Qpid JDBC Message Store Broker Plug-in ............ SUCCESS [9.235s]
[INFO] Qpid HTTP Management Broker Plug-in ............... SUCCESS [5.107s]
[INFO] Qpid JMX Management Broker Plug-in ................ SUCCESS [3.244s]
[INFO] Qpid Memory Message Store Broker Plug-in .......... SUCCESS [0.591s]
[INFO] Qpid WebSocket Broker Plug-in ..................... SUCCESS [0.290s]
[INFO] Qpid AMQP 0-x JMS Client .......................... SUCCESS [7.504s]
[INFO] Qpid BDB Message Store ............................ SUCCESS [2:10.016s]
[INFO] Qpid BDB Message Store JMX ........................ SUCCESS [2.138s]
[INFO] Qpid Java Broker .................................. SUCCESS [4.543s]
[INFO] Qpid AMQP Management Protocol Broker Plug-in ...... SUCCESS [0.383s]
[INFO] Qpid AMQP 0-x JMS Client Examples ................. SUCCESS [0.140s]
[INFO] Qpid JCA .......................................... SUCCESS [1.609s]
[INFO] Qpid Resource Adaptor ............................. SUCCESS [0.391s]
[INFO] Qpid Tools ........................................ SUCCESS [0.458s]
[INFO] Qpid Management Examples .......................... SUCCESS [0.178s]
[INFO] Qpid Java System Test Parent ...................... SUCCESS [0.762s]
[INFO] Qpid System Tests ................................. SUCCESS [5:49.266s]
[INFO] Qpid Performance Tests ............................ SUCCESS [13.602s]
[INFO] Qpid Performance Test System Tests ................ FAILURE [15.948s]
[INFO] Qpid Performance Tests Visualisation JFC .......... SUCCESS [3.821s]
[INFO] Qpid BDB Store System Tests ....................... FAILURE [5.574s]
[INFO] ------------------------------------------------------------------------
[INFO] BUILD FAILURE
[INFO] ------------------------------------------------------------------------
[INFO] Total time: 12:10.242s
[INFO] Finished at: Wed Feb 18 12:42:22 UTC 2015
[INFO] Final Memory: 73M/395M
[INFO] ------------------------------------------------------------------------
[ERROR] Failed to execute goal org.apache.maven.plugins:maven-surefire-plugin:2.16:test (integration-test)
on project qpid-perftests-systests: There are test failures.
[ERROR] 
[ERROR] Please refer to <https://builds.apache.org/job/Qpid-Java-Cpp-Test/ws/trunk/qpid/java/qpid-perftests-systests/target/surefire-reports>
for the individual test results.
[ERROR] -> [Help 1]
[ERROR] Failed to execute goal org.apache.maven.plugins:maven-surefire-plugin:2.16:test (integration-test)
on project qpid-bdbstore-systests: There are test failures.
[ERROR] 
[ERROR] Please refer to <https://builds.apache.org/job/Qpid-Java-Cpp-Test/ws/trunk/qpid/java/bdbstore/systests/target/surefire-reports>
for the individual test results.
[ERROR] -> [Help 1]
[ERROR] 
[ERROR] To see the full stack trace of the errors, re-run Maven with the -e switch.
[ERROR] Re-run Maven using the -X switch to enable full debug logging.
[ERROR] 
[ERROR] For more information about the errors and possible solutions, please read the following
articles:
[ERROR] [Help 1] http://cwiki.apache.org/confluence/display/MAVEN/MojoFailureException
[ERROR] 
[ERROR] After correcting the problems, you can resume the build with the command
[ERROR]   mvn <goals> -rf :qpid-perftests-systests
Build step 'Invoke top-level Maven targets' marked build as failure
[locks-and-latches] Releasing all the locks
[locks-and-latches] All the locks released
Recording test results

Mime
View raw message