qpid-notifications mailing list archives

Site index · List index
Message view « Date » · « Thread »
Top « Date » · « Thread »
From Apache Jenkins Server <jenk...@builds.apache.org>
Subject Build failed in Jenkins: Qpid-Java-Java-Test-JDK1.8 #993
Date Sun, 01 Feb 2015 02:25:50 GMT
See <https://builds.apache.org/job/Qpid-Java-Java-Test-JDK1.8/993/changes>

Changes:

[rgodfrey] QPID-6349 : [JMS AMQP 1.0 Client] Add ability to change the SSL enabled protocols
used on the SSLSocket

------------------------------------------
[...truncated 6593 lines...]
[INFO]    >>> to file://<https://builds.apache.org/job/Qpid-Java-Java-Test-JDK1.8/ws/trunk/qpid/java/target/staging/perftests/visualisation-jfc/perftests/qpid-perftests-visualisation-jfc>
file://<https://builds.apache.org/job/Qpid-Java-Java-Test-JDK1.8/ws/trunk/qpid/java/target/staging/>
- Session: Disconnecting  
file://<https://builds.apache.org/job/Qpid-Java-Java-Test-JDK1.8/ws/trunk/qpid/java/target/staging/>
- Session: Disconnected
[INFO]                                                                         
[INFO] ------------------------------------------------------------------------
[INFO] Building Qpid BDB Store System Tests 0.32-SNAPSHOT
[INFO] ------------------------------------------------------------------------
[INFO] 
[INFO] --- maven-clean-plugin:2.5:clean (default-clean) @ qpid-bdbstore-systests ---
[INFO] Deleting <https://builds.apache.org/job/Qpid-Java-Java-Test-JDK1.8/ws/trunk/qpid/java/bdbstore/systests/target>
[INFO] 
[INFO] --- maven-antrun-plugin:1.7:run (output-test-properties) @ qpid-bdbstore-systests ---
[INFO] Executing tasks

main:
     [echo] Qpid Test Profile Properties
     [echo] [profile] java-mms.0-10
     [echo] [profile.broker.language] java
     [echo] [profile.broker.type] internal
     [echo] [profile.broker.command] "<https://builds.apache.org/job/Qpid-Java-Java-Test-JDK1.8/ws/trunk/qpid/java/bdbstore/systests/target/qpid-broker/0.32-SNAPSHOT/bin/qpid-server">
-sp @STORE_PATH -st @STORE_TYPE -l @LOG_CONFIG_FILE
     [echo] [profile.specific.excludes] JavaTransientExcludes Java010Excludes
     [echo] [profile.test.excludes] Excludes JavaExcludes java-mms.0-10.excludes JavaTransientExcludes
Java010Excludes
     [echo] [profile.broker.version] v0_10
     [echo] [profile.test.amqp_port_protocols] ["AMQP_0_8","AMQP_0_9","AMQP_0_9_1","AMQP_0_10"]
     [echo] [profile.broker.persistent] false
     [echo] [profile.virtualhostnode.type] Memory
     [echo] [profile.virtualhostnode.context.blueprint] {"type":"ProvidedStore"}
[INFO] Executed tasks
[INFO] 
[INFO] --- maven-enforcer-plugin:1.3.1:enforce (enforce-minimum-versions) @ qpid-bdbstore-systests
---
[INFO] 
[INFO] --- maven-enforcer-plugin:1.3.1:enforce (enforce-versions-standard-properties) @ qpid-bdbstore-systests
---
[INFO] 
[INFO] --- jacoco-maven-plugin:0.7.0.201403182114:prepare-agent (default-prepare-agent) @
qpid-bdbstore-systests ---
[INFO] Skipping JaCoCo execution because property jacoco.skip is set.
[INFO] argLine set to empty
[INFO] 
[INFO] --- maven-remote-resources-plugin:1.5:process (default) @ qpid-bdbstore-systests ---
[INFO] 
[INFO] --- maven-resources-plugin:2.6:copy-resources (copy-systests-etc-resources) @ qpid-bdbstore-systests
---
[INFO] Using 'UTF-8' encoding to copy filtered resources.
[INFO] Copying 4 resources
[INFO] 
[INFO] --- maven-resources-plugin:2.6:copy-resources (copy-test-profile-resources) @ qpid-bdbstore-systests
---
[INFO] Using 'UTF-8' encoding to copy filtered resources.
[INFO] Copying 45 resources
[INFO] 
[INFO] --- maven-resources-plugin:2.6:copy-resources (copy-bdbstore-bin-resources) @ qpid-bdbstore-systests
---
[INFO] Using 'UTF-8' encoding to copy filtered resources.
[INFO] Copying 1 resource
[INFO] 
[INFO] --- maven-resources-plugin:2.6:resources (default-resources) @ qpid-bdbstore-systests
---
[INFO] Using 'UTF-8' encoding to copy filtered resources.
[INFO] skip non existing resourceDirectory <https://builds.apache.org/job/Qpid-Java-Java-Test-JDK1.8/ws/trunk/qpid/java/bdbstore/systests/src/main/resources>
[INFO] Copying 24 resources
[INFO] Copying 3 resources
[INFO] 
[INFO] --- maven-compiler-plugin:3.1:compile (default-compile) @ qpid-bdbstore-systests ---
[INFO] No sources to compile
[INFO] 
[INFO] --- maven-resources-plugin:2.6:testResources (default-testResources) @ qpid-bdbstore-systests
---
[INFO] Using 'UTF-8' encoding to copy filtered resources.
[INFO] skip non existing resourceDirectory <https://builds.apache.org/job/Qpid-Java-Java-Test-JDK1.8/ws/trunk/qpid/java/bdbstore/systests/src/test/resources>
[INFO] Copying 3 resources
[INFO] 
[INFO] --- maven-compiler-plugin:3.1:testCompile (default-testCompile) @ qpid-bdbstore-systests
---
[INFO] Changes detected - recompiling the module!
[INFO] Compiling 8 source files to <https://builds.apache.org/job/Qpid-Java-Java-Test-JDK1.8/ws/trunk/qpid/java/bdbstore/systests/target/test-classes>
[WARNING] bootstrap class path not set in conjunction with -source 1.7
[INFO] 
[INFO] --- maven-surefire-plugin:2.16:test (default-test) @ qpid-bdbstore-systests ---
[INFO] Tests are skipped.
[INFO] 
[INFO] --- maven-jar-plugin:2.4:jar (default-jar) @ qpid-bdbstore-systests ---
[INFO] Building jar: <https://builds.apache.org/job/Qpid-Java-Java-Test-JDK1.8/ws/trunk/qpid/java/bdbstore/systests/target/qpid-bdbstore-systests-0.32-SNAPSHOT.jar>
[INFO] 
[INFO] --- maven-site-plugin:3.3:attach-descriptor (attach-descriptor) @ qpid-bdbstore-systests
---
[INFO] 
[INFO] --- maven-antrun-plugin:1.7:run (fix-bdb-script-permissions) @ qpid-bdbstore-systests
---
[INFO] Executing tasks

main:
[INFO] Executed tasks
[INFO] 
[INFO] --- maven-antrun-plugin:1.7:run (create-qbtc-output-dir) @ qpid-bdbstore-systests ---
[INFO] Executing tasks

main:
    [mkdir] Created dir: <https://builds.apache.org/job/Qpid-Java-Java-Test-JDK1.8/ws/trunk/qpid/java/bdbstore/systests/target/qpid-broker/0.32-SNAPSHOT/qbtc-test-config>
[INFO] Executed tasks
[INFO] 
[INFO] --- maven-dependency-plugin:2.8:unpack (extract-broker-distribution) @ qpid-bdbstore-systests
---
[INFO] Configured Artifact: org.apache.qpid:qpid-broker:bin:0.32-SNAPSHOT:tar.gz
[INFO] Unpacking <https://builds.apache.org/job/Qpid-Java-Java-Test-JDK1.8/ws/trunk/qpid/java/broker/target/qpid-broker-0.32-SNAPSHOT-bin.tar.gz>
to <https://builds.apache.org/job/Qpid-Java-Java-Test-JDK1.8/ws/trunk/qpid/java/bdbstore/systests/target>
with includes "" and excludes ""
[INFO] Expanding: <https://builds.apache.org/job/Qpid-Java-Java-Test-JDK1.8/ws/trunk/qpid/java/broker/target/qpid-broker-0.32-SNAPSHOT-bin.tar.gz>
into <https://builds.apache.org/job/Qpid-Java-Java-Test-JDK1.8/ws/trunk/qpid/java/bdbstore/systests/target>
[INFO] 
[INFO] --- maven-dependency-plugin:2.8:copy (copy-sleepycat-jar-for-bdb-tests) @ qpid-bdbstore-systests
---
[INFO] Configured Artifact: com.sleepycat:je:5.0.104:jar
[INFO] Copying je-5.0.104.jar to <https://builds.apache.org/job/Qpid-Java-Java-Test-JDK1.8/ws/trunk/qpid/java/bdbstore/systests/target/qpid-broker/0.32-SNAPSHOT/lib/je-5.0.104.jar>
[INFO] 
[INFO] --- maven-surefire-plugin:2.16:test (integration-test) @ qpid-bdbstore-systests ---
[INFO] Surefire report directory: <https://builds.apache.org/job/Qpid-Java-Java-Test-JDK1.8/ws/trunk/qpid/java/bdbstore/systests/target/surefire-reports>

-------------------------------------------------------
 T E S T S
-------------------------------------------------------
Running org.apache.qpid.server.store.berkeleydb.BDBUpgradeTest
log4j:WARN No appenders could be found for logger (org.apache.qpid.test.utils.QpidTestCase).
log4j:WARN Please initialize the log4j system properly.
log4j:WARN See http://logging.apache.org/log4j/1.2/faq.html#noconfig for more info.
Tests run: 8, Failures: 0, Errors: 0, Skipped: 0, Time elapsed: 0.126 sec - in org.apache.qpid.server.store.berkeleydb.BDBUpgradeTest
Running org.apache.qpid.server.store.berkeleydb.replication.BDBHAVirtualHostNodeRestTest
Tests run: 7, Failures: 0, Errors: 0, Skipped: 0, Time elapsed: 0.013 sec - in org.apache.qpid.server.store.berkeleydb.replication.BDBHAVirtualHostNodeRestTest
Running org.apache.qpid.server.store.berkeleydb.replication.BDBHAVirtualHostRestTest
Tests run: 3, Failures: 0, Errors: 0, Skipped: 0, Time elapsed: 0.003 sec - in org.apache.qpid.server.store.berkeleydb.replication.BDBHAVirtualHostRestTest
Running org.apache.qpid.server.store.berkeleydb.replication.JMXManagementTest
Tests run: 7, Failures: 0, Errors: 0, Skipped: 0, Time elapsed: 0.042 sec - in org.apache.qpid.server.store.berkeleydb.replication.JMXManagementTest
Running org.apache.qpid.server.store.berkeleydb.replication.MultiNodeTest
Tests run: 10, Failures: 0, Errors: 0, Skipped: 0, Time elapsed: 0.03 sec - in org.apache.qpid.server.store.berkeleydb.replication.MultiNodeTest
Running org.apache.qpid.server.store.berkeleydb.replication.TwoNodeTest
Tests run: 7, Failures: 0, Errors: 0, Skipped: 0, Time elapsed: 0.009 sec - in org.apache.qpid.server.store.berkeleydb.replication.TwoNodeTest
Running org.apache.qpid.server.store.berkeleydb.BDBBackupTest
Tests run: 1, Failures: 0, Errors: 0, Skipped: 0, Time elapsed: 0.001 sec - in org.apache.qpid.server.store.berkeleydb.BDBBackupTest

Results :

Tests run: 43, Failures: 0, Errors: 0, Skipped: 0

[INFO] 
[INFO] --- maven-site-plugin:3.3:site (default-site) @ qpid-bdbstore-systests ---
[INFO] configuring report plugin org.apache.maven.plugins:maven-project-info-reports-plugin:2.7
[INFO] configuring report plugin org.codehaus.mojo:license-maven-plugin:1.6
[INFO] configuring report plugin org.apache.maven.plugins:maven-surefire-report-plugin:2.16
[INFO] configuring report plugin org.apache.maven.plugins:maven-jxr-plugin:2.3
[INFO] configuring report plugin org.jacoco:jacoco-maven-plugin:0.7.0.201403182114
[INFO] Skipping JaCoCo execution because property jacoco.skip is set.
[INFO] Skipping JaCoCo execution because property jacoco.skip is set.
[INFO] configuring report plugin org.apache.rat:apache-rat-plugin:0.10
[INFO] Parent project loaded from repository: org.apache.qpid:qpid-parent:pom:1.0
[INFO] Parent project loaded from repository: org.apache:apache:pom:14
[INFO] Relativizing decoration links with respect to project URL: http://qpid.apache.org/qpid-java-build/qpid-systests-parent/qpid-bdbstore-systests
[INFO] Rendering site with org.apache.maven.skins:maven-default-skin:jar:1.0 skin.
[INFO] Generating "About" report    --- maven-project-info-reports-plugin:2.7
[INFO] Generating "Plugin Management" report    --- maven-project-info-reports-plugin:2.7
[INFO] Generating "Distribution Management" report    --- maven-project-info-reports-plugin:2.7
[INFO] Generating "Dependency Information" report    --- maven-project-info-reports-plugin:2.7
[INFO] Generating "Dependency Convergence" report    --- maven-project-info-reports-plugin:2.7
[INFO] Generating "Source Repository" report    --- maven-project-info-reports-plugin:2.7
[INFO] Generating "Mailing Lists" report    --- maven-project-info-reports-plugin:2.7
[INFO] Generating "Issue Tracking" report    --- maven-project-info-reports-plugin:2.7
[INFO] Generating "Continuous Integration" report    --- maven-project-info-reports-plugin:2.7
[INFO] Generating "Project Plugins" report    --- maven-project-info-reports-plugin:2.7
[INFO] Generating "Project License" report    --- maven-project-info-reports-plugin:2.7
[INFO] Generating "Dependency Management" report    --- maven-project-info-reports-plugin:2.7
[INFO] Generating "Project Team" report    --- maven-project-info-reports-plugin:2.7
[INFO] Generating "Project Summary" report    --- maven-project-info-reports-plugin:2.7
[INFO] Generating "Dependencies" report    --- maven-project-info-reports-plugin:2.7
[INFO] Generating "Third Parties" report    --- license-maven-plugin:1.6
[INFO] Generating "Surefire Report" report    --- maven-surefire-report-plugin:2.16
[INFO] Generating "Test Source Xref" report    --- maven-jxr-plugin:2.3
[INFO] Generating "Rat Report" report    --- apache-rat-plugin:0.10
[INFO] 51 implicit excludes (use -debug for more details).
[INFO] Exclude: build/**
[INFO] Exclude: lib/**
[INFO] Exclude: test-profiles/test_resources/ssl/**
[INFO] 9 resources included (use -debug for more details)
Warning:  org.apache.xerces.jaxp.SAXParserImpl$JAXPSAXParser: Property 'http://www.oracle.com/xml/jaxp/properties/entityExpansionLimit'
is not recognized.
Compiler warnings:
  WARNING:  'org.apache.xerces.jaxp.SAXParserImpl: Property 'http://javax.xml.XMLConstants/property/accessExternalDTD'
is not recognized.'
Warning:  org.apache.xerces.parsers.SAXParser: Feature 'http://javax.xml.XMLConstants/feature/secure-processing'
is not recognized.
Warning:  org.apache.xerces.parsers.SAXParser: Property 'http://javax.xml.XMLConstants/property/accessExternalDTD'
is not recognized.
Warning:  org.apache.xerces.parsers.SAXParser: Property 'http://www.oracle.com/xml/jaxp/properties/entityExpansionLimit'
is not recognized.
[INFO] 
[INFO] --- maven-site-plugin:3.3:stage (default-cli) @ qpid-bdbstore-systests ---
[INFO] Using this base directory for staging: <https://builds.apache.org/job/Qpid-Java-Java-Test-JDK1.8/ws/trunk/qpid/java/target/staging>
[INFO] Parent project loaded from repository: org.apache.qpid:qpid-parent:pom:1.0
file://<https://builds.apache.org/job/Qpid-Java-Java-Test-JDK1.8/ws/trunk/qpid/java/target/staging/>
- Session: Opened  
[INFO] Pushing <https://builds.apache.org/job/Qpid-Java-Java-Test-JDK1.8/ws/trunk/qpid/java/bdbstore/systests/target/site>
[INFO]    >>> to file://<https://builds.apache.org/job/Qpid-Java-Java-Test-JDK1.8/ws/trunk/qpid/java/target/staging/bdbstore/systests/qpid-systests-parent/qpid-bdbstore-systests>
file://<https://builds.apache.org/job/Qpid-Java-Java-Test-JDK1.8/ws/trunk/qpid/java/target/staging/>
- Session: Disconnecting  
file://<https://builds.apache.org/job/Qpid-Java-Java-Test-JDK1.8/ws/trunk/qpid/java/target/staging/>
- Session: Disconnected
[INFO] ------------------------------------------------------------------------
[INFO] Reactor Summary:
[INFO] 
[INFO] Qpid Java Build ................................... SUCCESS [19.949s]
[INFO] Qpid AMQP 1.0 Common .............................. SUCCESS [6.345s]
[INFO] Qpid AMQP 1.0 Client .............................. SUCCESS [1.993s]
[INFO] Qpid AMQP 1.0 Client JMS .......................... SUCCESS [3.637s]
[INFO] Qpid AMQP 1.0 JMS Client Examples ................. SUCCESS [1.562s]
[INFO] Qpid AMQP 1.0 Client WebSocket .................... SUCCESS [2.211s]
[INFO] Qpid Broker Code Generation ....................... SUCCESS [1.744s]
[INFO] Qpid Test Utilities ............................... SUCCESS [1.578s]
[INFO] Qpid Common ....................................... SUCCESS [32.612s]
[INFO] Qpid Management Common ............................ SUCCESS [3.149s]
[INFO] Qpid Java Broker Core ............................. SUCCESS [1:46.718s]
[INFO] Qpid Access Control Broker Plug-in ................ SUCCESS [5.214s]
[INFO] Qpid AMQP 0-8 Protocol Broker Plug-in ............. SUCCESS [22.102s]
[INFO] Qpid AMQP 0-10 Protocol Plug-in ................... SUCCESS [5.562s]
[INFO] Qpid AMQP 1-0 Protocol Broker Plug-in ............. SUCCESS [2.112s]
[INFO] Qpid AMQP 0-8 to 0-10 Message Conversion Broker Plug-in  SUCCESS [1.778s]
[INFO] Qpid AMQP 0-8 to 1-0 Message Conversion Broker Plug-in  SUCCESS [1.774s]
[INFO] Qpid AMQP 0-10 to 1-0 Message Conversion Broker Plug-in  SUCCESS [1.742s]
[INFO] Qpid Derby Message Store .......................... SUCCESS [16.438s]
[INFO] Qpid JDBC Message Store Connection Pooling Plug-in  SUCCESS [1.567s]
[INFO] Qpid JDBC Message Store Broker Plug-in ............ SUCCESS [9.569s]
[INFO] Qpid HTTP Management Broker Plug-in ............... SUCCESS [7.159s]
[INFO] Qpid JMX Management Broker Plug-in ................ SUCCESS [4.472s]
[INFO] Qpid Memory Message Store Broker Plug-in .......... SUCCESS [1.980s]
[INFO] Qpid WebSocket Broker Plug-in ..................... SUCCESS [1.846s]
[INFO] Qpid AMQP 0-x JMS Client .......................... SUCCESS [9.744s]
[INFO] Qpid BDB Message Store ............................ SUCCESS [1:06.789s]
[INFO] Qpid BDB Message Store JMX ........................ SUCCESS [3.596s]
[INFO] Qpid Java Broker .................................. SUCCESS [5.957s]
[INFO] Qpid AMQP Management Protocol Broker Plug-in ...... SUCCESS [1.670s]
[INFO] Qpid AMQP 0-x JMS Client Examples ................. SUCCESS [1.580s]
[INFO] Qpid JCA .......................................... SUCCESS [4.218s]
[INFO] Qpid Resource Adaptor ............................. SUCCESS [1.798s]
[INFO] Qpid Tools ........................................ SUCCESS [1.869s]
[INFO] Qpid Management Examples .......................... SUCCESS [1.341s]
[INFO] Qpid Java System Test Parent ...................... SUCCESS [1.928s]
[INFO] Qpid System Tests ................................. SUCCESS [15:13.050s]
[INFO] Qpid Performance Tests ............................ SUCCESS [3:44.623s]
[INFO] Qpid Performance Test System Tests ................ FAILURE [17.886s]
[INFO] Qpid Performance Tests Visualisation JFC .......... SUCCESS [7.415s]
[INFO] Qpid BDB Store System Tests ....................... SUCCESS [3.709s]
[INFO] ------------------------------------------------------------------------
[INFO] BUILD FAILURE
[INFO] ------------------------------------------------------------------------
[INFO] Total time: 25:32.680s
[INFO] Finished at: Sun Feb 01 02:25:40 UTC 2015
[INFO] Final Memory: 121M/1187M
[INFO] ------------------------------------------------------------------------
[ERROR] Failed to execute goal org.apache.maven.plugins:maven-surefire-plugin:2.16:test (integration-test)
on project qpid-perftests-systests: There are test failures.
[ERROR] 
[ERROR] Please refer to <https://builds.apache.org/job/Qpid-Java-Java-Test-JDK1.8/ws/trunk/qpid/java/qpid-perftests-systests/target/surefire-reports>
for the individual test results.
[ERROR] -> [Help 1]
[ERROR] 
[ERROR] To see the full stack trace of the errors, re-run Maven with the -e switch.
[ERROR] Re-run Maven using the -X switch to enable full debug logging.
[ERROR] 
[ERROR] For more information about the errors and possible solutions, please read the following
articles:
[ERROR] [Help 1] http://cwiki.apache.org/confluence/display/MAVEN/MojoFailureException
[ERROR] 
[ERROR] After correcting the problems, you can resume the build with the command
[ERROR]   mvn <goals> -rf :qpid-perftests-systests
Build step 'Invoke top-level Maven targets' marked build as failure
[locks-and-latches] Releasing all the locks
[locks-and-latches] All the locks released
Recording test results

Mime
View raw message