qpid-notifications mailing list archives

Site index · List index
Message view « Date » · « Thread »
Top « Date » · « Thread »
From Apache Jenkins Server <jenk...@builds.apache.org>
Subject Build failed in Jenkins: Qpid-proton-j-Deploy #394
Date Fri, 20 Feb 2015 03:03:48 GMT
See <https://builds.apache.org/job/Qpid-proton-j-Deploy/394/changes>

Changes:

[rhs] PROTON-822: removed some references I missed in my prior purge of deprecated message
cruft

[dominic.evans] PROTON-811: safely handle TransportException

[dominic.evans] PROTON-811: FrameWriter: stop encoding a null body

[dominic.evans] PROTON-811: fix coding error in TransportImpl#tick

[astitcher] Fix "NO-JIRA: Enable valgrind testing for python tests." for Windows

------------------------------------------
[...truncated 856 lines...]
Downloading: http://repo.maven.apache.org/maven2/org/codehaus/plexus/plexus-utils/3.0.8/plexus-utils-3.0.8.jar
Downloaded: http://repo.maven.apache.org/maven2/org/apache/maven/maven-archiver/2.5/maven-archiver-2.5.jar
(22 KB at 284.0 KB/sec)
Downloaded: http://repo.maven.apache.org/maven2/org/codehaus/plexus/plexus-interpolation/1.15/plexus-interpolation-1.15.jar
(60 KB at 787.4 KB/sec)
Downloaded: http://repo.maven.apache.org/maven2/org/codehaus/plexus/plexus-utils/3.0.8/plexus-utils-3.0.8.jar
(227 KB at 2021.3 KB/sec)
Downloaded: http://repo.maven.apache.org/maven2/org/codehaus/plexus/plexus-io/2.0.4/plexus-io-2.0.4.jar
(57 KB at 508.2 KB/sec)
Downloaded: http://repo.maven.apache.org/maven2/org/codehaus/plexus/plexus-archiver/2.2/plexus-archiver-2.2.jar
(181 KB at 1003.6 KB/sec)
[INFO] 
[INFO] --- maven-install-plugin:2.3.1:install (default-install) @ proton-project ---
Downloading: http://repo.maven.apache.org/maven2/org/codehaus/plexus/plexus-digest/1.0/plexus-digest-1.0.pom
Downloaded: http://repo.maven.apache.org/maven2/org/codehaus/plexus/plexus-digest/1.0/plexus-digest-1.0.pom
(2 KB at 13.6 KB/sec)
Downloading: http://repo.maven.apache.org/maven2/org/codehaus/plexus/plexus-components/1.1.7/plexus-components-1.1.7.pom
Downloaded: http://repo.maven.apache.org/maven2/org/codehaus/plexus/plexus-components/1.1.7/plexus-components-1.1.7.pom
(5 KB at 65.7 KB/sec)
Downloading: http://repo.maven.apache.org/maven2/org/codehaus/plexus/plexus-utils/2.0.5/plexus-utils-2.0.5.jar
Downloading: http://repo.maven.apache.org/maven2/org/codehaus/plexus/plexus-digest/1.0/plexus-digest-1.0.jar
Downloaded: http://repo.maven.apache.org/maven2/org/codehaus/plexus/plexus-digest/1.0/plexus-digest-1.0.jar
(12 KB at 154.4 KB/sec)
Downloaded: http://repo.maven.apache.org/maven2/org/codehaus/plexus/plexus-utils/2.0.5/plexus-utils-2.0.5.jar
(218 KB at 1042.8 KB/sec)
[INFO] Installing <https://builds.apache.org/job/Qpid-proton-j-Deploy/ws/pom.xml> to
<https://builds.apache.org/job/Qpid-proton-j-Deploy/ws/.repository/org/apache/qpid/proton-project/1.0-SNAPSHOT/proton-project-1.0-SNAPSHOT.pom>
[INFO] 
[INFO] --- maven-deploy-plugin:2.7:deploy (default-deploy) @ proton-project ---
Downloading: http://repo.maven.apache.org/maven2/org/codehaus/plexus/plexus-utils/1.5.6/plexus-utils-1.5.6.pom
Downloaded: http://repo.maven.apache.org/maven2/org/codehaus/plexus/plexus-utils/1.5.6/plexus-utils-1.5.6.pom
(6 KB at 70.9 KB/sec)
Downloading: http://repo.maven.apache.org/maven2/org/codehaus/plexus/plexus/1.0.12/plexus-1.0.12.pom
Downloaded: http://repo.maven.apache.org/maven2/org/codehaus/plexus/plexus/1.0.12/plexus-1.0.12.pom
(10 KB at 127.6 KB/sec)
Downloading: http://repo.maven.apache.org/maven2/org/codehaus/plexus/plexus-utils/1.5.6/plexus-utils-1.5.6.jar
Downloaded: http://repo.maven.apache.org/maven2/org/codehaus/plexus/plexus-utils/1.5.6/plexus-utils-1.5.6.jar
(245 KB at 1148.7 KB/sec)
Downloading: https://repository.apache.org/content/repositories/snapshots/org/apache/qpid/proton-project/1.0-SNAPSHOT/maven-metadata.xml
Downloaded: https://repository.apache.org/content/repositories/snapshots/org/apache/qpid/proton-project/1.0-SNAPSHOT/maven-metadata.xml
(606 B at 0.6 KB/sec)
Uploading: https://repository.apache.org/content/repositories/snapshots/org/apache/qpid/proton-project/1.0-SNAPSHOT/proton-project-1.0-20150220.030324-335.pom
Uploaded: https://repository.apache.org/content/repositories/snapshots/org/apache/qpid/proton-project/1.0-SNAPSHOT/proton-project-1.0-20150220.030324-335.pom
(5 KB at 15.2 KB/sec)
Downloading: https://repository.apache.org/content/repositories/snapshots/org/apache/qpid/proton-project/maven-metadata.xml
Downloaded: https://repository.apache.org/content/repositories/snapshots/org/apache/qpid/proton-project/maven-metadata.xml
(345 B at 1.2 KB/sec)
Uploading: https://repository.apache.org/content/repositories/snapshots/org/apache/qpid/proton-project/1.0-SNAPSHOT/maven-metadata.xml
Uploaded: https://repository.apache.org/content/repositories/snapshots/org/apache/qpid/proton-project/1.0-SNAPSHOT/maven-metadata.xml
(606 B at 2.3 KB/sec)
Uploading: https://repository.apache.org/content/repositories/snapshots/org/apache/qpid/proton-project/maven-metadata.xml
Uploaded: https://repository.apache.org/content/repositories/snapshots/org/apache/qpid/proton-project/maven-metadata.xml
(345 B at 1.0 KB/sec)
[JENKINS] Archiving disabled
[INFO]                                                                         
[INFO] ------------------------------------------------------------------------
[INFO] Building proton-j 1.0-SNAPSHOT
[INFO] ------------------------------------------------------------------------
Downloading: http://repo.maven.apache.org/maven2/org/apache/maven/plugins/maven-resources-plugin/2.6/maven-resources-plugin-2.6.pom
Downloaded: http://repo.maven.apache.org/maven2/org/apache/maven/plugins/maven-resources-plugin/2.6/maven-resources-plugin-2.6.pom
(8 KB at 107.1 KB/sec)
Downloading: http://repo.maven.apache.org/maven2/org/apache/maven/plugins/maven-resources-plugin/2.6/maven-resources-plugin-2.6.jar
Downloaded: http://repo.maven.apache.org/maven2/org/apache/maven/plugins/maven-resources-plugin/2.6/maven-resources-plugin-2.6.jar
(29 KB at 389.6 KB/sec)
Downloading: http://repo.maven.apache.org/maven2/org/apache/maven/plugins/maven-compiler-plugin/2.5.1/maven-compiler-plugin-2.5.1.pom
Downloaded: http://repo.maven.apache.org/maven2/org/apache/maven/plugins/maven-compiler-plugin/2.5.1/maven-compiler-plugin-2.5.1.pom
(8 KB at 103.2 KB/sec)
Downloading: http://repo.maven.apache.org/maven2/org/apache/maven/plugins/maven-compiler-plugin/2.5.1/maven-compiler-plugin-2.5.1.jar
Downloaded: http://repo.maven.apache.org/maven2/org/apache/maven/plugins/maven-compiler-plugin/2.5.1/maven-compiler-plugin-2.5.1.jar
(32 KB at 434.9 KB/sec)
Downloading: http://repo.maven.apache.org/maven2/org/apache/maven/plugins/maven-surefire-plugin/2.12.4/maven-surefire-plugin-2.12.4.pom
Downloaded: http://repo.maven.apache.org/maven2/org/apache/maven/plugins/maven-surefire-plugin/2.12.4/maven-surefire-plugin-2.12.4.pom
(11 KB at 138.2 KB/sec)
Downloading: http://repo.maven.apache.org/maven2/org/apache/maven/surefire/surefire/2.12.4/surefire-2.12.4.pom
Downloaded: http://repo.maven.apache.org/maven2/org/apache/maven/surefire/surefire/2.12.4/surefire-2.12.4.pom
(14 KB at 182.0 KB/sec)
Downloading: http://repo.maven.apache.org/maven2/org/apache/maven/plugins/maven-surefire-plugin/2.12.4/maven-surefire-plugin-2.12.4.jar
Downloaded: http://repo.maven.apache.org/maven2/org/apache/maven/plugins/maven-surefire-plugin/2.12.4/maven-surefire-plugin-2.12.4.jar
(30 KB at 396.6 KB/sec)
Downloading: http://repo.maven.apache.org/maven2/org/apache/maven/plugins/maven-jar-plugin/2.4/maven-jar-plugin-2.4.pom
Downloaded: http://repo.maven.apache.org/maven2/org/apache/maven/plugins/maven-jar-plugin/2.4/maven-jar-plugin-2.4.pom
(6 KB at 77.0 KB/sec)
Downloading: http://repo.maven.apache.org/maven2/org/apache/maven/plugins/maven-jar-plugin/2.4/maven-jar-plugin-2.4.jar
Downloaded: http://repo.maven.apache.org/maven2/org/apache/maven/plugins/maven-jar-plugin/2.4/maven-jar-plugin-2.4.jar
(34 KB at 449.0 KB/sec)
[INFO] 
[INFO] --- maven-clean-plugin:2.5:clean (default-clean) @ proton-j ---
[INFO] 
[INFO] --- maven-remote-resources-plugin:1.4:process (default) @ proton-j ---
[INFO] 
[INFO] --- maven-resources-plugin:2.6:resources (default-resources) @ proton-j ---
Downloading: http://repo.maven.apache.org/maven2/org/codehaus/plexus/plexus-interpolation/1.13/plexus-interpolation-1.13.jar
Downloaded: http://repo.maven.apache.org/maven2/org/codehaus/plexus/plexus-interpolation/1.13/plexus-interpolation-1.13.jar
(60 KB at 774.4 KB/sec)
[INFO] Using 'UTF-8' encoding to copy filtered resources.
[INFO] Copying 18 resources
[INFO] Copying 3 resources
[INFO] 
[INFO] --- maven-compiler-plugin:2.5.1:compile (default-compile) @ proton-j ---
Downloading: http://repo.maven.apache.org/maven2/org/apache/maven/maven-core/2.0.9/maven-core-2.0.9.pom
Downloaded: http://repo.maven.apache.org/maven2/org/apache/maven/maven-core/2.0.9/maven-core-2.0.9.pom
(8 KB at 101.4 KB/sec)
Downloading: http://repo.maven.apache.org/maven2/org/apache/maven/maven-plugin-parameter-documenter/2.0.9/maven-plugin-parameter-documenter-2.0.9.pom
Downloaded: http://repo.maven.apache.org/maven2/org/apache/maven/maven-plugin-parameter-documenter/2.0.9/maven-plugin-parameter-documenter-2.0.9.pom
(2 KB at 25.9 KB/sec)
Downloading: http://repo.maven.apache.org/maven2/org/apache/maven/maven-error-diagnostics/2.0.9/maven-error-diagnostics-2.0.9.pom
Downloaded: http://repo.maven.apache.org/maven2/org/apache/maven/maven-error-diagnostics/2.0.9/maven-error-diagnostics-2.0.9.pom
(2 KB at 23.0 KB/sec)
Downloading: http://repo.maven.apache.org/maven2/org/apache/maven/maven-plugin-descriptor/2.0.9/maven-plugin-descriptor-2.0.9.pom
Downloaded: http://repo.maven.apache.org/maven2/org/apache/maven/maven-plugin-descriptor/2.0.9/maven-plugin-descriptor-2.0.9.pom
(3 KB at 27.4 KB/sec)
Downloading: http://repo.maven.apache.org/maven2/org/apache/maven/maven-monitor/2.0.9/maven-monitor-2.0.9.pom
Downloaded: http://repo.maven.apache.org/maven2/org/apache/maven/maven-monitor/2.0.9/maven-monitor-2.0.9.pom
(2 KB at 16.7 KB/sec)
Downloading: http://repo.maven.apache.org/maven2/org/apache/maven/maven-toolchain/1.0/maven-toolchain-1.0.pom
Downloaded: http://repo.maven.apache.org/maven2/org/apache/maven/maven-toolchain/1.0/maven-toolchain-1.0.pom
(4 KB at 45.1 KB/sec)
Downloading: http://repo.maven.apache.org/maven2/org/codehaus/plexus/plexus-compiler-api/1.9.1/plexus-compiler-api-1.9.1.pom
Downloaded: http://repo.maven.apache.org/maven2/org/codehaus/plexus/plexus-compiler-api/1.9.1/plexus-compiler-api-1.9.1.pom
(867 B at 11.4 KB/sec)
Downloading: http://repo.maven.apache.org/maven2/org/codehaus/plexus/plexus-compiler/1.9.1/plexus-compiler-1.9.1.pom
Downloaded: http://repo.maven.apache.org/maven2/org/codehaus/plexus/plexus-compiler/1.9.1/plexus-compiler-1.9.1.pom
(4 KB at 50.7 KB/sec)
Downloading: http://repo.maven.apache.org/maven2/org/codehaus/plexus/plexus-compiler-manager/1.9.1/plexus-compiler-manager-1.9.1.pom
Downloaded: http://repo.maven.apache.org/maven2/org/codehaus/plexus/plexus-compiler-manager/1.9.1/plexus-compiler-manager-1.9.1.pom
(692 B at 9.1 KB/sec)
Downloading: http://repo.maven.apache.org/maven2/org/codehaus/plexus/plexus-compiler-javac/1.9.1/plexus-compiler-javac-1.9.1.pom
Downloaded: http://repo.maven.apache.org/maven2/org/codehaus/plexus/plexus-compiler-javac/1.9.1/plexus-compiler-javac-1.9.1.pom
(688 B at 9.1 KB/sec)
Downloading: http://repo.maven.apache.org/maven2/org/codehaus/plexus/plexus-compilers/1.9.1/plexus-compilers-1.9.1.pom
Downloaded: http://repo.maven.apache.org/maven2/org/codehaus/plexus/plexus-compilers/1.9.1/plexus-compilers-1.9.1.pom
(2 KB at 16.2 KB/sec)
Downloading: http://repo.maven.apache.org/maven2/org/codehaus/plexus/plexus-compiler-api/1.9.1/plexus-compiler-api-1.9.1.jar
Downloading: http://repo.maven.apache.org/maven2/org/codehaus/plexus/plexus-compiler-manager/1.9.1/plexus-compiler-manager-1.9.1.jar
Downloading: http://repo.maven.apache.org/maven2/org/codehaus/plexus/plexus-compiler-javac/1.9.1/plexus-compiler-javac-1.9.1.jar
Downloaded: http://repo.maven.apache.org/maven2/org/codehaus/plexus/plexus-compiler-manager/1.9.1/plexus-compiler-manager-1.9.1.jar
(5 KB at 60.9 KB/sec)
Downloaded: http://repo.maven.apache.org/maven2/org/codehaus/plexus/plexus-compiler-api/1.9.1/plexus-compiler-api-1.9.1.jar
(21 KB at 278.6 KB/sec)
Downloaded: http://repo.maven.apache.org/maven2/org/codehaus/plexus/plexus-compiler-javac/1.9.1/plexus-compiler-javac-1.9.1.jar
(14 KB at 183.9 KB/sec)
[INFO] Compiling 301 source files to <https://builds.apache.org/job/Qpid-proton-j-Deploy/ws/proton-j/target/classes>
[WARNING] <https://builds.apache.org/job/Qpid-proton-j-Deploy/ws/proton-j/src/main/java/org/apache/qpid/proton/engine/Connection.java>:[44,19]
[deprecation] ConnectionImpl() in org.apache.qpid.proton.engine.impl.ConnectionImpl has been
deprecated
[WARNING] <https://builds.apache.org/job/Qpid-proton-j-Deploy/ws/proton-j/src/main/java/org/apache/qpid/proton/engine/Transport.java>:[73,19]
[deprecation] TransportImpl() in org.apache.qpid.proton.engine.impl.TransportImpl has been
deprecated
[WARNING] <https://builds.apache.org/job/Qpid-proton-j-Deploy/ws/proton-j/src/main/java/org/apache/qpid/proton/engine/SslDomain.java>:[32,19]
[deprecation] SslDomainImpl() in org.apache.qpid.proton.engine.impl.ssl.SslDomainImpl has
been deprecated
[WARNING] <https://builds.apache.org/job/Qpid-proton-j-Deploy/ws/proton-j/src/main/java/org/apache/qpid/proton/engine/SslPeerDetails.java>:[37,19]
[deprecation] SslPeerDetailsImpl(java.lang.String,int) in org.apache.qpid.proton.engine.impl.ssl.SslPeerDetailsImpl
has been deprecated
[WARNING] <https://builds.apache.org/job/Qpid-proton-j-Deploy/ws/proton-j/src/main/java/org/apache/qpid/proton/engine/impl/TransportImpl.java>:[302,15]
[deprecation] output(byte[],int,int) in org.apache.qpid.proton.engine.Transport has been deprecated
[WARNING] <https://builds.apache.org/job/Qpid-proton-j-Deploy/ws/proton-j/src/main/java/org/apache/qpid/proton/engine/impl/TransportImpl.java>:[271,15]
[deprecation] input(byte[],int,int) in org.apache.qpid.proton.engine.Transport has been deprecated
[WARNING] <https://builds.apache.org/job/Qpid-proton-j-Deploy/ws/proton-j/src/main/java/org/apache/qpid/proton/engine/impl/LinkImpl.java>:[329,16]
[deprecation] setRemoteSenderSettleMode(org.apache.qpid.proton.amqp.transport.SenderSettleMode)
in org.apache.qpid.proton.engine.Link has been deprecated
[WARNING] <https://builds.apache.org/job/Qpid-proton-j-Deploy/ws/proton-j/src/main/java/org/apache/qpid/proton/message/Message.java>:[45,19]
[deprecation] MessageImpl() in org.apache.qpid.proton.message.impl.MessageImpl has been deprecated
[WARNING] <https://builds.apache.org/job/Qpid-proton-j-Deploy/ws/proton-j/src/main/java/org/apache/qpid/proton/message/Message.java>:[55,19]
[deprecation] MessageImpl(org.apache.qpid.proton.amqp.messaging.Header,org.apache.qpid.proton.amqp.messaging.DeliveryAnnotations,org.apache.qpid.proton.amqp.messaging.MessageAnnotations,org.apache.qpid.proton.amqp.messaging.Properties,org.apache.qpid.proton.amqp.messaging.ApplicationProperties,org.apache.qpid.proton.amqp.messaging.Section,org.apache.qpid.proton.amqp.messaging.Footer)
in org.apache.qpid.proton.message.impl.MessageImpl has been deprecated
[WARNING] <https://builds.apache.org/job/Qpid-proton-j-Deploy/ws/proton-j/src/main/java/org/apache/qpid/proton/messenger/Messenger.java>:[78,19]
[deprecation] MessengerImpl() in org.apache.qpid.proton.messenger.impl.MessengerImpl has been
deprecated
[WARNING] <https://builds.apache.org/job/Qpid-proton-j-Deploy/ws/proton-j/src/main/java/org/apache/qpid/proton/messenger/Messenger.java>:[82,19]
[deprecation] MessengerImpl(java.lang.String) in org.apache.qpid.proton.messenger.impl.MessengerImpl
has been deprecated
[INFO] 
[INFO] --- maven-resources-plugin:2.6:testResources (default-testResources) @ proton-j ---
[INFO] Using 'UTF-8' encoding to copy filtered resources.
[INFO] Copying 1 resource
[INFO] Copying 3 resources
[INFO] 
[INFO] --- maven-compiler-plugin:2.5.1:testCompile (default-testCompile) @ proton-j ---
[INFO] Compiling 32 source files to <https://builds.apache.org/job/Qpid-proton-j-Deploy/ws/proton-j/target/test-classes>
[INFO] -------------------------------------------------------------
[ERROR] COMPILATION ERROR : 
[INFO] -------------------------------------------------------------
[ERROR] <https://builds.apache.org/job/Qpid-proton-j-Deploy/ws/proton-j/src/test/java/org/apache/qpid/proton/systemtests/engine/TransportTest.java>:[54,22]
[deprecation] input(byte[],int,int) in org.apache.qpid.proton.engine.Transport has been deprecated
[ERROR] <https://builds.apache.org/job/Qpid-proton-j-Deploy/ws/proton-j/src/test/java/org/apache/qpid/proton/systemtests/engine/TransportTest.java>:[66,37]
[deprecation] output(byte[],int,int) in org.apache.qpid.proton.engine.Transport has been deprecated
[ERROR] <https://builds.apache.org/job/Qpid-proton-j-Deploy/ws/proton-j/src/test/java/org/apache/qpid/proton/systemtests/engine/TransportTest.java>:[79,37]
[deprecation] input(byte[],int,int) in org.apache.qpid.proton.engine.Transport has been deprecated
[ERROR] <https://builds.apache.org/job/Qpid-proton-j-Deploy/ws/proton-j/src/test/java/org/apache/qpid/proton/systemtests/engine/TransportTest.java>:[83,36]
[deprecation] output(byte[],int,int) in org.apache.qpid.proton.engine.Transport has been deprecated
[ERROR] <https://builds.apache.org/job/Qpid-proton-j-Deploy/ws/proton-j/src/test/java/org/apache/qpid/proton/systemtests/engine/TransportPumper.java>:[64,40]
[deprecation] output(byte[],int,int) in org.apache.qpid.proton.engine.Transport has been deprecated
[ERROR] <https://builds.apache.org/job/Qpid-proton-j-Deploy/ws/proton-j/src/test/java/org/apache/qpid/proton/systemtests/engine/TransportPumper.java>:[67,52]
[deprecation] input(byte[],int,int) in org.apache.qpid.proton.engine.Transport has been deprecated
[ERROR] <https://builds.apache.org/job/Qpid-proton-j-Deploy/ws/proton-j/src/test/java/org/apache/qpid/proton/engine/impl/ssl/RememberingTransportInput.java>:[28,0]
org.apache.qpid.proton.engine.impl.ssl.RememberingTransportInput is not abstract and does
not override abstract method position() in org.apache.qpid.proton.engine.impl.TransportInput
[ERROR] <https://builds.apache.org/job/Qpid-proton-j-Deploy/ws/proton-j/src/test/java/org/apache/qpid/proton/systemtests/engine/ConnectionTest.java>:[91,45]
[deprecation] input(byte[],int,int) in org.apache.qpid.proton.engine.Transport has been deprecated
[ERROR] <https://builds.apache.org/job/Qpid-proton-j-Deploy/ws/proton-j/src/test/java/org/apache/qpid/proton/systemtests/engine/ConnectionTest.java>:[118,45]
[deprecation] input(byte[],int,int) in org.apache.qpid.proton.engine.Transport has been deprecated
[ERROR] <https://builds.apache.org/job/Qpid-proton-j-Deploy/ws/proton-j/src/test/java/org/apache/qpid/proton/systemtests/engine/ConnectionTest.java>:[149,45]
[deprecation] input(byte[],int,int) in org.apache.qpid.proton.engine.Transport has been deprecated
[ERROR] <https://builds.apache.org/job/Qpid-proton-j-Deploy/ws/proton-j/src/test/java/org/apache/qpid/proton/systemtests/engine/ConnectionTest.java>:[167,45]
[deprecation] input(byte[],int,int) in org.apache.qpid.proton.engine.Transport has been deprecated
[ERROR] <https://builds.apache.org/job/Qpid-proton-j-Deploy/ws/proton-j/src/test/java/org/apache/qpid/proton/systemtests/engine/ConnectionTest.java>:[194,44]
[deprecation] input(byte[],int,int) in org.apache.qpid.proton.engine.Transport has been deprecated
[ERROR] <https://builds.apache.org/job/Qpid-proton-j-Deploy/ws/proton-j/src/test/java/org/apache/qpid/proton/systemtests/engine/ConnectionTest.java>:[213,33]
[deprecation] input(byte[],int,int) in org.apache.qpid.proton.engine.Transport has been deprecated
[ERROR] <https://builds.apache.org/job/Qpid-proton-j-Deploy/ws/proton-j/src/test/java/org/apache/qpid/proton/systemtests/engine/ConnectionTest.java>:[401,24]
[deprecation] input(byte[],int,int) in org.apache.qpid.proton.engine.Transport has been deprecated
[ERROR] <https://builds.apache.org/job/Qpid-proton-j-Deploy/ws/proton-j/src/test/java/org/apache/qpid/proton/engine/impl/TransportImplTest.java>:[231,12]
[deprecation] TransportImpl() in org.apache.qpid.proton.engine.impl.TransportImpl has been
deprecated
[INFO] 15 errors 
[INFO] -------------------------------------------------------------
[JENKINS] Archiving disabled
[INFO]                                                                         
[INFO] ------------------------------------------------------------------------
[INFO] Skipping proton-jms
[INFO] This project has been banned from the build due to previous failures.
[INFO] ------------------------------------------------------------------------
[INFO]                                                                         
[INFO] ------------------------------------------------------------------------
[INFO] Skipping proton-hawtdispatch
[INFO] This project has been banned from the build due to previous failures.
[INFO] ------------------------------------------------------------------------
[INFO]                                                                         
[INFO] ------------------------------------------------------------------------
[INFO] Skipping proton-tests
[INFO] This project has been banned from the build due to previous failures.
[INFO] ------------------------------------------------------------------------
[INFO]                                                                         
[INFO] ------------------------------------------------------------------------
[INFO] Skipping proton-j-messenger-example
[INFO] This project has been banned from the build due to previous failures.
[INFO] ------------------------------------------------------------------------
[INFO] ------------------------------------------------------------------------
[INFO] Reactor Summary:
[INFO] 
[INFO] proton-project .................................... SUCCESS [34.964s]
[INFO] proton-j .......................................... FAILURE [6.128s]
[INFO] proton-jms ........................................ SKIPPED
[INFO] proton-hawtdispatch ............................... SKIPPED
[INFO] proton-tests ...................................... SKIPPED
[INFO] proton-j-messenger-example ........................ SKIPPED
[INFO] ------------------------------------------------------------------------
[INFO] BUILD FAILURE
[INFO] ------------------------------------------------------------------------
[INFO] Total time: 44.336s
[INFO] Finished at: Fri Feb 20 03:03:33 UTC 2015
[INFO] Final Memory: 18M/981M
[INFO] ------------------------------------------------------------------------
[JENKINS] Archiving disabled
[JENKINS] Archiving disabled
[JENKINS] Archiving disabled
[JENKINS] Archiving disabled
[JENKINS] Archiving disabled
[JENKINS] Archiving disabled
Waiting for Jenkins to finish collecting data[ERROR] Failed to execute goal org.apache.maven.plugins:maven-compiler-plugin:2.5.1:testCompile
(default-testCompile) on project proton-j: Compilation failure: Compilation failure:
[ERROR] <https://builds.apache.org/job/Qpid-proton-j-Deploy/ws/proton-j/src/test/java/org/apache/qpid/proton/systemtests/engine/TransportTest.java>:[54,22]
[deprecation] input(byte[],int,int) in org.apache.qpid.proton.engine.Transport has been deprecated
[ERROR] <https://builds.apache.org/job/Qpid-proton-j-Deploy/ws/proton-j/src/test/java/org/apache/qpid/proton/systemtests/engine/TransportTest.java>:[66,37]
[deprecation] output(byte[],int,int) in org.apache.qpid.proton.engine.Transport has been deprecated
[ERROR] <https://builds.apache.org/job/Qpid-proton-j-Deploy/ws/proton-j/src/test/java/org/apache/qpid/proton/systemtests/engine/TransportTest.java>:[79,37]
[deprecation] input(byte[],int,int) in org.apache.qpid.proton.engine.Transport has been deprecated
[ERROR] <https://builds.apache.org/job/Qpid-proton-j-Deploy/ws/proton-j/src/test/java/org/apache/qpid/proton/systemtests/engine/TransportTest.java>:[83,36]
[deprecation] output(byte[],int,int) in org.apache.qpid.proton.engine.Transport has been deprecated
[ERROR] <https://builds.apache.org/job/Qpid-proton-j-Deploy/ws/proton-j/src/test/java/org/apache/qpid/proton/systemtests/engine/TransportPumper.java>:[64,40]
[deprecation] output(byte[],int,int) in org.apache.qpid.proton.engine.Transport has been deprecated
[ERROR] <https://builds.apache.org/job/Qpid-proton-j-Deploy/ws/proton-j/src/test/java/org/apache/qpid/proton/systemtests/engine/TransportPumper.java>:[67,52]
[deprecation] input(byte[],int,int) in org.apache.qpid.proton.engine.Transport has been deprecated
[ERROR] <https://builds.apache.org/job/Qpid-proton-j-Deploy/ws/proton-j/src/test/java/org/apache/qpid/proton/engine/impl/ssl/RememberingTransportInput.java>:[28,0]
org.apache.qpid.proton.engine.impl.ssl.RememberingTransportInput is not abstract and does
not override abstract method position() in org.apache.qpid.proton.engine.impl.TransportInput
[ERROR] <https://builds.apache.org/job/Qpid-proton-j-Deploy/ws/proton-j/src/test/java/org/apache/qpid/proton/systemtests/engine/ConnectionTest.java>:[91,45]
[deprecation] input(byte[],int,int) in org.apache.qpid.proton.engine.Transport has been deprecated
[ERROR] <https://builds.apache.org/job/Qpid-proton-j-Deploy/ws/proton-j/src/test/java/org/apache/qpid/proton/systemtests/engine/ConnectionTest.java>:[118,45]
[deprecation] input(byte[],int,int) in org.apache.qpid.proton.engine.Transport has been deprecated
[ERROR] <https://builds.apache.org/job/Qpid-proton-j-Deploy/ws/proton-j/src/test/java/org/apache/qpid/proton/systemtests/engine/ConnectionTest.java>:[149,45]
[deprecation] input(byte[],int,int) in org.apache.qpid.proton.engine.Transport has been deprecated
[ERROR] <https://builds.apache.org/job/Qpid-proton-j-Deploy/ws/proton-j/src/test/java/org/apache/qpid/proton/systemtests/engine/ConnectionTest.java>:[167,45]
[deprecation] input(byte[],int,int) in org.apache.qpid.proton.engine.Transport has been deprecated
[ERROR] <https://builds.apache.org/job/Qpid-proton-j-Deploy/ws/proton-j/src/test/java/org/apache/qpid/proton/systemtests/engine/ConnectionTest.java>:[194,44]
[deprecation] input(byte[],int,int) in org.apache.qpid.proton.engine.Transport has been deprecated
[ERROR] <https://builds.apache.org/job/Qpid-proton-j-Deploy/ws/proton-j/src/test/java/org/apache/qpid/proton/systemtests/engine/ConnectionTest.java>:[213,33]
[deprecation] input(byte[],int,int) in org.apache.qpid.proton.engine.Transport has been deprecated
[ERROR] <https://builds.apache.org/job/Qpid-proton-j-Deploy/ws/proton-j/src/test/java/org/apache/qpid/proton/systemtests/engine/ConnectionTest.java>:[401,24]
[deprecation] input(byte[],int,int) in org.apache.qpid.proton.engine.Transport has been deprecated
[ERROR] <https://builds.apache.org/job/Qpid-proton-j-Deploy/ws/proton-j/src/test/java/org/apache/qpid/proton/engine/impl/TransportImplTest.java>:[231,12]
[deprecation] TransportImpl() in org.apache.qpid.proton.engine.impl.TransportImpl has been
deprecated
[ERROR] -> [Help 1]
org.apache.maven.lifecycle.LifecycleExecutionException: Failed to execute goal org.apache.maven.plugins:maven-compiler-plugin:2.5.1:testCompile
(default-testCompile) on project proton-j: Compilation failure
	at org.apache.maven.lifecycle.internal.MojoExecutor.execute(MojoExecutor.java:213)
	at org.apache.maven.lifecycle.internal.MojoExecutor.execute(MojoExecutor.java:153)
	at org.apache.maven.lifecycle.internal.MojoExecutor.execute(MojoExecutor.java:145)
	at org.apache.maven.lifecycle.internal.LifecycleModuleBuilder.buildProject(LifecycleModuleBuilder.java:84)
	at org.apache.maven.lifecycle.internal.LifecycleModuleBuilder.buildProject(LifecycleModuleBuilder.java:59)
	at org.apache.maven.lifecycle.internal.LifecycleStarter.singleThreadedBuild(LifecycleStarter.java:183)
	at org.apache.maven.lifecycle.internal.LifecycleStarter.execute(LifecycleStarter.java:161)
	at org.apache.maven.DefaultMaven.doExecute(DefaultMaven.java:320)
	at org.apache.maven.DefaultMaven.execute(DefaultMaven.java:156)
	at org.jvnet.hudson.maven3.launcher.Maven3Launcher.main(Maven3Launcher.java:117)
	at sun.reflect.NativeMethodAccessorImpl.invoke0(Native Method)
	at sun.reflect.NativeMethodAccessorImpl.invoke(NativeMethodAccessorImpl.java:39)
	at sun.reflect.DelegatingMethodAccessorImpl.invoke(DelegatingMethodAccessorImpl.java:25)
	at java.lang.reflect.Method.invoke(Method.java:597)
	at org.codehaus.plexus.classworlds.launcher.Launcher.launchStandard(Launcher.java:329)
	at org.codehaus.plexus.classworlds.launcher.Launcher.launch(Launcher.java:239)
	at org.jvnet.hudson.maven3.agent.Maven3Main.launch(Maven3Main.java:178)
	at sun.reflect.NativeMethodAccessorImpl.invoke0(Native Method)
	at sun.reflect.NativeMethodAccessorImpl.invoke(NativeMethodAccessorImpl.java:39)
	at sun.reflect.DelegatingMethodAccessorImpl.invoke(DelegatingMethodAccessorImpl.java:25)
	at java.lang.reflect.Method.invoke(Method.java:597)
	at hudson.maven.Maven3Builder.call(Maven3Builder.java:136)
	at hudson.maven.Maven3Builder.call(Maven3Builder.java:71)
	at hudson.remoting.UserRequest.perform(UserRequest.java:118)
	at hudson.remoting.UserRequest.perform(UserRequest.java:48)
	at hudson.remoting.Request$2.run(Request.java:328)
	at hudson.remoting.InterceptingExecutorService$1.call(InterceptingExecutorService.java:72)
	at java.util.concurrent.FutureTask$Sync.innerRun(FutureTask.java:303)
	at java.util.concurrent.FutureTask.run(FutureTask.java:138)
	at java.util.concurrent.ThreadPoolExecutor$Worker.runTask(ThreadPoolExecutor.java:895)
	at java.util.concurrent.ThreadPoolExecutor$Worker.run(ThreadPoolExecutor.java:918)
	at java.lang.Thread.run(Thread.java:662)
Caused by: org.apache.maven.plugin.CompilationFailureException: Compilation failure
	at org.apache.maven.plugin.AbstractCompilerMojo.execute(AbstractCompilerMojo.java:729)
	at org.apache.maven.plugin.TestCompilerMojo.execute(TestCompilerMojo.java:161)
	at org.apache.maven.plugin.DefaultBuildPluginManager.executeMojo(DefaultBuildPluginManager.java:101)
	at org.apache.maven.lifecycle.internal.MojoExecutor.execute(MojoExecutor.java:209)
	... 31 more
[ERROR] 
[ERROR] Re-run Maven using the -X switch to enable full debug logging.
[ERROR] 
[ERROR] For more information about the errors and possible solutions, please read the following
articles:
[ERROR] [Help 1] http://cwiki.apache.org/confluence/display/MAVEN/MojoFailureException
[ERROR] 
[ERROR] After correcting the problems, you can resume the build with the command
[ERROR]   mvn <goals> -rf :proton-j

Sending e-mails to: notifications@qpid.apache.org
channel stopped

Mime
View raw message