qpid-notifications mailing list archives

Site index · List index
Message view « Date » · « Thread »
Top « Date » · « Thread »
From Apache Jenkins Server <jenk...@builds.apache.org>
Subject Build failed in Jenkins: Qpid-Java-Cpp-Test #2425
Date Thu, 19 Feb 2015 00:19:28 GMT
See <https://builds.apache.org/job/Qpid-Java-Cpp-Test/2425/changes>

Changes:

[gsim] QPID-6389: ensure source/target is null when responding to attach requests in which
they are also null

------------------------------------------
[...truncated 6466 lines...]
	at javax.naming.InitialContext.lookup(InitialContext.java:411)
	at javax.management.remote.rmi.RMIConnector.findRMIServerJNDI(RMIConnector.java:1925)
	at javax.management.remote.rmi.RMIConnector.findRMIServer(RMIConnector.java:1892)
	at javax.management.remote.rmi.RMIConnector.connect(RMIConnector.java:275)
	at javax.management.remote.JMXConnectorFactory.connect(JMXConnectorFactory.java:268)
	at org.apache.qpid.management.common.JMXConnnectionFactory$ConnectWaiter.run(JMXConnnectionFactory.java:245)
	at java.lang.Thread.run(Thread.java:724)

testReadonlyMBeanAttributes(org.apache.qpid.server.store.berkeleydb.replication.JMXManagementTest)
 Time elapsed: 0.127 sec  <<< ERROR!
java.io.IOException: null
	at org.apache.qpid.management.common.JMXConnnectionFactory.getJMXConnection(JMXConnnectionFactory.java:79)
	at org.apache.qpid.test.utils.JMXTestUtils.open(JMXTestUtils.java:87)
	at org.apache.qpid.server.store.berkeleydb.replication.JMXManagementTest.getStoreBeanForNodeAtBrokerPort(JMXManagementTest.java:276)
	at org.apache.qpid.server.store.berkeleydb.replication.JMXManagementTest.testReadonlyMBeanAttributes(JMXManagementTest.java:111)
Caused by: java.io.IOException: Failed to retrieve RMIServer stub: javax.naming.ServiceUnavailableException
[Root exception is java.rmi.ConnectException: Connection refused to host: 127.0.0.1; nested
exception is: 
	java.net.ConnectException: Connection refused]
	at javax.management.remote.rmi.RMIConnector.connect(RMIConnector.java:358)
	at javax.management.remote.JMXConnectorFactory.connect(JMXConnectorFactory.java:268)
	at org.apache.qpid.management.common.JMXConnnectionFactory$ConnectWaiter.run(JMXConnnectionFactory.java:245)
	at java.lang.Thread.run(Thread.java:724)
Caused by: javax.naming.ServiceUnavailableException: null
	at com.sun.jndi.rmi.registry.RegistryContext.lookup(RegistryContext.java:118)
	at com.sun.jndi.toolkit.url.GenericURLContext.lookup(GenericURLContext.java:203)
	at javax.naming.InitialContext.lookup(InitialContext.java:411)
	at javax.management.remote.rmi.RMIConnector.findRMIServerJNDI(RMIConnector.java:1925)
	at javax.management.remote.rmi.RMIConnector.findRMIServer(RMIConnector.java:1892)
	at javax.management.remote.rmi.RMIConnector.connect(RMIConnector.java:275)
	at javax.management.remote.JMXConnectorFactory.connect(JMXConnectorFactory.java:268)
	at org.apache.qpid.management.common.JMXConnnectionFactory$ConnectWaiter.run(JMXConnnectionFactory.java:245)
	at java.lang.Thread.run(Thread.java:724)
Caused by: java.rmi.ConnectException: Connection refused to host: 127.0.0.1; nested exception
is: 
	java.net.ConnectException: Connection refused
	at sun.rmi.transport.tcp.TCPEndpoint.newSocket(TCPEndpoint.java:619)
	at sun.rmi.transport.tcp.TCPChannel.createConnection(TCPChannel.java:216)
	at sun.rmi.transport.tcp.TCPChannel.newConnection(TCPChannel.java:202)
	at sun.rmi.server.UnicastRef.newCall(UnicastRef.java:340)
	at sun.rmi.registry.RegistryImpl_Stub.lookup(Unknown Source)
	at com.sun.jndi.rmi.registry.RegistryContext.lookup(RegistryContext.java:114)
	at com.sun.jndi.toolkit.url.GenericURLContext.lookup(GenericURLContext.java:203)
	at javax.naming.InitialContext.lookup(InitialContext.java:411)
	at javax.management.remote.rmi.RMIConnector.findRMIServerJNDI(RMIConnector.java:1925)
	at javax.management.remote.rmi.RMIConnector.findRMIServer(RMIConnector.java:1892)
	at javax.management.remote.rmi.RMIConnector.connect(RMIConnector.java:275)
	at javax.management.remote.JMXConnectorFactory.connect(JMXConnectorFactory.java:268)
	at org.apache.qpid.management.common.JMXConnnectionFactory$ConnectWaiter.run(JMXConnnectionFactory.java:245)
	at java.lang.Thread.run(Thread.java:724)
Caused by: java.net.ConnectException: Connection refused
	at java.net.PlainSocketImpl.socketConnect(Native Method)
	at java.net.AbstractPlainSocketImpl.doConnect(AbstractPlainSocketImpl.java:339)
	at java.net.AbstractPlainSocketImpl.connectToAddress(AbstractPlainSocketImpl.java:200)
	at java.net.AbstractPlainSocketImpl.connect(AbstractPlainSocketImpl.java:182)
	at java.net.SocksSocketImpl.connect(SocksSocketImpl.java:392)
	at java.net.Socket.connect(Socket.java:579)
	at java.net.Socket.connect(Socket.java:528)
	at java.net.Socket.<init>(Socket.java:425)
	at java.net.Socket.<init>(Socket.java:208)
	at sun.rmi.transport.proxy.RMIDirectSocketFactory.createSocket(RMIDirectSocketFactory.java:40)
	at sun.rmi.transport.proxy.RMIMasterSocketFactory.createSocket(RMIMasterSocketFactory.java:146)
	at sun.rmi.transport.tcp.TCPEndpoint.newSocket(TCPEndpoint.java:613)
	at sun.rmi.transport.tcp.TCPChannel.createConnection(TCPChannel.java:216)
	at sun.rmi.transport.tcp.TCPChannel.newConnection(TCPChannel.java:202)
	at sun.rmi.server.UnicastRef.newCall(UnicastRef.java:340)
	at sun.rmi.registry.RegistryImpl_Stub.lookup(Unknown Source)
	at com.sun.jndi.rmi.registry.RegistryContext.lookup(RegistryContext.java:114)
	at com.sun.jndi.toolkit.url.GenericURLContext.lookup(GenericURLContext.java:203)
	at javax.naming.InitialContext.lookup(InitialContext.java:411)
	at javax.management.remote.rmi.RMIConnector.findRMIServerJNDI(RMIConnector.java:1925)
	at javax.management.remote.rmi.RMIConnector.findRMIServer(RMIConnector.java:1892)
	at javax.management.remote.rmi.RMIConnector.connect(RMIConnector.java:275)
	at javax.management.remote.JMXConnectorFactory.connect(JMXConnectorFactory.java:268)
	at org.apache.qpid.management.common.JMXConnnectionFactory$ConnectWaiter.run(JMXConnnectionFactory.java:245)
	at java.lang.Thread.run(Thread.java:724)

Running org.apache.qpid.server.store.berkeleydb.replication.BDBHAVirtualHostRestTest
Tests run: 3, Failures: 0, Errors: 3, Skipped: 0, Time elapsed: 0.123 sec <<< FAILURE!
- in org.apache.qpid.server.store.berkeleydb.replication.BDBHAVirtualHostRestTest
testSetLocalTransactionSynchronizationPolicy(org.apache.qpid.server.store.berkeleydb.replication.BDBHAVirtualHostRestTest)
 Time elapsed: 0.043 sec  <<< ERROR!
java.net.ConnectException: Connection refused
	at java.net.PlainSocketImpl.socketConnect(Native Method)
	at java.net.AbstractPlainSocketImpl.doConnect(AbstractPlainSocketImpl.java:339)
	at java.net.AbstractPlainSocketImpl.connectToAddress(AbstractPlainSocketImpl.java:200)
	at java.net.AbstractPlainSocketImpl.connect(AbstractPlainSocketImpl.java:182)
	at java.net.SocksSocketImpl.connect(SocksSocketImpl.java:392)
	at java.net.Socket.connect(Socket.java:579)
	at sun.net.NetworkClient.doConnect(NetworkClient.java:175)
	at sun.net.www.http.HttpClient.openServer(HttpClient.java:378)
	at sun.net.www.http.HttpClient.openServer(HttpClient.java:473)
	at sun.net.www.http.HttpClient.<init>(HttpClient.java:203)
	at sun.net.www.http.HttpClient.New(HttpClient.java:290)
	at sun.net.www.http.HttpClient.New(HttpClient.java:306)
	at sun.net.www.protocol.http.HttpURLConnection.getNewHttpClient(HttpURLConnection.java:995)
	at sun.net.www.protocol.http.HttpURLConnection.plainConnect(HttpURLConnection.java:931)
	at sun.net.www.protocol.http.HttpURLConnection.connect(HttpURLConnection.java:849)
	at org.apache.qpid.systest.rest.RestTestHelper.getJsonAsList(RestTestHelper.java:290)
	at org.apache.qpid.systest.rest.QpidRestTestCase.waitForAttributeChanged(QpidRestTestCase.java:108)
	at org.apache.qpid.server.store.berkeleydb.replication.BDBHAVirtualHostRestTest.testSetLocalTransactionSynchronizationPolicy(BDBHAVirtualHostRestTest.java:116)

testMutateState(org.apache.qpid.server.store.berkeleydb.replication.BDBHAVirtualHostRestTest)
 Time elapsed: 0.035 sec  <<< ERROR!
java.net.ConnectException: Connection refused
	at java.net.PlainSocketImpl.socketConnect(Native Method)
	at java.net.AbstractPlainSocketImpl.doConnect(AbstractPlainSocketImpl.java:339)
	at java.net.AbstractPlainSocketImpl.connectToAddress(AbstractPlainSocketImpl.java:200)
	at java.net.AbstractPlainSocketImpl.connect(AbstractPlainSocketImpl.java:182)
	at java.net.SocksSocketImpl.connect(SocksSocketImpl.java:392)
	at java.net.Socket.connect(Socket.java:579)
	at sun.net.NetworkClient.doConnect(NetworkClient.java:175)
	at sun.net.www.http.HttpClient.openServer(HttpClient.java:378)
	at sun.net.www.http.HttpClient.openServer(HttpClient.java:473)
	at sun.net.www.http.HttpClient.<init>(HttpClient.java:203)
	at sun.net.www.http.HttpClient.New(HttpClient.java:290)
	at sun.net.www.http.HttpClient.New(HttpClient.java:306)
	at sun.net.www.protocol.http.HttpURLConnection.getNewHttpClient(HttpURLConnection.java:995)
	at sun.net.www.protocol.http.HttpURLConnection.plainConnect(HttpURLConnection.java:931)
	at sun.net.www.protocol.http.HttpURLConnection.connect(HttpURLConnection.java:849)
	at org.apache.qpid.systest.rest.RestTestHelper.getJsonAsList(RestTestHelper.java:290)
	at org.apache.qpid.systest.rest.QpidRestTestCase.waitForAttributeChanged(QpidRestTestCase.java:108)
	at org.apache.qpid.server.store.berkeleydb.replication.BDBHAVirtualHostRestTest.testMutateState(BDBHAVirtualHostRestTest.java:140)

testSetRemoteTransactionSynchronizationPolicy(org.apache.qpid.server.store.berkeleydb.replication.BDBHAVirtualHostRestTest)
 Time elapsed: 0.045 sec  <<< ERROR!
java.net.ConnectException: Connection refused
	at java.net.PlainSocketImpl.socketConnect(Native Method)
	at java.net.AbstractPlainSocketImpl.doConnect(AbstractPlainSocketImpl.java:339)
	at java.net.AbstractPlainSocketImpl.connectToAddress(AbstractPlainSocketImpl.java:200)
	at java.net.AbstractPlainSocketImpl.connect(AbstractPlainSocketImpl.java:182)
	at java.net.SocksSocketImpl.connect(SocksSocketImpl.java:392)
	at java.net.Socket.connect(Socket.java:579)
	at sun.net.NetworkClient.doConnect(NetworkClient.java:175)
	at sun.net.www.http.HttpClient.openServer(HttpClient.java:378)
	at sun.net.www.http.HttpClient.openServer(HttpClient.java:473)
	at sun.net.www.http.HttpClient.<init>(HttpClient.java:203)
	at sun.net.www.http.HttpClient.New(HttpClient.java:290)
	at sun.net.www.http.HttpClient.New(HttpClient.java:306)
	at sun.net.www.protocol.http.HttpURLConnection.getNewHttpClient(HttpURLConnection.java:995)
	at sun.net.www.protocol.http.HttpURLConnection.plainConnect(HttpURLConnection.java:931)
	at sun.net.www.protocol.http.HttpURLConnection.connect(HttpURLConnection.java:849)
	at org.apache.qpid.systest.rest.RestTestHelper.getJsonAsList(RestTestHelper.java:290)
	at org.apache.qpid.systest.rest.QpidRestTestCase.waitForAttributeChanged(QpidRestTestCase.java:108)
	at org.apache.qpid.server.store.berkeleydb.replication.BDBHAVirtualHostRestTest.testSetRemoteTransactionSynchronizationPolicy(BDBHAVirtualHostRestTest.java:128)


Results :

Failed tests: 
  MultiNodeTest>QpidTestCase.run:148->QpidBrokerTestCase.runBare:286->setUp:81 null
  MultiNodeTest>QpidTestCase.run:148->QpidBrokerTestCase.runBare:286->setUp:81 null
  MultiNodeTest>QpidTestCase.run:148->QpidBrokerTestCase.runBare:286->setUp:81 null
  MultiNodeTest>QpidTestCase.run:148->QpidBrokerTestCase.runBare:286->setUp:81 null
  MultiNodeTest>QpidTestCase.run:148->QpidBrokerTestCase.runBare:286->setUp:81 null
  MultiNodeTest>QpidTestCase.run:148->QpidBrokerTestCase.runBare:286->setUp:81 null
  MultiNodeTest>QpidTestCase.run:148->QpidBrokerTestCase.runBare:286->setUp:81 null
  MultiNodeTest>QpidTestCase.run:148->QpidBrokerTestCase.runBare:286->setUp:81 null
  MultiNodeTest>QpidTestCase.run:148->QpidBrokerTestCase.runBare:286->setUp:81 null
  MultiNodeTest>QpidTestCase.run:148->QpidBrokerTestCase.runBare:286->setUp:81 null
  TwoNodeTest>QpidTestCase.run:148->QpidBrokerTestCase.runBare:286->setUp:55 null
  TwoNodeTest>QpidTestCase.run:148->QpidBrokerTestCase.runBare:286->setUp:55 null
  TwoNodeTest>QpidTestCase.run:148->QpidBrokerTestCase.runBare:286->setUp:55 null
  TwoNodeTest>QpidTestCase.run:148->QpidBrokerTestCase.runBare:286->setUp:55 null
  TwoNodeTest>QpidTestCase.run:148->QpidBrokerTestCase.runBare:286->setUp:55 null
  TwoNodeTest>QpidTestCase.run:148->QpidBrokerTestCase.runBare:286->setUp:55 null
  TwoNodeTest>QpidTestCase.run:148->QpidBrokerTestCase.runBare:286->setUp:55 null

Tests in error: 
  BDBHAVirtualHostNodeRestTest>QpidTestCase.run:148->QpidBrokerTestCase.runBare:286->testNewMasterElectedWhenVirtualHostIsStopped:135->createHANode:317
» Connect
  BDBHAVirtualHostNodeRestTest>QpidTestCase.run:148->QpidBrokerTestCase.runBare:286->testMutateStateOfOneNode:103->createHANode:317
» Connect
  BDBHAVirtualHostNodeRestTest>QpidTestCase.run:148->QpidBrokerTestCase.runBare:286->testIntruderProtection:252->createHANode:317
» Connect
  BDBHAVirtualHostNodeRestTest>QpidTestCase.run:148->QpidBrokerTestCase.runBare:286->testDeleteMasterNode:192->createHANode:317
» Connect
  BDBHAVirtualHostNodeRestTest>QpidTestCase.run:148->QpidBrokerTestCase.runBare:286->testCreate3NodeGroup:92->createHANode:317
» Connect
  BDBHAVirtualHostNodeRestTest>QpidTestCase.run:148->QpidBrokerTestCase.runBare:286->testDeleteReplicaNode:166->createHANode:317
» Connect
  BDBHAVirtualHostNodeRestTest>QpidTestCase.run:148->QpidBrokerTestCase.runBare:286->testIntruderBDBHAVHNNotAllowedToConnect:232->createHANode:317
» Connect
  JMXManagementTest>QpidTestCase.run:148->QpidBrokerTestCase.runBare:286->testRemoveRemoteNodeFromGroup:164->getStoreBeanForNodeAtBrokerPort:276
» IO
  JMXManagementTest>QpidTestCase.run:148->QpidBrokerTestCase.runBare:286->testVirtualHostOperationsDeniedForNonMasterNode:187->getManagedBrokerBeanForNodeAtBrokerPort:283
» IO
  JMXManagementTest>QpidTestCase.run:148->QpidBrokerTestCase.runBare:286->testStateOfNonActiveBrokerIsNotMaster:133->getStoreBeanForNodeAtBrokerPort:276
» IO
  JMXManagementTest>QpidTestCase.run:148->QpidBrokerTestCase.runBare:286->testStateOfActiveBrokerIsMaster:125->getStoreBeanForNodeAtBrokerPort:276
» IO
  JMXManagementTest>QpidTestCase.run:148->QpidBrokerTestCase.runBare:286->testVirtualHostMbeanOnMasterTransfer:225->getManagedBrokerBeanForNodeAtBrokerPort:283
» IO
  JMXManagementTest>QpidTestCase.run:148->QpidBrokerTestCase.runBare:286->testGroupMembers:142->getStoreBeanForNodeAtBrokerPort:276
» IO
  JMXManagementTest>QpidTestCase.run:148->QpidBrokerTestCase.runBare:286->testReadonlyMBeanAttributes:111->getStoreBeanForNodeAtBrokerPort:276
» IO
  BDBHAVirtualHostRestTest>QpidTestCase.run:148->QpidBrokerTestCase.runBare:286->testSetLocalTransactionSynchronizationPolicy:116->QpidRestTestCase.waitForAttributeChanged:108
» Connect
  BDBHAVirtualHostRestTest>QpidTestCase.run:148->QpidBrokerTestCase.runBare:286->testMutateState:140->QpidRestTestCase.waitForAttributeChanged:108
» Connect
  BDBHAVirtualHostRestTest>QpidTestCase.run:148->QpidBrokerTestCase.runBare:286->testSetRemoteTransactionSynchronizationPolicy:128->QpidRestTestCase.waitForAttributeChanged:108
» Connect

Tests run: 43, Failures: 17, Errors: 17, Skipped: 0

[INFO] ------------------------------------------------------------------------
[INFO] Reactor Summary:
[INFO] 
[INFO] Qpid Java Build ................................... SUCCESS [2.462s]
[INFO] Qpid AMQP 1.0 Common .............................. SUCCESS [6.134s]
[INFO] Qpid AMQP 1.0 Client .............................. SUCCESS [0.815s]
[INFO] Qpid AMQP 1.0 Client JMS .......................... SUCCESS [1.636s]
[INFO] Qpid AMQP 1.0 JMS Client Examples ................. SUCCESS [0.222s]
[INFO] Qpid AMQP 1.0 Client WebSocket .................... SUCCESS [0.654s]
[INFO] Qpid Broker Code Generation ....................... SUCCESS [0.320s]
[INFO] Qpid Test Utilities ............................... SUCCESS [0.403s]
[INFO] Qpid Common ....................................... SUCCESS [29.676s]
[INFO] Qpid Management Common ............................ SUCCESS [1.344s]
[INFO] Qpid Java Broker Core ............................. SUCCESS [1:24.406s]
[INFO] Qpid Access Control Broker Plug-in ................ SUCCESS [4.113s]
[INFO] Qpid AMQP 0-8 Protocol Broker Plug-in ............. SUCCESS [21.145s]
[INFO] Qpid AMQP 0-10 Protocol Plug-in ................... SUCCESS [4.198s]
[INFO] Qpid AMQP 1-0 Protocol Broker Plug-in ............. SUCCESS [0.503s]
[INFO] Qpid AMQP 0-8 to 0-10 Message Conversion Broker Plug-in  SUCCESS [0.272s]
[INFO] Qpid AMQP 0-8 to 1-0 Message Conversion Broker Plug-in  SUCCESS [0.267s]
[INFO] Qpid AMQP 0-10 to 1-0 Message Conversion Broker Plug-in  SUCCESS [0.248s]
[INFO] Qpid Derby Message Store .......................... SUCCESS [17.467s]
[INFO] Qpid JDBC Message Store Connection Pooling Plug-in  SUCCESS [0.541s]
[INFO] Qpid JDBC Message Store Broker Plug-in ............ SUCCESS [10.243s]
[INFO] Qpid HTTP Management Broker Plug-in ............... SUCCESS [5.384s]
[INFO] Qpid JMX Management Broker Plug-in ................ SUCCESS [3.537s]
[INFO] Qpid Memory Message Store Broker Plug-in .......... SUCCESS [0.336s]
[INFO] Qpid WebSocket Broker Plug-in ..................... SUCCESS [0.278s]
[INFO] Qpid AMQP 0-x JMS Client .......................... SUCCESS [6.901s]
[INFO] Qpid BDB Message Store ............................ SUCCESS [2:10.931s]
[INFO] Qpid BDB Message Store JMX ........................ SUCCESS [2.071s]
[INFO] Qpid Java Broker .................................. SUCCESS [4.865s]
[INFO] Qpid AMQP Management Protocol Broker Plug-in ...... SUCCESS [0.271s]
[INFO] Qpid AMQP 0-x JMS Client Examples ................. SUCCESS [0.169s]
[INFO] Qpid JCA .......................................... SUCCESS [1.749s]
[INFO] Qpid Resource Adaptor ............................. SUCCESS [0.492s]
[INFO] Qpid Tools ........................................ SUCCESS [0.440s]
[INFO] Qpid Management Examples .......................... SUCCESS [0.196s]
[INFO] Qpid Java System Test Parent ...................... SUCCESS [0.863s]
[INFO] Qpid System Tests ................................. SUCCESS [5:52.421s]
[INFO] Qpid Performance Tests ............................ SUCCESS [13.743s]
[INFO] Qpid Performance Test System Tests ................ SUCCESS [17.190s]
[INFO] Qpid Performance Tests Visualisation JFC .......... SUCCESS [4.824s]
[INFO] Qpid BDB Store System Tests ....................... FAILURE [5.657s]
[INFO] ------------------------------------------------------------------------
[INFO] BUILD FAILURE
[INFO] ------------------------------------------------------------------------
[INFO] Total time: 12:20.927s
[INFO] Finished at: Thu Feb 19 00:19:06 UTC 2015
[INFO] Final Memory: 73M/357M
[INFO] ------------------------------------------------------------------------
[ERROR] Failed to execute goal org.apache.maven.plugins:maven-surefire-plugin:2.16:test (integration-test)
on project qpid-bdbstore-systests: There are test failures.
[ERROR] 
[ERROR] Please refer to <https://builds.apache.org/job/Qpid-Java-Cpp-Test/ws/trunk/qpid/java/bdbstore/systests/target/surefire-reports>
for the individual test results.
[ERROR] -> [Help 1]
[ERROR] 
[ERROR] To see the full stack trace of the errors, re-run Maven with the -e switch.
[ERROR] Re-run Maven using the -X switch to enable full debug logging.
[ERROR] 
[ERROR] For more information about the errors and possible solutions, please read the following
articles:
[ERROR] [Help 1] http://cwiki.apache.org/confluence/display/MAVEN/MojoFailureException
[ERROR] 
[ERROR] After correcting the problems, you can resume the build with the command
[ERROR]   mvn <goals> -rf :qpid-bdbstore-systests
Build step 'Invoke top-level Maven targets' marked build as failure
[locks-and-latches] Releasing all the locks
[locks-and-latches] All the locks released
Recording test results

Mime
View raw message