qpid-notifications mailing list archives

Site index · List index
Message view « Date » · « Thread »
Top « Date » · « Thread »
From Apache Jenkins Server <jenk...@builds.apache.org>
Subject Build failed in Jenkins: Qpid-Java-Cpp-Test #2386
Date Tue, 03 Feb 2015 18:26:40 GMT
See <https://builds.apache.org/job/Qpid-Java-Cpp-Test/2386/changes>

Changes:

[orudyy] QPID-6356: Remove operational log 'MNG-1006 : Using SSL Keystore : {0}'

------------------------------------------
[...truncated 6925 lines...]
	at org.apache.qpid.server.store.berkeleydb.replication.MultiNodeTest.setUp(MultiNodeTest.java:81)

testPriority(org.apache.qpid.server.store.berkeleydb.replication.MultiNodeTest)  Time elapsed:
0.007 sec  <<< FAILURE!
junit.framework.AssertionFailedError: null
	at junit.framework.Assert.fail(Assert.java:55)
	at junit.framework.Assert.assertTrue(Assert.java:22)
	at junit.framework.Assert.assertTrue(Assert.java:31)
	at junit.framework.TestCase.assertTrue(TestCase.java:201)
	at org.apache.qpid.server.store.berkeleydb.replication.MultiNodeTest.setUp(MultiNodeTest.java:81)

testQuorumOverride(org.apache.qpid.server.store.berkeleydb.replication.MultiNodeTest)  Time
elapsed: 0.006 sec  <<< FAILURE!
junit.framework.AssertionFailedError: null
	at junit.framework.Assert.fail(Assert.java:55)
	at junit.framework.Assert.assertTrue(Assert.java:22)
	at junit.framework.Assert.assertTrue(Assert.java:31)
	at junit.framework.TestCase.assertTrue(TestCase.java:201)
	at org.apache.qpid.server.store.berkeleydb.replication.MultiNodeTest.setUp(MultiNodeTest.java:81)

testLossOfQuorumCausesClientDisconnection(org.apache.qpid.server.store.berkeleydb.replication.MultiNodeTest)
 Time elapsed: 0.006 sec  <<< FAILURE!
junit.framework.AssertionFailedError: null
	at junit.framework.Assert.fail(Assert.java:55)
	at junit.framework.Assert.assertTrue(Assert.java:22)
	at junit.framework.Assert.assertTrue(Assert.java:31)
	at junit.framework.TestCase.assertTrue(TestCase.java:201)
	at org.apache.qpid.server.store.berkeleydb.replication.MultiNodeTest.setUp(MultiNodeTest.java:81)

testLossOfMasterNodeCausesClientToFailover(org.apache.qpid.server.store.berkeleydb.replication.MultiNodeTest)
 Time elapsed: 0.006 sec  <<< FAILURE!
junit.framework.AssertionFailedError: null
	at junit.framework.Assert.fail(Assert.java:55)
	at junit.framework.Assert.assertTrue(Assert.java:22)
	at junit.framework.Assert.assertTrue(Assert.java:31)
	at junit.framework.TestCase.assertTrue(TestCase.java:201)
	at org.apache.qpid.server.store.berkeleydb.replication.MultiNodeTest.setUp(MultiNodeTest.java:81)

testClusterCannotStartWithIntruder(org.apache.qpid.server.store.berkeleydb.replication.MultiNodeTest)
 Time elapsed: 0.006 sec  <<< FAILURE!
junit.framework.AssertionFailedError: null
	at junit.framework.Assert.fail(Assert.java:55)
	at junit.framework.Assert.assertTrue(Assert.java:22)
	at junit.framework.Assert.assertTrue(Assert.java:31)
	at junit.framework.TestCase.assertTrue(TestCase.java:201)
	at org.apache.qpid.server.store.berkeleydb.replication.MultiNodeTest.setUp(MultiNodeTest.java:81)

testTransferMasterWhilstMessagesInFlight(org.apache.qpid.server.store.berkeleydb.replication.MultiNodeTest)
 Time elapsed: 0.006 sec  <<< FAILURE!
junit.framework.AssertionFailedError: null
	at junit.framework.Assert.fail(Assert.java:55)
	at junit.framework.Assert.assertTrue(Assert.java:22)
	at junit.framework.Assert.assertTrue(Assert.java:31)
	at junit.framework.TestCase.assertTrue(TestCase.java:201)
	at org.apache.qpid.server.store.berkeleydb.replication.MultiNodeTest.setUp(MultiNodeTest.java:81)

testTransferMasterFromRemoteNode(org.apache.qpid.server.store.berkeleydb.replication.MultiNodeTest)
 Time elapsed: 0.006 sec  <<< FAILURE!
junit.framework.AssertionFailedError: null
	at junit.framework.Assert.fail(Assert.java:55)
	at junit.framework.Assert.assertTrue(Assert.java:22)
	at junit.framework.Assert.assertTrue(Assert.java:31)
	at junit.framework.TestCase.assertTrue(TestCase.java:201)
	at org.apache.qpid.server.store.berkeleydb.replication.MultiNodeTest.setUp(MultiNodeTest.java:81)

testLossOfReplicaNodeDoesNotCauseClientToFailover(org.apache.qpid.server.store.berkeleydb.replication.MultiNodeTest)
 Time elapsed: 0.006 sec  <<< FAILURE!
junit.framework.AssertionFailedError: null
	at junit.framework.Assert.fail(Assert.java:55)
	at junit.framework.Assert.assertTrue(Assert.java:22)
	at junit.framework.Assert.assertTrue(Assert.java:31)
	at junit.framework.TestCase.assertTrue(TestCase.java:201)
	at org.apache.qpid.server.store.berkeleydb.replication.MultiNodeTest.setUp(MultiNodeTest.java:81)

testPersistentMessagesAvailableAfterFailover(org.apache.qpid.server.store.berkeleydb.replication.MultiNodeTest)
 Time elapsed: 0.006 sec  <<< FAILURE!
junit.framework.AssertionFailedError: null
	at junit.framework.Assert.fail(Assert.java:55)
	at junit.framework.Assert.assertTrue(Assert.java:22)
	at junit.framework.Assert.assertTrue(Assert.java:31)
	at junit.framework.TestCase.assertTrue(TestCase.java:201)
	at org.apache.qpid.server.store.berkeleydb.replication.MultiNodeTest.setUp(MultiNodeTest.java:81)

Running org.apache.qpid.server.store.berkeleydb.replication.TwoNodeTest
Tests run: 7, Failures: 7, Errors: 0, Skipped: 0, Time elapsed: 0.077 sec <<< FAILURE!
- in org.apache.qpid.server.store.berkeleydb.replication.TwoNodeTest
testMasterDesignatedPrimaryCanBeRestartedWithoutReplica(org.apache.qpid.server.store.berkeleydb.replication.TwoNodeTest)
 Time elapsed: 0.006 sec  <<< FAILURE!
junit.framework.AssertionFailedError: null
	at junit.framework.Assert.fail(Assert.java:55)
	at junit.framework.Assert.assertTrue(Assert.java:22)
	at junit.framework.Assert.assertTrue(Assert.java:31)
	at junit.framework.TestCase.assertTrue(TestCase.java:201)
	at org.apache.qpid.server.store.berkeleydb.replication.TwoNodeTest.setUp(TwoNodeTest.java:55)

testSecondaryDesignatedAsPrimaryAfterOriginalPrimaryStopped(org.apache.qpid.server.store.berkeleydb.replication.TwoNodeTest)
 Time elapsed: 0.006 sec  <<< FAILURE!
junit.framework.AssertionFailedError: null
	at junit.framework.Assert.fail(Assert.java:55)
	at junit.framework.Assert.assertTrue(Assert.java:22)
	at junit.framework.Assert.assertTrue(Assert.java:31)
	at junit.framework.TestCase.assertTrue(TestCase.java:201)
	at org.apache.qpid.server.store.berkeleydb.replication.TwoNodeTest.setUp(TwoNodeTest.java:55)

testClusterRestartWithoutDesignatedPrimary(org.apache.qpid.server.store.berkeleydb.replication.TwoNodeTest)
 Time elapsed: 0.006 sec  <<< FAILURE!
junit.framework.AssertionFailedError: null
	at junit.framework.Assert.fail(Assert.java:55)
	at junit.framework.Assert.assertTrue(Assert.java:22)
	at junit.framework.Assert.assertTrue(Assert.java:31)
	at junit.framework.TestCase.assertTrue(TestCase.java:201)
	at org.apache.qpid.server.store.berkeleydb.replication.TwoNodeTest.setUp(TwoNodeTest.java:55)

testDesignatedPrimaryContinuesAfterSecondaryStopped(org.apache.qpid.server.store.berkeleydb.replication.TwoNodeTest)
 Time elapsed: 0.006 sec  <<< FAILURE!
junit.framework.AssertionFailedError: null
	at junit.framework.Assert.fail(Assert.java:55)
	at junit.framework.Assert.assertTrue(Assert.java:22)
	at junit.framework.Assert.assertTrue(Assert.java:31)
	at junit.framework.TestCase.assertTrue(TestCase.java:201)
	at org.apache.qpid.server.store.berkeleydb.replication.TwoNodeTest.setUp(TwoNodeTest.java:55)

testPersistentOperationsFailOnNonDesignatedPrimaryAfterSecondaryStopped(org.apache.qpid.server.store.berkeleydb.replication.TwoNodeTest)
 Time elapsed: 0.026 sec  <<< FAILURE!
junit.framework.AssertionFailedError: null
	at junit.framework.Assert.fail(Assert.java:55)
	at junit.framework.Assert.assertTrue(Assert.java:22)
	at junit.framework.Assert.assertTrue(Assert.java:31)
	at junit.framework.TestCase.assertTrue(TestCase.java:201)
	at org.apache.qpid.server.store.berkeleydb.replication.TwoNodeTest.setUp(TwoNodeTest.java:55)

testInitialDesignatedPrimaryStateOfNodes(org.apache.qpid.server.store.berkeleydb.replication.TwoNodeTest)
 Time elapsed: 0.012 sec  <<< FAILURE!
junit.framework.AssertionFailedError: null
	at junit.framework.Assert.fail(Assert.java:55)
	at junit.framework.Assert.assertTrue(Assert.java:22)
	at junit.framework.Assert.assertTrue(Assert.java:31)
	at junit.framework.TestCase.assertTrue(TestCase.java:201)
	at org.apache.qpid.server.store.berkeleydb.replication.TwoNodeTest.setUp(TwoNodeTest.java:55)

testSecondaryDoesNotBecomePrimaryWhenDesignatedPrimaryStopped(org.apache.qpid.server.store.berkeleydb.replication.TwoNodeTest)
 Time elapsed: 0.007 sec  <<< FAILURE!
junit.framework.AssertionFailedError: null
	at junit.framework.Assert.fail(Assert.java:55)
	at junit.framework.Assert.assertTrue(Assert.java:22)
	at junit.framework.Assert.assertTrue(Assert.java:31)
	at junit.framework.TestCase.assertTrue(TestCase.java:201)
	at org.apache.qpid.server.store.berkeleydb.replication.TwoNodeTest.setUp(TwoNodeTest.java:55)

Running org.apache.qpid.server.store.berkeleydb.BDBBackupTest
Tests run: 0, Failures: 0, Errors: 0, Skipped: 0, Time elapsed: 0 sec - in org.apache.qpid.server.store.berkeleydb.BDBBackupTest

Results :

Failed tests: 
  MultiNodeTest>QpidTestCase.run:148->QpidBrokerTestCase.runBare:272->setUp:81 null
  MultiNodeTest>QpidTestCase.run:148->QpidBrokerTestCase.runBare:272->setUp:81 null
  MultiNodeTest>QpidTestCase.run:148->QpidBrokerTestCase.runBare:272->setUp:81 null
  MultiNodeTest>QpidTestCase.run:148->QpidBrokerTestCase.runBare:272->setUp:81 null
  MultiNodeTest>QpidTestCase.run:148->QpidBrokerTestCase.runBare:272->setUp:81 null
  MultiNodeTest>QpidTestCase.run:148->QpidBrokerTestCase.runBare:272->setUp:81 null
  MultiNodeTest>QpidTestCase.run:148->QpidBrokerTestCase.runBare:272->setUp:81 null
  MultiNodeTest>QpidTestCase.run:148->QpidBrokerTestCase.runBare:272->setUp:81 null
  MultiNodeTest>QpidTestCase.run:148->QpidBrokerTestCase.runBare:272->setUp:81 null
  MultiNodeTest>QpidTestCase.run:148->QpidBrokerTestCase.runBare:272->setUp:81 null
  TwoNodeTest>QpidTestCase.run:148->QpidBrokerTestCase.runBare:272->setUp:55 null
  TwoNodeTest>QpidTestCase.run:148->QpidBrokerTestCase.runBare:272->setUp:55 null
  TwoNodeTest>QpidTestCase.run:148->QpidBrokerTestCase.runBare:272->setUp:55 null
  TwoNodeTest>QpidTestCase.run:148->QpidBrokerTestCase.runBare:272->setUp:55 null
  TwoNodeTest>QpidTestCase.run:148->QpidBrokerTestCase.runBare:272->setUp:55 null
  TwoNodeTest>QpidTestCase.run:148->QpidBrokerTestCase.runBare:272->setUp:55 null
  TwoNodeTest>QpidTestCase.run:148->QpidBrokerTestCase.runBare:272->setUp:55 null

Tests in error: 
  BDBHAVirtualHostNodeRestTest>QpidTestCase.run:148->QpidBrokerTestCase.runBare:272->testNewMasterElectedWhenVirtualHostIsStopped:135->createHANode:317
» Connect
  BDBHAVirtualHostNodeRestTest>QpidTestCase.run:148->QpidBrokerTestCase.runBare:272->testMutateStateOfOneNode:103->createHANode:317
» Connect
  BDBHAVirtualHostNodeRestTest>QpidTestCase.run:148->QpidBrokerTestCase.runBare:272->testIntruderProtection:252->createHANode:317
» Connect
  BDBHAVirtualHostNodeRestTest>QpidTestCase.run:148->QpidBrokerTestCase.runBare:272->testDeleteMasterNode:192->createHANode:317
» Connect
  BDBHAVirtualHostNodeRestTest>QpidTestCase.run:148->QpidBrokerTestCase.runBare:272->testCreate3NodeGroup:92->createHANode:317
» Connect
  BDBHAVirtualHostNodeRestTest>QpidTestCase.run:148->QpidBrokerTestCase.runBare:272->testDeleteReplicaNode:166->createHANode:317
» Connect
  BDBHAVirtualHostNodeRestTest>QpidTestCase.run:148->QpidBrokerTestCase.runBare:272->testIntruderBDBHAVHNNotAllowedToConnect:232->createHANode:317
» Connect
  BDBHAVirtualHostRestTest>QpidTestCase.run:148->QpidBrokerTestCase.runBare:272->testSetLocalTransactionSynchronizationPolicy:116->QpidRestTestCase.waitForAttributeChanged:114
» Connect
  BDBHAVirtualHostRestTest>QpidTestCase.run:148->QpidBrokerTestCase.runBare:272->testMutateState:140->QpidRestTestCase.waitForAttributeChanged:114
» Connect
  BDBHAVirtualHostRestTest>QpidTestCase.run:148->QpidBrokerTestCase.runBare:272->testSetRemoteTransactionSynchronizationPolicy:128->QpidRestTestCase.waitForAttributeChanged:114
» Connect
  JMXManagementTest>QpidTestCase.run:148->QpidBrokerTestCase.runBare:272->testRemoveRemoteNodeFromGroup:164->getStoreBeanForNodeAtBrokerPort:276
» IO
  JMXManagementTest>QpidTestCase.run:148->QpidBrokerTestCase.runBare:272->testVirtualHostOperationsDeniedForNonMasterNode:187->getManagedBrokerBeanForNodeAtBrokerPort:283
» IO
  JMXManagementTest>QpidTestCase.run:148->QpidBrokerTestCase.runBare:272->testStateOfNonActiveBrokerIsNotMaster:133->getStoreBeanForNodeAtBrokerPort:276
» IO
  JMXManagementTest>QpidTestCase.run:148->QpidBrokerTestCase.runBare:272->testStateOfActiveBrokerIsMaster:125->getStoreBeanForNodeAtBrokerPort:276
» IO
  JMXManagementTest>QpidTestCase.run:148->QpidBrokerTestCase.runBare:272->testVirtualHostMbeanOnMasterTransfer:225->getManagedBrokerBeanForNodeAtBrokerPort:283
» IO
  JMXManagementTest>QpidTestCase.run:148->QpidBrokerTestCase.runBare:272->testGroupMembers:142->getStoreBeanForNodeAtBrokerPort:276
» IO
  JMXManagementTest>QpidTestCase.run:148->QpidBrokerTestCase.runBare:272->testReadonlyMBeanAttributes:111->getStoreBeanForNodeAtBrokerPort:276
» IO

Tests run: 42, Failures: 17, Errors: 17, Skipped: 0

[INFO] ------------------------------------------------------------------------
[INFO] Reactor Summary:
[INFO] 
[INFO] Qpid Java Build ................................... SUCCESS [4.520s]
[INFO] Qpid AMQP 1.0 Common .............................. SUCCESS [9.225s]
[INFO] Qpid AMQP 1.0 Client .............................. SUCCESS [0.904s]
[INFO] Qpid AMQP 1.0 Client JMS .......................... SUCCESS [2.870s]
[INFO] Qpid AMQP 1.0 JMS Client Examples ................. SUCCESS [0.395s]
[INFO] Qpid AMQP 1.0 Client WebSocket .................... SUCCESS [1.286s]
[INFO] Qpid Broker Code Generation ....................... SUCCESS [0.385s]
[INFO] Qpid Test Utilities ............................... SUCCESS [0.406s]
[INFO] Qpid Common ....................................... SUCCESS [36.942s]
[INFO] Qpid Management Common ............................ SUCCESS [1.462s]
[INFO] Qpid Java Broker Core ............................. SUCCESS [1:40.519s]
[INFO] Qpid Access Control Broker Plug-in ................ SUCCESS [4.606s]
[INFO] Qpid AMQP 0-8 Protocol Broker Plug-in ............. SUCCESS [21.767s]
[INFO] Qpid AMQP 0-10 Protocol Plug-in ................... SUCCESS [6.760s]
[INFO] Qpid AMQP 1-0 Protocol Broker Plug-in ............. SUCCESS [0.510s]
[INFO] Qpid AMQP 0-8 to 0-10 Message Conversion Broker Plug-in  SUCCESS [0.377s]
[INFO] Qpid AMQP 0-8 to 1-0 Message Conversion Broker Plug-in  SUCCESS [0.447s]
[INFO] Qpid AMQP 0-10 to 1-0 Message Conversion Broker Plug-in  SUCCESS [0.337s]
[INFO] Qpid Derby Message Store .......................... SUCCESS [23.467s]
[INFO] Qpid JDBC Message Store Connection Pooling Plug-in  SUCCESS [0.549s]
[INFO] Qpid JDBC Message Store Broker Plug-in ............ SUCCESS [11.545s]
[INFO] Qpid HTTP Management Broker Plug-in ............... SUCCESS [5.225s]
[INFO] Qpid JMX Management Broker Plug-in ................ SUCCESS [3.803s]
[INFO] Qpid Memory Message Store Broker Plug-in .......... SUCCESS [0.519s]
[INFO] Qpid WebSocket Broker Plug-in ..................... SUCCESS [0.306s]
[INFO] Qpid AMQP 0-x JMS Client .......................... SUCCESS [7.306s]
[INFO] Qpid BDB Message Store ............................ SUCCESS [2:11.828s]
[INFO] Qpid BDB Message Store JMX ........................ SUCCESS [2.261s]
[INFO] Qpid Java Broker .................................. SUCCESS [5.324s]
[INFO] Qpid AMQP Management Protocol Broker Plug-in ...... SUCCESS [0.364s]
[INFO] Qpid AMQP 0-x JMS Client Examples ................. SUCCESS [0.162s]
[INFO] Qpid JCA .......................................... SUCCESS [2.311s]
[INFO] Qpid Resource Adaptor ............................. SUCCESS [0.580s]
[INFO] Qpid Tools ........................................ SUCCESS [0.457s]
[INFO] Qpid Management Examples .......................... SUCCESS [0.175s]
[INFO] Qpid Java System Test Parent ...................... SUCCESS [1.027s]
[INFO] Qpid System Tests ................................. SUCCESS [6:33.927s]
[INFO] Qpid Performance Tests ............................ SUCCESS [16.557s]
[INFO] Qpid Performance Test System Tests ................ FAILURE [20.687s]
[INFO] Qpid Performance Tests Visualisation JFC .......... SUCCESS [5.784s]
[INFO] Qpid BDB Store System Tests ....................... FAILURE [6.643s]
[INFO] ------------------------------------------------------------------------
[INFO] BUILD FAILURE
[INFO] ------------------------------------------------------------------------
[INFO] Total time: 13:56.265s
[INFO] Finished at: Tue Feb 03 18:26:28 UTC 2015
[INFO] Final Memory: 74M/428M
[INFO] ------------------------------------------------------------------------
[ERROR] Failed to execute goal org.apache.maven.plugins:maven-surefire-plugin:2.16:test (integration-test)
on project qpid-perftests-systests: There are test failures.
[ERROR] 
[ERROR] Please refer to <https://builds.apache.org/job/Qpid-Java-Cpp-Test/ws/trunk/qpid/java/qpid-perftests-systests/target/surefire-reports>
for the individual test results.
[ERROR] -> [Help 1]
[ERROR] Failed to execute goal org.apache.maven.plugins:maven-surefire-plugin:2.16:test (integration-test)
on project qpid-bdbstore-systests: There are test failures.
[ERROR] 
[ERROR] Please refer to <https://builds.apache.org/job/Qpid-Java-Cpp-Test/ws/trunk/qpid/java/bdbstore/systests/target/surefire-reports>
for the individual test results.
[ERROR] -> [Help 1]
[ERROR] 
[ERROR] To see the full stack trace of the errors, re-run Maven with the -e switch.
[ERROR] Re-run Maven using the -X switch to enable full debug logging.
[ERROR] 
[ERROR] For more information about the errors and possible solutions, please read the following
articles:
[ERROR] [Help 1] http://cwiki.apache.org/confluence/display/MAVEN/MojoFailureException
[ERROR] 
[ERROR] After correcting the problems, you can resume the build with the command
[ERROR]   mvn <goals> -rf :qpid-perftests-systests
Build step 'Invoke top-level Maven targets' marked build as failure
[locks-and-latches] Releasing all the locks
[locks-and-latches] All the locks released
Recording test results

Mime
View raw message