qpid-notifications mailing list archives

Site index · List index
Message view « Date » · « Thread »
Top « Date » · « Thread »
From Apache Jenkins Server <jenk...@builds.apache.org>
Subject Build failed in Jenkins: Qpid-Java-Cpp-Test #2395
Date Fri, 06 Feb 2015 01:48:16 GMT
See <https://builds.apache.org/job/Qpid-Java-Cpp-Test/2395/changes>

Changes:

[orudyy] QPID-6364: Add a secure attribute 'storeUrl' into Keystore for specifying store content
location and make attribute 'path' derived. Rename Trsuststore attribute 'path' into 'storeUrl'
for consistency.

------------------------------------------
[...truncated 6742 lines...]
	at sun.net.NetworkClient.doConnect(NetworkClient.java:175)
	at sun.net.www.http.HttpClient.openServer(HttpClient.java:378)
	at sun.net.www.http.HttpClient.openServer(HttpClient.java:473)
	at sun.net.www.http.HttpClient.<init>(HttpClient.java:203)
	at sun.net.www.http.HttpClient.New(HttpClient.java:290)
	at sun.net.www.http.HttpClient.New(HttpClient.java:306)
	at sun.net.www.protocol.http.HttpURLConnection.getNewHttpClient(HttpURLConnection.java:995)
	at sun.net.www.protocol.http.HttpURLConnection.plainConnect(HttpURLConnection.java:931)
	at sun.net.www.protocol.http.HttpURLConnection.connect(HttpURLConnection.java:849)
	at sun.net.www.protocol.http.HttpURLConnection.getOutputStream(HttpURLConnection.java:1090)
	at org.apache.qpid.systest.rest.RestTestHelper.writeJsonRequest(RestTestHelper.java:234)
	at org.apache.qpid.systest.rest.RestTestHelper.submitRequest(RestTestHelper.java:508)
	at org.apache.qpid.systest.rest.RestTestHelper.submitRequest(RestTestHelper.java:522)
	at org.apache.qpid.server.store.berkeleydb.replication.BDBHAVirtualHostNodeRestTest.createHANode(BDBHAVirtualHostNodeRestTest.java:317)
	at org.apache.qpid.server.store.berkeleydb.replication.BDBHAVirtualHostNodeRestTest.testMutateStateOfOneNode(BDBHAVirtualHostNodeRestTest.java:103)

testIntruderProtection(org.apache.qpid.server.store.berkeleydb.replication.BDBHAVirtualHostNodeRestTest)
 Time elapsed: 0.038 sec  <<< ERROR!
java.net.ConnectException: Connection refused
	at java.net.PlainSocketImpl.socketConnect(Native Method)
	at java.net.AbstractPlainSocketImpl.doConnect(AbstractPlainSocketImpl.java:339)
	at java.net.AbstractPlainSocketImpl.connectToAddress(AbstractPlainSocketImpl.java:200)
	at java.net.AbstractPlainSocketImpl.connect(AbstractPlainSocketImpl.java:182)
	at java.net.SocksSocketImpl.connect(SocksSocketImpl.java:392)
	at java.net.Socket.connect(Socket.java:579)
	at sun.net.NetworkClient.doConnect(NetworkClient.java:175)
	at sun.net.www.http.HttpClient.openServer(HttpClient.java:378)
	at sun.net.www.http.HttpClient.openServer(HttpClient.java:473)
	at sun.net.www.http.HttpClient.<init>(HttpClient.java:203)
	at sun.net.www.http.HttpClient.New(HttpClient.java:290)
	at sun.net.www.http.HttpClient.New(HttpClient.java:306)
	at sun.net.www.protocol.http.HttpURLConnection.getNewHttpClient(HttpURLConnection.java:995)
	at sun.net.www.protocol.http.HttpURLConnection.plainConnect(HttpURLConnection.java:931)
	at sun.net.www.protocol.http.HttpURLConnection.connect(HttpURLConnection.java:849)
	at sun.net.www.protocol.http.HttpURLConnection.getOutputStream(HttpURLConnection.java:1090)
	at org.apache.qpid.systest.rest.RestTestHelper.writeJsonRequest(RestTestHelper.java:234)
	at org.apache.qpid.systest.rest.RestTestHelper.submitRequest(RestTestHelper.java:508)
	at org.apache.qpid.systest.rest.RestTestHelper.submitRequest(RestTestHelper.java:522)
	at org.apache.qpid.server.store.berkeleydb.replication.BDBHAVirtualHostNodeRestTest.createHANode(BDBHAVirtualHostNodeRestTest.java:317)
	at org.apache.qpid.server.store.berkeleydb.replication.BDBHAVirtualHostNodeRestTest.testIntruderProtection(BDBHAVirtualHostNodeRestTest.java:252)

testDeleteMasterNode(org.apache.qpid.server.store.berkeleydb.replication.BDBHAVirtualHostNodeRestTest)
 Time elapsed: 0.036 sec  <<< ERROR!
java.net.ConnectException: Connection refused
	at java.net.PlainSocketImpl.socketConnect(Native Method)
	at java.net.AbstractPlainSocketImpl.doConnect(AbstractPlainSocketImpl.java:339)
	at java.net.AbstractPlainSocketImpl.connectToAddress(AbstractPlainSocketImpl.java:200)
	at java.net.AbstractPlainSocketImpl.connect(AbstractPlainSocketImpl.java:182)
	at java.net.SocksSocketImpl.connect(SocksSocketImpl.java:392)
	at java.net.Socket.connect(Socket.java:579)
	at sun.net.NetworkClient.doConnect(NetworkClient.java:175)
	at sun.net.www.http.HttpClient.openServer(HttpClient.java:378)
	at sun.net.www.http.HttpClient.openServer(HttpClient.java:473)
	at sun.net.www.http.HttpClient.<init>(HttpClient.java:203)
	at sun.net.www.http.HttpClient.New(HttpClient.java:290)
	at sun.net.www.http.HttpClient.New(HttpClient.java:306)
	at sun.net.www.protocol.http.HttpURLConnection.getNewHttpClient(HttpURLConnection.java:995)
	at sun.net.www.protocol.http.HttpURLConnection.plainConnect(HttpURLConnection.java:931)
	at sun.net.www.protocol.http.HttpURLConnection.connect(HttpURLConnection.java:849)
	at sun.net.www.protocol.http.HttpURLConnection.getOutputStream(HttpURLConnection.java:1090)
	at org.apache.qpid.systest.rest.RestTestHelper.writeJsonRequest(RestTestHelper.java:234)
	at org.apache.qpid.systest.rest.RestTestHelper.submitRequest(RestTestHelper.java:508)
	at org.apache.qpid.systest.rest.RestTestHelper.submitRequest(RestTestHelper.java:522)
	at org.apache.qpid.server.store.berkeleydb.replication.BDBHAVirtualHostNodeRestTest.createHANode(BDBHAVirtualHostNodeRestTest.java:317)
	at org.apache.qpid.server.store.berkeleydb.replication.BDBHAVirtualHostNodeRestTest.testDeleteMasterNode(BDBHAVirtualHostNodeRestTest.java:192)

testCreate3NodeGroup(org.apache.qpid.server.store.berkeleydb.replication.BDBHAVirtualHostNodeRestTest)
 Time elapsed: 0.051 sec  <<< ERROR!
java.net.ConnectException: Connection refused
	at java.net.PlainSocketImpl.socketConnect(Native Method)
	at java.net.AbstractPlainSocketImpl.doConnect(AbstractPlainSocketImpl.java:339)
	at java.net.AbstractPlainSocketImpl.connectToAddress(AbstractPlainSocketImpl.java:200)
	at java.net.AbstractPlainSocketImpl.connect(AbstractPlainSocketImpl.java:182)
	at java.net.SocksSocketImpl.connect(SocksSocketImpl.java:392)
	at java.net.Socket.connect(Socket.java:579)
	at sun.net.NetworkClient.doConnect(NetworkClient.java:175)
	at sun.net.www.http.HttpClient.openServer(HttpClient.java:378)
	at sun.net.www.http.HttpClient.openServer(HttpClient.java:473)
	at sun.net.www.http.HttpClient.<init>(HttpClient.java:203)
	at sun.net.www.http.HttpClient.New(HttpClient.java:290)
	at sun.net.www.http.HttpClient.New(HttpClient.java:306)
	at sun.net.www.protocol.http.HttpURLConnection.getNewHttpClient(HttpURLConnection.java:995)
	at sun.net.www.protocol.http.HttpURLConnection.plainConnect(HttpURLConnection.java:931)
	at sun.net.www.protocol.http.HttpURLConnection.connect(HttpURLConnection.java:849)
	at sun.net.www.protocol.http.HttpURLConnection.getOutputStream(HttpURLConnection.java:1090)
	at org.apache.qpid.systest.rest.RestTestHelper.writeJsonRequest(RestTestHelper.java:234)
	at org.apache.qpid.systest.rest.RestTestHelper.submitRequest(RestTestHelper.java:508)
	at org.apache.qpid.systest.rest.RestTestHelper.submitRequest(RestTestHelper.java:522)
	at org.apache.qpid.server.store.berkeleydb.replication.BDBHAVirtualHostNodeRestTest.createHANode(BDBHAVirtualHostNodeRestTest.java:317)
	at org.apache.qpid.server.store.berkeleydb.replication.BDBHAVirtualHostNodeRestTest.testCreate3NodeGroup(BDBHAVirtualHostNodeRestTest.java:92)

testDeleteReplicaNode(org.apache.qpid.server.store.berkeleydb.replication.BDBHAVirtualHostNodeRestTest)
 Time elapsed: 0.034 sec  <<< ERROR!
java.net.ConnectException: Connection refused
	at java.net.PlainSocketImpl.socketConnect(Native Method)
	at java.net.AbstractPlainSocketImpl.doConnect(AbstractPlainSocketImpl.java:339)
	at java.net.AbstractPlainSocketImpl.connectToAddress(AbstractPlainSocketImpl.java:200)
	at java.net.AbstractPlainSocketImpl.connect(AbstractPlainSocketImpl.java:182)
	at java.net.SocksSocketImpl.connect(SocksSocketImpl.java:392)
	at java.net.Socket.connect(Socket.java:579)
	at sun.net.NetworkClient.doConnect(NetworkClient.java:175)
	at sun.net.www.http.HttpClient.openServer(HttpClient.java:378)
	at sun.net.www.http.HttpClient.openServer(HttpClient.java:473)
	at sun.net.www.http.HttpClient.<init>(HttpClient.java:203)
	at sun.net.www.http.HttpClient.New(HttpClient.java:290)
	at sun.net.www.http.HttpClient.New(HttpClient.java:306)
	at sun.net.www.protocol.http.HttpURLConnection.getNewHttpClient(HttpURLConnection.java:995)
	at sun.net.www.protocol.http.HttpURLConnection.plainConnect(HttpURLConnection.java:931)
	at sun.net.www.protocol.http.HttpURLConnection.connect(HttpURLConnection.java:849)
	at sun.net.www.protocol.http.HttpURLConnection.getOutputStream(HttpURLConnection.java:1090)
	at org.apache.qpid.systest.rest.RestTestHelper.writeJsonRequest(RestTestHelper.java:234)
	at org.apache.qpid.systest.rest.RestTestHelper.submitRequest(RestTestHelper.java:508)
	at org.apache.qpid.systest.rest.RestTestHelper.submitRequest(RestTestHelper.java:522)
	at org.apache.qpid.server.store.berkeleydb.replication.BDBHAVirtualHostNodeRestTest.createHANode(BDBHAVirtualHostNodeRestTest.java:317)
	at org.apache.qpid.server.store.berkeleydb.replication.BDBHAVirtualHostNodeRestTest.testDeleteReplicaNode(BDBHAVirtualHostNodeRestTest.java:166)

testIntruderBDBHAVHNNotAllowedToConnect(org.apache.qpid.server.store.berkeleydb.replication.BDBHAVirtualHostNodeRestTest)
 Time elapsed: 0.034 sec  <<< ERROR!
java.net.ConnectException: Connection refused
	at java.net.PlainSocketImpl.socketConnect(Native Method)
	at java.net.AbstractPlainSocketImpl.doConnect(AbstractPlainSocketImpl.java:339)
	at java.net.AbstractPlainSocketImpl.connectToAddress(AbstractPlainSocketImpl.java:200)
	at java.net.AbstractPlainSocketImpl.connect(AbstractPlainSocketImpl.java:182)
	at java.net.SocksSocketImpl.connect(SocksSocketImpl.java:392)
	at java.net.Socket.connect(Socket.java:579)
	at sun.net.NetworkClient.doConnect(NetworkClient.java:175)
	at sun.net.www.http.HttpClient.openServer(HttpClient.java:378)
	at sun.net.www.http.HttpClient.openServer(HttpClient.java:473)
	at sun.net.www.http.HttpClient.<init>(HttpClient.java:203)
	at sun.net.www.http.HttpClient.New(HttpClient.java:290)
	at sun.net.www.http.HttpClient.New(HttpClient.java:306)
	at sun.net.www.protocol.http.HttpURLConnection.getNewHttpClient(HttpURLConnection.java:995)
	at sun.net.www.protocol.http.HttpURLConnection.plainConnect(HttpURLConnection.java:931)
	at sun.net.www.protocol.http.HttpURLConnection.connect(HttpURLConnection.java:849)
	at sun.net.www.protocol.http.HttpURLConnection.getOutputStream(HttpURLConnection.java:1090)
	at org.apache.qpid.systest.rest.RestTestHelper.writeJsonRequest(RestTestHelper.java:234)
	at org.apache.qpid.systest.rest.RestTestHelper.submitRequest(RestTestHelper.java:508)
	at org.apache.qpid.systest.rest.RestTestHelper.submitRequest(RestTestHelper.java:522)
	at org.apache.qpid.server.store.berkeleydb.replication.BDBHAVirtualHostNodeRestTest.createHANode(BDBHAVirtualHostNodeRestTest.java:317)
	at org.apache.qpid.server.store.berkeleydb.replication.BDBHAVirtualHostNodeRestTest.testIntruderBDBHAVHNNotAllowedToConnect(BDBHAVirtualHostNodeRestTest.java:232)

Running org.apache.qpid.server.store.berkeleydb.BDBBackupTest
Tests run: 0, Failures: 0, Errors: 0, Skipped: 0, Time elapsed: 0 sec - in org.apache.qpid.server.store.berkeleydb.BDBBackupTest

Results :

Failed tests: 
  TwoNodeTest>QpidTestCase.run:148->QpidBrokerTestCase.runBare:272->setUp:55 null
  TwoNodeTest>QpidTestCase.run:148->QpidBrokerTestCase.runBare:272->setUp:55 null
  TwoNodeTest>QpidTestCase.run:148->QpidBrokerTestCase.runBare:272->setUp:55 null
  TwoNodeTest>QpidTestCase.run:148->QpidBrokerTestCase.runBare:272->setUp:55 null
  TwoNodeTest>QpidTestCase.run:148->QpidBrokerTestCase.runBare:272->setUp:55 null
  TwoNodeTest>QpidTestCase.run:148->QpidBrokerTestCase.runBare:272->setUp:55 null
  TwoNodeTest>QpidTestCase.run:148->QpidBrokerTestCase.runBare:272->setUp:55 null
  MultiNodeTest>QpidTestCase.run:148->QpidBrokerTestCase.runBare:272->setUp:81 null
  MultiNodeTest>QpidTestCase.run:148->QpidBrokerTestCase.runBare:272->setUp:81 null
  MultiNodeTest>QpidTestCase.run:148->QpidBrokerTestCase.runBare:272->setUp:81 null
  MultiNodeTest>QpidTestCase.run:148->QpidBrokerTestCase.runBare:272->setUp:81 null
  MultiNodeTest>QpidTestCase.run:148->QpidBrokerTestCase.runBare:272->setUp:81 null
  MultiNodeTest>QpidTestCase.run:148->QpidBrokerTestCase.runBare:272->setUp:81 null
  MultiNodeTest>QpidTestCase.run:148->QpidBrokerTestCase.runBare:272->setUp:81 null
  MultiNodeTest>QpidTestCase.run:148->QpidBrokerTestCase.runBare:272->setUp:81 null
  MultiNodeTest>QpidTestCase.run:148->QpidBrokerTestCase.runBare:272->setUp:81 null
  MultiNodeTest>QpidTestCase.run:148->QpidBrokerTestCase.runBare:272->setUp:81 null

Tests in error: 
  JMXManagementTest>QpidTestCase.run:148->QpidBrokerTestCase.runBare:272->testRemoveRemoteNodeFromGroup:164->getStoreBeanForNodeAtBrokerPort:276
» IO
  JMXManagementTest>QpidTestCase.run:148->QpidBrokerTestCase.runBare:272->testVirtualHostOperationsDeniedForNonMasterNode:187->getManagedBrokerBeanForNodeAtBrokerPort:283
» IO
  JMXManagementTest>QpidTestCase.run:148->QpidBrokerTestCase.runBare:272->testStateOfNonActiveBrokerIsNotMaster:133->getStoreBeanForNodeAtBrokerPort:276
» IO
  JMXManagementTest>QpidTestCase.run:148->QpidBrokerTestCase.runBare:272->testStateOfActiveBrokerIsMaster:125->getStoreBeanForNodeAtBrokerPort:276
» IO
  JMXManagementTest>QpidTestCase.run:148->QpidBrokerTestCase.runBare:272->testVirtualHostMbeanOnMasterTransfer:225->getManagedBrokerBeanForNodeAtBrokerPort:283
» IO
  JMXManagementTest>QpidTestCase.run:148->QpidBrokerTestCase.runBare:272->testGroupMembers:142->getStoreBeanForNodeAtBrokerPort:276
» IO
  JMXManagementTest>QpidTestCase.run:148->QpidBrokerTestCase.runBare:272->testReadonlyMBeanAttributes:111->getStoreBeanForNodeAtBrokerPort:276
» IO
  BDBHAVirtualHostRestTest>QpidTestCase.run:148->QpidBrokerTestCase.runBare:272->testSetLocalTransactionSynchronizationPolicy:116->QpidRestTestCase.waitForAttributeChanged:114
» Connect
  BDBHAVirtualHostRestTest>QpidTestCase.run:148->QpidBrokerTestCase.runBare:272->testMutateState:140->QpidRestTestCase.waitForAttributeChanged:114
» Connect
  BDBHAVirtualHostRestTest>QpidTestCase.run:148->QpidBrokerTestCase.runBare:272->testSetRemoteTransactionSynchronizationPolicy:128->QpidRestTestCase.waitForAttributeChanged:114
» Connect
  BDBHAVirtualHostNodeRestTest>QpidTestCase.run:148->QpidBrokerTestCase.runBare:272->testNewMasterElectedWhenVirtualHostIsStopped:135->createHANode:317
» Connect
  BDBHAVirtualHostNodeRestTest>QpidTestCase.run:148->QpidBrokerTestCase.runBare:272->testMutateStateOfOneNode:103->createHANode:317
» Connect
  BDBHAVirtualHostNodeRestTest>QpidTestCase.run:148->QpidBrokerTestCase.runBare:272->testIntruderProtection:252->createHANode:317
» Connect
  BDBHAVirtualHostNodeRestTest>QpidTestCase.run:148->QpidBrokerTestCase.runBare:272->testDeleteMasterNode:192->createHANode:317
» Connect
  BDBHAVirtualHostNodeRestTest>QpidTestCase.run:148->QpidBrokerTestCase.runBare:272->testCreate3NodeGroup:92->createHANode:317
» Connect
  BDBHAVirtualHostNodeRestTest>QpidTestCase.run:148->QpidBrokerTestCase.runBare:272->testDeleteReplicaNode:166->createHANode:317
» Connect
  BDBHAVirtualHostNodeRestTest>QpidTestCase.run:148->QpidBrokerTestCase.runBare:272->testIntruderBDBHAVHNNotAllowedToConnect:232->createHANode:317
» Connect

Tests run: 42, Failures: 17, Errors: 17, Skipped: 0

[INFO] ------------------------------------------------------------------------
[INFO] Reactor Summary:
[INFO] 
[INFO] Qpid Java Build ................................... SUCCESS [2.288s]
[INFO] Qpid AMQP 1.0 Common .............................. SUCCESS [5.118s]
[INFO] Qpid AMQP 1.0 Client .............................. SUCCESS [0.794s]
[INFO] Qpid AMQP 1.0 Client JMS .......................... SUCCESS [1.664s]
[INFO] Qpid AMQP 1.0 JMS Client Examples ................. SUCCESS [0.209s]
[INFO] Qpid AMQP 1.0 Client WebSocket .................... SUCCESS [0.529s]
[INFO] Qpid Broker Code Generation ....................... SUCCESS [0.265s]
[INFO] Qpid Test Utilities ............................... SUCCESS [0.253s]
[INFO] Qpid Common ....................................... SUCCESS [29.994s]
[INFO] Qpid Management Common ............................ SUCCESS [1.068s]
[INFO] Qpid Java Broker Core ............................. SUCCESS [1:22.105s]
[INFO] Qpid Access Control Broker Plug-in ................ SUCCESS [3.824s]
[INFO] Qpid AMQP 0-8 Protocol Broker Plug-in ............. SUCCESS [20.300s]
[INFO] Qpid AMQP 0-10 Protocol Plug-in ................... SUCCESS [4.201s]
[INFO] Qpid AMQP 1-0 Protocol Broker Plug-in ............. SUCCESS [0.485s]
[INFO] Qpid AMQP 0-8 to 0-10 Message Conversion Broker Plug-in  SUCCESS [0.256s]
[INFO] Qpid AMQP 0-8 to 1-0 Message Conversion Broker Plug-in  SUCCESS [0.343s]
[INFO] Qpid AMQP 0-10 to 1-0 Message Conversion Broker Plug-in  SUCCESS [0.302s]
[INFO] Qpid Derby Message Store .......................... SUCCESS [15.694s]
[INFO] Qpid JDBC Message Store Connection Pooling Plug-in  SUCCESS [0.245s]
[INFO] Qpid JDBC Message Store Broker Plug-in ............ SUCCESS [9.057s]
[INFO] Qpid HTTP Management Broker Plug-in ............... SUCCESS [4.784s]
[INFO] Qpid JMX Management Broker Plug-in ................ SUCCESS [3.171s]
[INFO] Qpid Memory Message Store Broker Plug-in .......... SUCCESS [0.295s]
[INFO] Qpid WebSocket Broker Plug-in ..................... SUCCESS [0.228s]
[INFO] Qpid AMQP 0-x JMS Client .......................... SUCCESS [5.958s]
[INFO] Qpid BDB Message Store ............................ SUCCESS [2:14.805s]
[INFO] Qpid BDB Message Store JMX ........................ SUCCESS [1.899s]
[INFO] Qpid Java Broker .................................. SUCCESS [4.608s]
[INFO] Qpid AMQP Management Protocol Broker Plug-in ...... SUCCESS [0.213s]
[INFO] Qpid AMQP 0-x JMS Client Examples ................. SUCCESS [0.139s]
[INFO] Qpid JCA .......................................... SUCCESS [1.526s]
[INFO] Qpid Resource Adaptor ............................. SUCCESS [0.407s]
[INFO] Qpid Tools ........................................ SUCCESS [0.360s]
[INFO] Qpid Management Examples .......................... SUCCESS [0.124s]
[INFO] Qpid Java System Test Parent ...................... SUCCESS [0.707s]
[INFO] Qpid System Tests ................................. SUCCESS [5:49.439s]
[INFO] Qpid Performance Tests ............................ SUCCESS [12.803s]
[INFO] Qpid Performance Test System Tests ................ SUCCESS [16.304s]
[INFO] Qpid Performance Tests Visualisation JFC .......... SUCCESS [3.922s]
[INFO] Qpid BDB Store System Tests ....................... FAILURE [5.250s]
[INFO] ------------------------------------------------------------------------
[INFO] BUILD FAILURE
[INFO] ------------------------------------------------------------------------
[INFO] Total time: 12:07.016s
[INFO] Finished at: Fri Feb 06 01:48:08 UTC 2015
[INFO] Final Memory: 73M/391M
[INFO] ------------------------------------------------------------------------
[ERROR] Failed to execute goal org.apache.maven.plugins:maven-surefire-plugin:2.16:test (integration-test)
on project qpid-bdbstore-systests: There are test failures.
[ERROR] 
[ERROR] Please refer to <https://builds.apache.org/job/Qpid-Java-Cpp-Test/ws/trunk/qpid/java/bdbstore/systests/target/surefire-reports>
for the individual test results.
[ERROR] -> [Help 1]
[ERROR] 
[ERROR] To see the full stack trace of the errors, re-run Maven with the -e switch.
[ERROR] Re-run Maven using the -X switch to enable full debug logging.
[ERROR] 
[ERROR] For more information about the errors and possible solutions, please read the following
articles:
[ERROR] [Help 1] http://cwiki.apache.org/confluence/display/MAVEN/MojoFailureException
[ERROR] 
[ERROR] After correcting the problems, you can resume the build with the command
[ERROR]   mvn <goals> -rf :qpid-bdbstore-systests
Build step 'Invoke top-level Maven targets' marked build as failure
[locks-and-latches] Releasing all the locks
[locks-and-latches] All the locks released
Recording test results

Mime
View raw message